{"text_format":"1","workbook":"xlsx","n_sheets":22,"sheets":["Part 1","Part 1 Cont'd","Part 2","Part2A Deductible","Part 3","Part 5","Personnel Sheet","Soil-Water Disposal","Data","Equipment Rent - Purchase","Hotel & Food","Travel","Transportation&Shipping","Drilling-P&A","Analysis","Miscellaneous 1","Miscellaneous 2","Miscellaneous 3","Miscellaneous 4","Part 6","Part 7","Part 8"],"not_rendered":{"charts":0,"images":271,"macros":1,"external_links":0,"defined_names":18,"comments":12,"pivot_tables":0},"unopened":[],"bounds":{"document_bytes":16777216,"sheet_cells":100000,"rows_first":2000,"rows_last":500,"rows_between":2000,"halvings":0,"cell_chars":16384,"cell_head_chars":4096},"cells_cut":0,"cells_raw":0,"read":"whole","date_system":"1900"}

{"sheet":"Part 1","index":0,"n_rows":47,"n_cols":11,"rows_kept":47,"cut":false,"hidden":false,"merged":[[30,2,30,3],[23,2,24,3],[23,0,24,1],[23,4,24,5],[31,5,32,7],[46,0,46,7],[36,0,36,7],[37,0,37,7],[38,0,38,7],[39,0,39,7],[40,0,40,7],[42,0,42,6],[44,5,45,7],[0,0,0,7],[1,0,1,7],[2,0,2,7],[3,0,3,7],[4,0,4,3],[4,4,6,7],[34,2,34,3],[18,4,18,7],[20,4,20,7],[19,4,19,7],[21,4,21,7],[22,4,22,5],[21,0,21,3],[27,0,27,1],[20,0,20,3],[25,0,25,2],[19,0,19,3],[23,6,23,7],[24,6,24,7],[22,6,22,7],[22,2,22,3],[22,0,22,1],[31,10,32,10],[11,0,11,7],[6,1,6,3],[7,0,7,7],[8,0,8,7],[9,0,9,7],[10,0,10,7],[12,0,12,7],[13,0,13,7],[14,0,14,7],[15,0,15,7],[18,0,18,3],[16,3,17,7],[32,2,32,3],[28,2,28,3],[26,0,26,7]]}
["LOUISIANA MOTOR FUELS UNDERGROUND STORAGE TANK"]
["TRUST FUND REIMBURSEMENT APPLICATION"]
["PART 1"]
["SITE IDENTIFICATION"]
["FOR DEQ OFFICE USE ONLY         ",null,null,null,"DATE RECEIVED/DATE TO BE ENTERED ON EDMS"]
["TF No.",null,"Reviewer’s\nDue Date"]
["Reviewer Name"]
["APPLICATIONS WILL BE RETURNED/REJECTED FOR ANY OF THE FOLLOWING REASONS:"]
["1.  Proof of payment of the appropriate deductible is not provided."]
["2.  The application addresses invoices for a prior period of time (Ex.:  On 7/15/2011 an applicant submits an application "]
["     for 7/1/2009 - 9/30/2009 invoices, when an application for 10/1/2010 - 12/31/2010 invoices was previously submitted"]
["     on 1/15/2011). Note exception identified in B.1 below."]
["3.  Application is submitted with incorrect and/or insufficient documentation."]
["4.  Charges in the application exceed the cumulative Corrective Action Plan budget as approved by the Department."]
["     Applications shall be returned to the party receiving reimbursement for the reasons outlined in the MFTF"]
["     Guidance Document in section I.C.12.d.  "]
[null,null,null,{"$f":"IF(OR(A20=\"\",E20=\"\",A22=\"\",E22=\"\",A24=\"\",C24=\"\",E24=\"\",AND(J24=FALSE,J25=FALSE)),\"MISSING INFORMATION\",\"\")","v":"MISSING INFORMATION"}]
["A. SITE/OWNER INFORMATION"]
["Site Name – Current Name",null,null,null,"Name of Responsible Party as Identified in Part 2 - Affidavit"]
[]
["Site Street Address – Physical Address, Not P.O. Box",null,null,null,"DEQ Issued Owner Identification Number of Responsible Party"]
[]
["City",null,"Parish",null,"DEQ Issued \nAgency Interest No.",null,"No. of tanks owned in La.\nat time of incident by\nresponsible party",null,null,"Annual Agg"]
[null,null,null,null,null,null,null,null,null,false]
[null,null,null,null,null,null,null,null,null,false]
["B.  APPLICATION INFORMATION"]
["1.   This application includes ALL INVOICES to the owner (responsible party) dated from: [Check appropriate quarter(s)"]
["      and indicate year(s)]:",null,null,null,null,null,null,null,null,"Quarters","Fiscal Years"]
[null,null,null,null,null,null,null,null,null,false]
[]
[null,null,null,null,null,null,null,null,null,false]
[null,null,null,null,null,{"$f":"IF(OR(AND(E29=\"\",E31=\"\",E33=\"\",E35=\"\"),OR(AND(E29>0,J29=FALSE),AND(E29=\"\",J29=TRUE),AND(E31>0,J31=FALSE),AND(E31=\"\",J31=TRUE),AND(E33>0,J33=FALSE),AND(E33=\"\",J33=TRUE),AND(E35>0,J35=FALSE),AND(E35=\"\",J35=TRUE))),\"MISSING INFORMATION\",IF(OR(AND(AND(E29>0,E31>0),E31-E29<>0),AND(AND(E29>0,E33>0),E33-E29<>1),AND(AND(E31>0,E33>0),E33-E31<>1),AND(AND(E29>0,E35>0),E35-E29<>1),AND(AND(E31>0,E35>0),E35-E31<>1),AND(AND(E33>0,E35>0),E35-E33<>0)),\"APP CROSSES FISCAL YEARS\",\"\"))","v":"MISSING INFORMATION"},null,null,null,null,{"$f":"IF(F32=\"APP CROSSES FISCAL YEARS\", TRUE,FALSE)","v":false}]
[null,null,null,null,null,null,null,null,null,false]
[]
[null,null,null,null,null,null,null,null,null,false]
[]
["Application requests must include all invoices dated during at least one calendar quarter:  July through September, October through December, January through March, or"]
["April through June.  A single application may include invoices which cover more than one calendar quarter, provided the application includes all invoice for the entire"]
["calendar quarter or quarters.  However, all multiple calendar quarter invoices must be dated within a single state fiscal year, July 1 - June 30. Once an application is submitted"]
["to DEQ, invoices for the period submitted or any prior periods WILL NOT be accepted.  Overlapping \"Work Performed\" dates in subsequent applications is not permitted."]
["When the RAC for a site changes during a quarter, two separate applications addressing each RAC's work should be submitted."]
[]
["2.     Application Grand Total (Reflecting the eligible pre-approved costs shown on Part 5 of this application) :",null,null,null,null,null,null,{"$f":"'Part 5'!A3","v":0}]
["3.     If applicable, indicate the following:"]
[null,null,null,null,null,{"$f":"IF(J45<>'Part 3'!O17,\"FIRST APPLICATION INIDICATION BOXES ON PART 1 AND PART 3 DO NOT MATCH\",\"\")","v":""},null,null,null,false]
[null,null,null,null,null,null,null,null,null,false]
["(Any application submitted to the Trust Fund Management Section for work performed on or after July 1, 2012 must be submitted on this form.)"]

{"sheet":"Part 1 Cont'd","index":1,"n_rows":40,"n_cols":7,"rows_kept":40,"cut":false,"hidden":false,"merged":[[0,0,0,7],[2,0,2,1],[4,0,4,1],[36,5,36,7],[37,3,37,7],[4,2,4,5],[5,0,5,1],[8,0,8,1],[9,0,9,1],[10,0,10,1],[5,2,5,5],[8,2,8,5],[9,2,9,5],[34,0,34,2],[23,0,23,1],[26,0,26,7],[25,0,25,1],[23,6,23,7],[28,0,28,7],[18,2,18,5],[19,2,19,5],[20,2,20,5],[21,2,21,5],[22,2,22,5],[23,2,23,5],[18,0,18,1],[19,0,19,1],[20,0,20,1],[21,0,21,1],[22,0,22,1],[27,0,27,7],[20,6,20,7],[32,0,32,7],[29,0,29,7],[30,0,30,7],[31,0,31,7],[39,1,39,2],[35,0,35,2],[36,1,36,2],[37,1,37,2],[38,3,39,7],[36,3,36,4],[33,0,33,7],[34,5,35,7],[34,3,35,4],[38,1,38,2],[2,2,2,7],[4,6,4,7],[5,6,5,7],[8,6,8,7],[9,6,9,7],[3,0,3,7],[6,0,6,1],[6,2,6,5],[6,6,6,7],[10,2,10,5],[14,0,14,7],[10,6,10,7],[15,2,15,3],[7,0,7,1],[7,2,7,5],[7,6,7,7],[21,6,21,7],[15,4,15,5],[22,6,22,7],[13,0,13,7],[17,2,17,5],[17,0,17,1],[18,6,18,7],[19,6,19,7],[17,6,17,7]]}
["PART 1 (cont’d)"]
[]
["C. RELEASE INFORMATION",null,{"$f":"IF(AND(A6=\"\",A7=\"\",A8=\"\",A9=\"\",A10=\"\",A11=\"\"),\"MISSING INFORMATION\",\"\")","v":"MISSING INFORMATION"}]
[]
["Incident No(s).",null,"Date Released",null,null,null,"Substance(s) Released"]
[]
[]
[]
[]
[]
[]
[]
[]
["D. CORRECTIVE ACTION PLAN AND ADDENDUMS"]
[]
["CAP Submittal Date    ",null,"DEQ Approval Date ",null,null,null,"Approved Cost"]
[]
["Addendum Submittal Date",null,"DEQ Approval Date",null,null,null,"Approved Cost"]
[]
[]
[]
[]
[]
[]
[]
["I certify the following:"]
[" • I have reviewed the time sheets and the personnel charges and verify that they are in line with the duties indicated "]
["    in the UST Trust Fund Cost Control Guidance Document in effect at the time the work was performed;"]
[" • the rates identified in this application are in accordance with the response action contractor equipment rate sheet;"]
[" • the travel charges contained in this application are based on the mileage logs which indicate the person traveling, "]
["    distance traveled and beginning/ending odometer readings;"]
[" • I personally examined and am familiar with the information submitted with this application, and that I "]
["    believe that the submitted information is true, accurate and complete.   "]
[]
["Preparer’s Certification (Original Signature Required)                 ",null,null,"Date Signed"]
[{"$f":"IF(OR(AND(A6=\"\",A7=\"\",A8=\"\",A9=\"\",A10=\"\",A11=\"\"),OR(B37=\"\",F37=\"\",B38=\"\",B40=\"\",D39=\"\")),\"MISSING INFORMATION\",\"\")","v":"MISSING INFORMATION"}]
["Preparer’s Name",null,null,"Firm Name"]
["Telephone Number",null,null,"Mailing Address"]
["Telefax Number"]
["Email Address"]

{"sheet":"Part 2","index":2,"n_rows":50,"n_cols":14,"rows_kept":50,"cut":false,"hidden":false,"merged":[[43,10,43,11],[27,0,27,1],[31,0,31,11],[27,5,27,7],[36,8,36,11],[29,8,29,11],[29,0,29,7],[35,4,35,7],[35,0,35,3],[32,0,32,11],[33,0,33,11],[30,0,30,7],[30,8,30,11],[34,0,34,11],[28,4,28,11],[27,8,27,11],[49,1,49,6],[49,9,49,11],[35,8,35,10],[47,8,47,11],[39,0,39,11],[38,0,38,11],[43,0,43,5],[44,0,44,7],[46,0,46,5],[47,0,47,7],[46,8,46,11],[41,10,41,11],[41,5,41,6],[36,0,36,7],[37,0,37,7],[37,8,37,10],[15,0,15,11],[14,0,14,11],[13,0,13,11],[16,0,16,11],[23,9,23,11],[17,0,17,11],[19,0,19,11],[20,8,20,11],[21,8,21,11],[20,0,20,7],[18,0,18,11],[22,0,22,7],[21,0,21,7],[22,8,22,11],[23,0,23,7],[11,0,11,11],[10,0,10,11],[9,0,9,11],[8,0,8,11],[7,0,7,11],[0,0,0,11],[1,0,1,11],[5,0,5,11],[4,0,4,11],[3,0,3,11],[26,8,26,11],[27,2,27,3],[24,0,24,2],[24,3,24,5],[25,3,25,5],[25,0,25,2],[25,8,25,10],[24,8,24,10],[41,0,41,4],[28,0,28,3],[24,6,24,7],[25,6,25,7],[26,0,26,7]]}
["PART 2"]
["OWNER, OPERATOR, OR RESPONSIBLE PARTY CERTIFICATION AFFIDAVIT"]
[]
["         I certify that I have researched and determined that I have no assistance from private sources, such as"]
["insurance or other means of financial assurance, to pay for investigation or remediation costs at this site. I also"]
["certify that all oustanding financial obligations integral to this site investigation/remediation have been met."]
[]
["         I certify that this program task has been completed in accordance with La. R.S. 30:2194 et seq and"]
["La R.S. 30:2195 et seq. I have reviewed and certify that all data and documentation represented on invoices listed in"]
["section D are a true and correct representation of costs actually incurred as an integral part of site rehabilitation from"]
["motor fuel contamination and that reimbursement from the Motor Fuels Underground Storage Tank Trust Fund has"]
["not been received on any of the charges identified in this application."]
[]
["        The site owner, operator, or responsible party warrants that he has not received any fee, commission,"]
["percentage, gift, or other  consideration as a result of his employment of a person, company, corporation,"]
["individual, or firm for purposes of conducting the site assessment or rehabilitation."]
["If charges within this application are being applied toward the deductible(s), the following statement must be certified by checking the box below: "]
["       I also certify that I have paid the appropriate deductible integral to this site rehabilitation program and that proof of payment of the"]
["deductible [canceled checks and a list of corresponding invoices or Proof of Payment of Deductible Affidavit (Part 2A)] is attached."]
[]
["A. Site Owner, Operator, Responsible Party",null,null,null,null,null,null,null,"  I. Site Name"]
[{"$f":"IF('Part 1'!E20=\"\",\"\",'Part 1'!E20)","v":""},null,null,null,null,null,null,null,{"$f":"IF('Part 1'!A20>0,'Part 1'!A20,\"\")","v":""}]
["B. Mailing Address                                                                           ",null,null,null,null,null,null,null,"  J. Site Address"]
[null,null,null,null,null,null,null,null,"Physical Address:",{"$f":"IF('Part 1'!A22>0,'Part 1'!A22,\"\")","v":""}]
["City",null,null,"State",null,null,"Zip",null,"City",null,null,"Parish"]
[null,null,null,null,null,null,null,null,{"$f":"IF('Part 1'!A24>0,'Part 1'!A24,\"\")","v":""},null,null,{"$f":"IF('Part 1'!C24>0,'Part 1'!C24,\"\")","v":""}]
["C. Telephone/Telefax Numbers  ",null,null,null,null,null,null,null,"K. Agency Interest Number"]
["Telephone: ",null,null,null,"Telefax:",null,null,null,{"$f":"IF('Part 1'!E24>0,'Part 1'!E24,\"\")","v":""}]
["D.   RAC/Owner Invoice Nos.",null,null,null,{"$f":"CONCATENATE('Part 6'!R11,'Part 6'!R12,'Part 6'!R13,'Part 6'!R14,'Part 6'!R15,'Part 6'!R16,'Part 6'!R17,'Part 6'!R18,'Part 6'!R19,'Part 6'!R20,'Part 6'!R21,'Part 6'!R22,'Part 6'!R23,'Part 6'!R24,'Part 6'!R25,'Part 6'!R26,'Part 6'!R27,'Part 6'!R28,'Part 6'!R29,'Part 6'!R30,)","v":""}]
["E. Signature of person designated to sign for the owner, operator, or responsible party",null,null,null,null,null,null,null," L. Federal Tax ID# if applicable\n      (SSN not applicable)"]
[]
["F. Check the appropriate box below.  The contract for work addressed in this application was signed:"]
["        Before August 1, 1995, the owner/operator/responsible party receives reimbursement.",null,null,null,null,null,null,null,null,null,null,null,null,false]
["       On or after August 1, 1995, and as required by Act 336 of the 1995 Regular Session, the RAC receives reimbursement",null,null,null,null,null,null,null,null,null,null,null,null,false]
["G. Invoices to the owner (responsible party) addressed in this application are dated for the following quarters:  [Check appropriate quarter(s) and indicate year(s)] "]
["      July 1,          -Sept 30,          .",null,null,null,"       Oct. 1,           -Dec. 31,            .",null,null,null,"      Jan 1,           - Mar 31,           .",null,null,"      Apr 1,          - June 30,            ."]
["H. Program Grand Task Total Addressed in Part 1, Part 3 and Part 5:",null,null,null,null,null,null,null,{"$f":"'Part 5'!A3","v":0}]
["       Before me, the undersigned notary public, came and appeared ",null,null,null,null,null,null,null,null,null,null,"(please print or type the name"]
["shown in E above), who, being known to me, did execute the foregoing certification affidavit in my presence, who, being duly sworn,"]
["did state under oath or affirmation that he/she executed said document for the purpose expressed therein."]
[]
["WITNESS my hand and official seal, this",null,null,null,null,null,null,"day of,",null,","]
[]
[null,null,null,null,null,null,null,null,"My commission expires"]
["Notary Public (Signature)"]
[]
[]
["Notary Public Name (Printed, typed, or stamped)",null,null,null,null,null,null,null,"Notary # or Bar Roll #( if a Louisiana notary)"]
[]
["State of",null,null,null,null,null,null,null,"County or Parish of "]

{"sheet":"Part2A Deductible","index":3,"n_rows":42,"n_cols":14,"rows_kept":42,"cut":false,"hidden":false,"merged":[[24,0,24,1],[28,4,28,8],[24,2,24,4],[29,0,29,10],[30,0,30,10],[25,9,25,10],[28,9,28,10],[15,0,15,1],[14,0,14,1],[16,0,16,1],[17,0,17,1],[32,0,32,2],[25,0,25,8],[26,0,27,10],[18,0,18,1],[20,2,20,4],[18,2,18,4],[19,0,19,1],[20,0,20,1],[21,0,21,1],[22,0,22,1],[32,6,32,8],[32,3,32,4],[16,9,16,10],[17,9,17,10],[14,2,15,4],[17,2,17,4],[16,2,16,4],[16,5,16,8],[17,5,17,8],[23,5,23,8],[23,2,23,4],[18,9,18,10],[19,9,19,10],[18,5,18,8],[20,9,20,10],[19,5,19,8],[10,0,10,10],[12,9,12,10],[39,8,39,10],[39,1,39,3],[34,6,34,9],[39,6,39,7],[36,6,36,10],[37,6,37,10],[35,0,35,10],[34,0,34,4],[36,0,36,4],[37,0,37,4],[23,9,23,10],[24,9,24,10],[23,0,23,1],[24,5,24,8],[0,0,0,10],[1,0,1,10],[2,0,2,10],[4,0,4,10],[9,0,9,10],[5,6,5,10],[5,2,5,5],[6,0,6,10],[8,0,8,10],[11,0,11,10],[12,0,12,4],[22,5,22,8],[21,5,21,8],[21,9,21,10],[22,9,22,10],[22,2,22,4],[21,2,21,4],[19,2,19,4],[20,5,20,8],[12,5,12,8],[13,5,13,8],[14,5,15,8],[13,0,13,4],[13,9,13,10],[14,9,15,10]]}
["PART 2.A"]
["PROOF OF PAYMENT OF DEDUCTIBLE AFFIDAVIT"]
["(To be completed by Response Action Contractor)"]
[]
["I,                                            (signature of principal or his designee for the response action contractor) certify"]
["that payments were made to",null,null,null,null,null," (name of response action contractor) in the"]
["amounts specified below, which were integral to the investigation/remediation of the below specified site."]
[]
["A. Name of Site"]
[{"$f":"IF('Part 1'!A20>0,'Part 1'!A20,\"\")","v":""}]
["B. Site Address (Physical address, city)"]
[{"$f":"IF('Part 1'!A22>0,'Part 1'!A22&\"  \"&'Part 1'!A24,\"\")","v":""}]
["C. Parish",null,null,null,null,"D.  Site AI No.",null,null,null,"E. Incident #"]
[{"$f":"IF('Part 1'!C24>0,'Part 1'!C24,\"\")","v":""},null,null,null,null,{"$f":"IF('Part 1'!E24>0,'Part 1'!E24,\"\")","v":""}]
["Invoice No",null,"Date of Payment Received",null,null,"Check No.",null,null,null,"Amount"]
["(As contained in application)",null,null,null,null,null,null,null,null,null,null,null,null,{"$f":"IF(J26>0,1,0)","v":0}]
[]
[]
[]
[]
[]
[]
[]
[]
[]
["Total Deductible Amount Addressed in Affidavit",null,null,null,null,null,null,null,null,{"$f":"SUM(J17:K25)","v":0}]
[{"$f":"IF(OR(C6=\"\",J14=\"\",AND(OR(A17=\"\",C17=\"\",F17=\"\",J17=\"\"),OR(A18=\"\",C18=\"\",F18=\"\",J18=\"\"),OR(A19=\"\",C19=\"\",F19=\"\",J19=\"\"),OR(A20=\"\",C20=\"\",F20=\"\",J20=\"\"),OR(A21=\"\",C21=\"\",F21=\"\",J21=\"\"),OR(A22=\"\",C22=\"\",F22=\"\",J22=\"\"),OR(A23=\"\",C23=\"\",F23=\"\",J23=\"\"),OR(A24=\"\",C24=\"\",F24=\"\",J24=\"\"),OR(A25=\"\",C25=\"\",F25=\"\",J25=\"\"))),\"MISSING INFORMATION\",\"\")","v":"MISSING INFORMATION"}]
[]
["Before me, the undersigned notary public, came and appeared",null,null,null,null,null,null,null,null,"(please print or type the name"]
["shown in first Paragraph), who, being known to me, did execute the foregoing certification affidavit in my presence, and who, being"]
["duly sworn, did state under oath or affirmation that he/she executed said document for the purpose expressed therein."]
[]
["WITNESS my hand and official seal, this",null,null,null,null,"day of,",null,null,null,","]
[]
[null,null,null,null,null,null,"My commission expires"]
["Notary Public (Signature)"]
[]
["Notary Public Name (Printed, typed, or stamped)",null,null,null,null,null,"Notary # or Bar Roll #( if a Louisiana notary)"]
[]
["State of",null,null,null,null,null,"County or Parish of"]
[]
[null,null,null,null,null,null,null," "]

{"sheet":"Part 3","index":4,"n_rows":49,"n_cols":20,"rows_kept":49,"cut":false,"hidden":false,"merged":[[19,0,19,5],[26,0,26,5],[34,0,34,2],[23,2,23,4],[25,0,25,5],[29,0,29,5],[30,0,30,12],[31,0,31,12],[32,0,32,12],[33,0,33,12],[34,6,34,10],[29,6,29,12],[20,0,20,5],[20,6,20,12],[21,0,21,5],[21,6,21,12],[22,0,22,5],[27,6,28,12],[25,6,25,12],[26,6,26,12],[23,0,23,1],[22,8,22,12],[22,6,22,7],[15,0,15,12],[16,0,16,12],[17,0,17,12],[18,0,18,5],[18,6,18,12],[48,1,48,4],[48,6,48,8],[48,9,48,12],[7,0,7,12],[0,0,0,12],[1,0,1,12],[3,0,3,12],[4,0,4,12],[5,0,5,12],[6,0,6,12],[8,0,8,12],[10,0,10,12],[11,0,11,12],[12,0,12,12],[13,0,13,12],[14,0,14,12],[45,6,45,12],[46,6,46,12],[46,0,46,5],[45,0,45,4],[35,6,35,12],[35,0,35,5],[43,0,43,5],[37,0,37,12],[38,0,38,12],[42,0,42,4],[36,0,36,5],[36,6,36,10],[42,6,42,9],[42,10,42,12],[34,11,34,12],[40,4,40,5],[40,7,40,10],[36,11,36,12],[24,0,24,1],[34,3,34,5],[24,2,24,4],[40,0,40,3],[27,0,28,5],[23,6,24,7],[23,8,24,12]]}
["PART 3"]
["RESPONSE ACTION CONTRACTOR CERTIFICATION AFFIDAVIT"]
[]
["        I certify that this program task has been completed in accordance with La. R.S. 30:2194 et seq and La. R.S. 30:2195 et seq."]
[" I have reviewed and certify that all data and documentation submitted as part of this reimbursement application are a true and"]
["correct representation of costs actually incurred as an integral part of site rehabilitation from motor fuel contamination. I also"]
["certify that  reimbursement from the Motor Fuels Underground Storage Tank Trust Fund has not been received on any of the "]
["charges identified in this application.  I agree to reimburse the owner, operator, or the responsible party of the referenced site"]
[" any monies due to him upon reimbursement from the Motor Fuels Underground Storage Tank Trust Fund."]
[]
["      The person responsible for conducting site rehabilitation warrants that he/she has not received any fee, commission,"]
[" percentage, gift, or other consideration as a result of his employment of a person, company, corporation, individual, firm, or "]
["other legal entity for purposes of conducting the site assessment or rehabilitation.  Copies of mileage logs, detailed timesheets"]
[" and RAC equipment rental rates sheets will be maintained for a period of four years following reimbursement for auditing"]
[" purposes and will be readily available upon request by the DEQ or a DEQ contractor."]
["If charges within this application are being applied toward the deductible(s), the following statement must be certified by checking the box below: "]
["       I certify that I have received payment for the appropriate deductible integral to the assessment/remediation of this site.",null,null,null,null,null,null,null,null,null,null,null,null,null,false]
[{"$f":"IF(O17<>'Part 1'!J45,\"FIRST APPLICATION INIDICATION BOXES ON PART 1 AND PART 3 DO NOT MATCH\",\"\")","v":""}]
["A.    Name principal/president of the company responsible for",null,null,null,null,null," H. Company Name"]
["       conducting the site assessment/rehabilitation"]
[]
["B. Mailing Address                                                                           ",null,null,null,null,null," I.  Response Action Contractor Telephone/Telefax Numbers"]
[null,null,null,null,null,null,"Telephone:"]
["City: ",null,"State:",null,null,"Zip: ","Telefax:"]
[]
["C.  Facility Name",null,null,null,null,null,"J.  Agency Interest Number",null,null,null,null,null,null,null,null,null,null,null,null,"  "]
[{"$f":"IF('Part 1'!A20>0,'Part 1'!A20,\"\")","v":""},null,null,null,null,null,{"$f":"IF('Part 1'!E24>0,'Part 1'!E24,\"\")","v":""}]
["D. Signature of the principal/president of the company or his  designee responsible for conducting site assessment/rehabilitation",null,null,null,null,null,"  K.  Federal Tax ID# if applicable"]
[]
[{"$f":"IF(OR(A18<>\"\",A21=\"\",G21=\"\",A23=\"\",I23=\"\",A25=\"\",A27=\"\",G27=\"\",C25=\"\",F25=\"\",AND(O32=FALSE,O33=FALSE),AND(O35=FALSE,P35=FALSE,Q35=FALSE,R35=FALSE),G36=0),\"MISSING INFORMATION\",\"\")","v":"MISSING INFORMATION"}]
["E. Check appropriate box below.  The contract for work addressed in this application was signed:"]
["        Before August 1, 1995, the owner/operator/responsible party receives reimbursement.",null,null,null,null,null,null,null,null,null,null,null,null,null,false]
["       On or after August 1, 1995, and as required by Act 336 of the 1995 Regular Session, the RAC receives reimbursement",null,null,null,null,null,null,null,null,null,null,null,null,null,false]
["F. Invoices to the owner (responsible party) addressed in this application are dated for the following quarters:  [Check appropriate quarter(s) and indicate year(s)]"]
["      July 1,          - Sept 30,            .",null,null,"      Oct. 1,          - Dec. 31,           .",null,null,"     Jan 1,            - Mar 31,             .",null,null,null,null,"     Apr 1,         - June 30,         .",null,null,{"$f":"'Part 1'!J29","v":false},{"$f":"'Part 1'!J31","v":false},{"$f":"'Part 1'!J33","v":false},{"$f":"'Part 1'!J35","v":false}]
["G. Program Grand Task Total Addressed in Part 1, Part 2 and Part 5:",null,null,null,null,null,{"$f":"'Part 5'!A3","v":0}]
["      Before me, the undersigned notary public, came and appeared",null,null,null,null,null,null,null,null,null,null,"(please print or type the name"]
["shown in D above), who, being known to me, did execute the foregoing certification affidavit in my presence, who, being duly sworn,"]
["did state under oath or affirmation that he/she executed said document for the purpose expressed therein."]
[]
["WITNESS my hand and official seal, this",null,null,null,null,null,"day of,",null,null,null,null,","]
[]
[null,null,null,null,null,null,"My commission expires "]
["Notary Public (Signature)"]
[]
[]
["Notary Public Name (Printed, Typed, or Stamped)",null,null,null,null,null,"                Notary # or Bar Roll #( if a Louisiana notary)"]
[]
["State of",null,null,null,null,null,"County or Parish of"]

{"sheet":"Part 5","index":5,"n_rows":29,"n_cols":20,"rows_kept":29,"cut":false,"hidden":false,"merged":[[16,0,16,3],[16,4,16,8],[27,10,28,11],[27,4,28,5],[27,0,28,1],[27,2,28,3],[27,6,28,9],[27,15,28,16],[11,0,11,1],[12,0,12,1],[13,0,13,1],[13,7,13,9],[25,1,25,5],[14,0,15,3],[13,3,13,4],[14,4,14,5],[14,6,14,8],[15,6,15,8],[15,4,15,5],[22,4,22,5],[23,4,23,5],[24,4,24,5],[20,9,20,10],[21,9,21,10],[5,2,6,2],[2,5,2,9],[4,3,4,4],[4,5,4,6],[11,7,11,9],[10,7,10,9],[9,7,9,9],[8,7,8,9],[12,7,12,9],[5,5,6,6],[12,3,12,4],[11,3,11,4],[10,3,10,4],[9,3,9,4],[8,3,8,4],[7,5,7,6],[8,5,8,6],[12,5,12,6],[7,7,7,9],[3,3,3,4],[3,5,3,6],[7,3,7,4],[3,14,3,15],[3,12,3,13],[7,12,7,13],[8,12,8,13],[9,12,9,13],[10,12,10,13],[11,12,11,13],[12,12,12,13],[7,14,7,15],[8,14,8,15],[9,14,9,15],[10,14,10,15],[11,14,11,15],[12,14,12,15],[0,0,0,19],[1,8,1,11],[2,10,2,11],[2,16,2,19],[5,0,5,1],[5,11,6,11],[5,10,6,10],[2,2,2,4],[6,0,6,1],[4,7,4,9],[1,0,1,1],[1,3,1,7],[3,18,3,19],[3,16,3,17],[4,16,4,17],[5,16,6,17],[2,12,2,15],[1,12,1,19],[5,14,6,15],[5,12,6,13],[5,7,6,9],[5,3,6,4],[4,12,4,13],[4,14,4,15],[8,0,8,1],[7,0,7,1],[4,0,4,1],[3,7,3,9],[17,0,17,19],[18,0,18,5],[19,4,19,5],[9,0,9,1],[10,0,10,1],[13,16,13,17],[13,18,13,19],[13,12,13,13],[9,5,9,6],[10,5,10,6],[11,5,11,6],[18,6,19,11],[13,5,13,6],[14,9,14,19],[2,0,3,1],[12,16,12,17],[11,16,11,17],[10,16,10,17],[9,16,9,17],[8,16,8,17],[13,14,13,15],[20,6,23,8],[28,17,28,18],[18,12,19,14],[20,12,20,14],[24,12,24,14],[23,12,23,14],[22,12,22,14],[21,12,21,14],[26,13,26,14],[26,15,26,16],[27,12,28,14],[25,12,25,14],[15,12,15,13],[15,9,15,11],[16,12,16,13],[16,9,16,11],[15,18,15,19],[15,14,15,17],[16,18,16,19],[16,14,16,17],[26,1,26,5],[25,6,25,11],[26,6,26,11],[26,17,26,19],[18,15,25,19],[27,17,27,18],[20,4,20,5],[21,4,21,5],[19,2,19,3],[19,0,19,1],[20,0,20,1],[21,0,21,1],[22,0,22,1],[23,0,23,1],[24,0,24,1],[20,2,20,3],[21,2,21,3],[22,2,22,3],[23,2,23,3],[24,2,24,3],[22,9,22,10],[23,9,23,10],[24,6,24,11],[7,16,7,17],[4,18,4,19],[7,18,7,19],[8,18,8,19],[9,18,9,19],[10,18,10,19],[11,18,11,19],[12,18,12,19],[5,18,6,19]]}
["PART 5 – EVENT SUMMARY SHEET"]
["APPLICATION GRAND TOTAL  ",null,"AIN:",{"$f":"IF('Part 1'!E24>0,'Part 1'!E24,\"\")","v":""},null,null,null,null,"RAC Name:",null,null,null,{"$f":"IF('Part 3'!G21>0,'Part 3'!G21,\" \")","v":" "}]
[{"$f":"SUM(C14,F14,K14,M14,Q14,)","v":0},null,"1. Emergency/Intital Work",null,null,"2. Investigation Work\n(Field Work)",null,null,null,null,"3.  Interim Monitoring Work",null,"4.  Corrective \nAction Plan Work",null,null,null,"5.  Report \nPreparation Work"]
[null,null,"Charges","DEQ Adjusted Charges",null,"Charges",null,"DEQ Adjusted Charges",null,null,"Charges","DEQ Adjusted Charges","Charges",null,"DEQ Adjusted Charges",null,"Charges",null,"DEQ Adjusted Charges"]
["A.  Personnel",null,{"$f":"'Personnel Sheet'!M11","v":0},null,null,{"$f":"'Personnel Sheet'!M12","v":0},null,null,null,null,{"$f":"'Personnel Sheet'!M13","v":0},null,{"$f":"'Personnel Sheet'!M14","v":0},null,null,null,{"$f":"'Personnel Sheet'!M15","v":0}]
["B.  Soil/Water",null,{"$f":"'Soil-Water Disposal'!N17","v":0},null,null,{"$f":"'Soil-Water Disposal'!N18","v":0},null,null,null,null,{"$f":"'Soil-Water Disposal'!N19","v":0},null,{"$f":"'Soil-Water Disposal'!N20","v":0}]
["     Disposal"]
["C.  Equipment",null,{"$f":"'Equipment Rent - Purchase'!O16","v":0},null,null,{"$f":"'Equipment Rent - Purchase'!O17","v":0},null,null,null,null,{"$f":"'Equipment Rent - Purchase'!O18","v":0},null,{"$f":"'Equipment Rent - Purchase'!O19","v":0}]
["D.  Travel",null,{"$f":"Travel!N3","v":0},null,null,{"$f":"Travel!N4","v":0},null,null,null,null,{"$f":"Travel!N5","v":0},null,{"$f":"Travel!N6","v":0},null,null,null,{"$f":"Travel!N7","v":0}]
["E. Transportation",null,{"$f":"'Transportation&Shipping'!J13","v":0},null,null,{"$f":"'Transportation&Shipping'!J14","v":0},null,null,null,null,{"$f":"'Transportation&Shipping'!J15","v":0},null,{"$f":"'Transportation&Shipping'!J16","v":0}]
["F.  Drilling & \n     P & A",null,{"$f":"'Drilling-P&A'!O19","v":0},null,null,{"$f":"'Drilling-P&A'!O20","v":0},null,null,null,null,{"$f":"'Drilling-P&A'!O21","v":0},null,{"$f":"'Drilling-P&A'!O22","v":0}]
["G.  Analysis",null,{"$f":"Analysis!M14","v":0},null,null,{"$f":"Analysis!M15","v":0},null,null,null,null,{"$f":"Analysis!M16","v":0},null,{"$f":"Analysis!M17","v":0}]
["H.  Miscellaneous ",null,{"$f":"'Miscellaneous 3'!K2","v":0},null,null,{"$f":"'Miscellaneous 3'!K3","v":0},null,null,null,null,{"$f":"'Miscellaneous 3'!K4","v":0},null,{"$f":"'Miscellaneous 3'!K5","v":0},null,null,null,{"$f":"'Miscellaneous 4'!L7","v":0}]
["Subtotals",null,{"$f":"SUM(C5:C13)","v":0},null,null,{"$f":"SUM(F5:G13)","v":0},null,null,null,null,{"$f":"SUM(K5:K13)","v":0},null,{"$f":"SUM(M5:N13)","v":0},null,null,null,{"$f":"SUM(Q5:R13)","v":0}]
[{"$f":"IF(OR(E16=\"\",G16=\"\"),\"6. Dates work performed in application: MISSING INFORMATION\",\"6. Dates work performed in application:\")","v":"6. Dates work performed in application: MISSING INFORMATION"},null,null,null,"Beginning",null,"Ending",null,null,"7. Application addresses invoices to the owner dated:   (Select quarter by entering year)"]
[null,null,null,null,null,null,null,null,null,"July 1 – September 30",null,null,{"$f":"IF('Part 1'!E29>0,'Part 1'!E29,\"\")","v":""},null,"January 1 – March 31",null,null,null,{"$f":"IF('Part 1'!E33>0,'Part 1'!E33,\"\")","v":""}]
["8.        DEQ Fiscal Year (July - June)",null,null,null,{"$f":"IF((IF(AND(M16>0,M17>0,S16>0,S17>0),(MAX(IF(M16=\"\",0,M16+1),IF(M17=\"\",,M17+1),S16,S17)),\"\"))=0,\"\",(IF(AND(M16>0,M17>0,S16>0,S17>0),(MAX(IF(M16=\"\",0,M16+1),IF(M17=\"\",,M17+1),S16,S17)),\"\")))","v":""},null,null,null,null,"October 1 – December 31",null,null,{"$f":"IF('Part 1'!E31>0,'Part 1'!E31,\"\")","v":""},null,"April 1 - June 30",null,null,null,{"$f":"IF('Part 1'!E35>0,'Part 1'!E35,\"\")","v":""}]
["The area below is for DEQ Trust Fund use only:"]
["Incident Information:",null,null,null,null,null,"Total Adjusted Charges $",null,null,null,null,null,null,null,null,"DEQ Comments, Notations for\nDeductibles , Treatment Units, & Last Applications"]
["Incident No.",null,"Release Date",null,"Substance"]
[null,null,null,null,null,null,"LDEQ Adjustments",null,null,"Trust Fund No.",null,"CAP  Amount"]
[]
[]
[]
[null,null,null,null,null,null,"Deductible Amount ($)"]
["Reviewer Name",null,null,null,null,null,"LDEQ  Reimbursement $"]
["Trust Fund Number",null,null,null,null,null,"Annual Aggregate",null,null,null,null,null,{"$f":"IF('Part 1'!J24=TRUE,\"X\",\"\")","v":""},"$1 million",null,{"$f":"IF('Part 1'!J25=TRUE,\"X\",\"\")","v":""},null,"$2 million"]
["ICAP Charges $",null,null,null,"ICAP Balance $",null,null,null,null,null,"(ROG Aprvd.) CAP Balance $",null,null,null,null,"Payment To:",null,"RAC",null,{"$f":"IF('Part 2'!N34=TRUE,\"X\",\"\")","v":""}]
[null,null,null,null,null,null,null,null,null,null,null,null,null,null,null,null,null,"Owner",null,{"$f":"IF('Part 2'!N33=TRUE,\"X\",\"\")","v":""}]

{"sheet":"Personnel Sheet","index":6,"n_rows":184,"n_cols":15,"rows_kept":184,"cut":false,"hidden":false,"merged":[[144,0,144,6],[145,0,145,6],[107,0,107,6],[108,0,108,6],[70,0,70,6],[71,0,71,6],[33,0,33,6],[34,0,34,6],[179,0,179,4],[179,5,179,6],[148,0,148,6],[149,0,149,6],[150,0,150,6],[151,0,151,6],[152,0,152,6],[142,0,142,4],[142,5,142,6],[143,0,143,4],[143,5,143,6],[146,0,146,3],[116,0,116,4],[117,0,117,6],[118,0,118,6],[119,1,120,1],[183,0,183,3],[153,0,153,4],[154,0,154,6],[155,0,155,6],[156,1,157,1],[156,2,157,2],[156,3,157,3],[156,4,157,4],[156,5,157,5],[156,6,157,6],[181,0,181,6],[182,0,182,6],[180,0,180,4],[180,5,180,6],[119,2,120,2],[119,3,120,3],[119,4,120,4],[119,5,120,5],[119,6,120,6],[111,0,111,6],[112,0,112,6],[113,0,113,6],[114,0,114,6],[115,0,115,6],[105,0,105,4],[105,5,105,6],[106,0,106,4],[106,5,106,6],[109,0,109,3],[79,0,79,4],[80,0,80,6],[81,0,81,6],[82,1,83,1],[82,2,83,2],[82,3,83,3],[82,4,83,4],[82,5,83,5],[82,6,83,6],[74,0,74,6],[75,0,75,6],[76,0,76,6],[77,0,77,6],[78,0,78,6],[68,0,68,4],[68,5,68,6],[69,0,69,4],[69,5,69,6],[72,0,72,3],[44,0,44,6],[45,1,46,1],[45,2,46,2],[45,3,46,3],[45,4,46,4],[45,5,46,5],[45,6,46,6],[39,0,39,6],[40,0,40,6],[41,0,41,6],[42,0,42,4],[43,0,43,6],[8,5,9,5],[8,6,9,6],[6,0,6,6],[37,0,37,6],[38,0,38,6],[35,0,35,3],[5,0,5,4],[7,0,7,6],[0,0,0,6],[1,0,1,6],[32,0,32,4],[31,5,31,6],[32,5,32,6],[2,0,2,6],[4,0,4,6],[31,0,31,4],[8,1,9,1],[8,2,9,2],[8,3,9,3],[8,4,9,4],[3,0,3,6]]}
["PART 5.A"]
["PERSONNEL SUPPLEMENTARY SHEET"]
["Check Event:"]
[]
["1.        Rates shown on this form cannot be adjusted higher."]
["2.        (Rate) X (No. Hrs.) = Total"]
["3.        Personnel charges for work activities included in unit pricing should not be addressed on this form"]
["4.        For work performed prior to 4/1/2012, use the appropriate Trust Fund Guidance Document Rates."]
["PERSONNEL","EMPLOYEE NAME","RATE","WORK PERFORMED\nDATE,  LOCATION (field or office) and DESCRIPTION","INVOICE       NO.","No.     HRS","TOTAL"]
["DUTIES",null,null,null,null,null,null,null,null,null,"Total",null,"Sheet Total"]
["**PRINCIPAL",null,125,null,null,null,{"$f":"ROUND((C11*F11),2)","v":0},null,"Emergency/Initial Work   ",false,{"$f":"IF(J11=TRUE,$F$32,\"\")","v":""},"Emergency/Initial Work   ",{"$f":"SUM(K11,K48,K85,K122,K160)","v":0}]
["*SENIOR   TOXICOLOGIST",null,100,null,null,null,{"$f":"ROUND((C12*F12),2)","v":0},null,"Investigation Work      ",false,{"$f":"IF(J12=TRUE,$F$32,\"\")","v":""},"Investigation Work      ",{"$f":"SUM(K12,K49,K86,K123,K161)","v":0}]
["*SENIOR ENGINEER",null,100,null,null,null,0,null,"Monitoring/Interim Work        ",false,"","Monitoring/Interim Work        ",{"$f":"SUM(K13,K50,K87,K124,K162)","v":0}]
["*SENIOR GEOLOGIST",null,100,null,null,null,0,null,"Corrective Action Plan Work",false,"","Corrective Action Plan Work",{"$f":"SUM(K14,K51,K88,K125,K163)","v":0}]
["*PROJECT MANAGER",null,100,null,null,null,0,null,"Report Preparation ",false,"","Report Preparation ",{"$f":"SUM(K15,K52,K89,K126,K164)","v":0}]
["*PROJECT MANAGER",null,100,null,null,null,0]
["*PROJECT MANAGER",null,100,null,null,null,0,null,"Emergency/Initial Work   ",{"$f":"IF(J11=TRUE,1,\"\")","v":""}]
["*PROJECT COORDINATOR",null,72,null,null,null,0,null,"Investigation Work      ",{"$f":"IF(J12=TRUE,2,\"\")","v":""}]
["*PROJECT COORDINATOR",null,72,null,null,null,0,null,"Monitoring/Interim Work        ",{"$f":"IF(J13=TRUE,3,\"\")","v":""}]
["GEOLOGIST",null,72,null,null,null,0,null,"Corrective Action Plan Work",{"$f":"IF(J14=TRUE,4,\"\")","v":""},null,null,null,null,"GEOLOGIST"]
["ENGINEER",null,72,null,null,null,0,null,"Report Preparation ",{"$f":"IF(J15=TRUE,5,\"\")","v":""},null,null,null,null,"ENGINEER"]
["TOXICOLOGIST",null,72,null,null,null,0,null,null,null,null,null,null,null,"TOXICOLOGIST"]
["ENVIRONMENTAL SPECIALIST",null,65,null,null,null,0]
["ENVIRONMENTAL SPECIALIST",null,65,null,null,null,0,null,null,null,null,null,null,null,"LABORER"]
["ENVIRONMENTAL SPECIALIST",null,65,null,null,null,0,null,null,null,null,null,null,null,"CLERICAL"]
["FOREMAN",null,65,null,null,null,0]
["DRAFTSMAN",null,65,null,null,null,0]
["OPERATOR",null,45,null,null,null,0]
["OPERATOR",null,45,null,null,null,0]
["LABORER",null,35,null,null,null,0]
["LABORER",null,35,null,null,null,0,null,{"$f":"IF(J11=TRUE,$M$11,IF(J12=TRUE,$M$12,IF(J13=TRUE,$M$13,IF(J14=TRUE,$M$14,IF(J15=TRUE,$M$15,0)))))","v":0}]
["SUBTOTAL OF THIS PAGE",null,null,null,null,{"$f":"SUM(G11:G31)","v":0}]
["TOTAL PERSONNEL COSTS",null,null,null,null,{"$f":"SUM(I31)","v":0},null,null,{"$f":"IF(F33>0,1,0)","v":0}]
["*There can be only one person in this designated job title performing these duties shown at any given period of time.  "]
["**Only a limited number of hours should be shown for this position. "]
["Page          of              (Personnel Supplementary Sheet)"]
[]
["PART 5.A"]
["PERSONNEL SUPPLEMENTARY SHEET"]
["Check Event:"]
[]
["1.        Rates shown on this form cannot be adjusted higher."]
["2.        (Rate) X (No. Hrs.) = Total"]
["3.        Personnel charges for work activities included in unit pricing should not be addressed on this form"]
["4.        For work performed prior to 4/1/2012, use the appropriate Trust Fund Guidance Document Rates."]
["PERSONNEL","EMPLOYEE NAME","RATE","WORK PERFORMED\nDATE,  LOCATION (field or office) and DESCRIPTION","INVOICE       NO.","No.     HRS","TOTAL"]
["DUTIES",null,null,null,null,null,null,null,null,null,"Total"]
["**PRINCIPAL",null,125,null,null,null,{"$f":"ROUND((C48*F48),2)","v":0},null,"Emergency/Initial Work   ",false,{"$f":"IF(J48=TRUE,$F$69,\"\")","v":""}]
["*SENIOR   TOXICOLOGIST",null,100,null,null,null,0,null,"Investigation Work      ",false,{"$f":"IF(J49=TRUE,$F$69,\"\")","v":""}]
["*SENIOR ENGINEER",null,100,null,null,null,0,null,"Monitoring/Interim Work        ",false,""]
["*SENIOR GEOLOGIST",null,100,null,null,null,0,null,"Corrective Action Plan Work",false,""]
["*PROJECT MANAGER",null,100,null,null,null,0,null,"Report Preparation ",false,""]
["*PROJECT MANAGER",null,100,null,null,null,0]
["*PROJECT MANAGER",null,100,null,null,null,0,null,"Emergency/Initial Work   ",{"$f":"IF(J48=TRUE,1,\"\")","v":""}]
["*PROJECT COORDINATOR",null,72,null,null,null,0,null,"Investigation Work      ",{"$f":"IF(J49=TRUE,2,\"\")","v":""}]
["*PROJECT COORDINATOR",null,72,null,null,null,0,null,"Monitoring/Interim Work        ",{"$f":"IF(J50=TRUE,3,\"\")","v":""}]
["GEOLOGIST",null,72,null,null,null,0,null,"Corrective Action Plan Work",{"$f":"IF(J51=TRUE,4,\"\")","v":""}]
["ENGINEER",null,72,null,null,null,0,null,"Report Preparation ",{"$f":"IF(J52=TRUE,5,\"\")","v":""}]
["TOXICOLOGIST",null,72,null,null,null,0]
["ENVIRONMENTAL SPECIALIST",null,65,null,null,null,0]
["ENVIRONMENTAL SPECIALIST",null,65,null,null,null,0]
["ENVIRONMENTAL SPECIALIST",null,65,null,null,null,0]
["FOREMAN",null,65,null,null,null,0]
["DRAFTSMAN",null,65,null,null,null,0]
["OPERATOR",null,45,null,null,null,0]
["OPERATOR",null,45,null,null,null,0]
["LABORER",null,35,null,null,null,0,null,{"$f":"IF(J48=TRUE,$M$11,IF(J49=TRUE,$M$12,IF(J50=TRUE,$M$13,IF(J51=TRUE,$M$14,IF(J52=TRUE,$M$15,0)))))","v":0}]
["LABORER",null,35,null,null,null,0]
["SUBTOTAL OF THIS PAGE",null,null,null,null,{"$f":"SUM(G48:G68)","v":0}]
["TOTAL PERSONNEL COSTS",null,null,null,null,{"$f":"SUM(I67)","v":0},null,null,{"$f":"IF(F70>0,1,0)","v":0}]
["*There can be only one person in this designated job title performing these duties shown at any given period of time.  "]
["**Only a limited number of hours should be shown for this position. "]
["Page_____of______ (Personnel Supplementary Sheet)"]
[]
["PART 5.A"]
["PERSONNEL SUPPLEMENTARY SHEET"]
["Check Event:"]
[]
["1.        Rates shown on this form cannot be adjusted higher."]
["2.        (Rate) X (No. Hrs.) = Total"]
["3.        Personnel charges for work activities included in unit pricing should not be addressed on this form"]
["4.        For work performed prior to 4/1/2012, use the appropriate Trust Fund Guidance Document Rates."]
["PERSONNEL","EMPLOYEE NAME","RATE","WORK PERFORMED\nDATE,  LOCATION (field or office) and DESCRIPTION","INVOICE       NO.","No.     HRS","TOTAL"]
["DUTIES",null,null,null,null,null,null,null,null,null,"Total"]
["**PRINCIPAL",null,125,null,null,null,{"$f":"ROUND((C85*F85),2)","v":0},null,"Emergency/Initial Work   ",false,{"$f":"IF(J85=TRUE,$F$106,\"\")","v":""}]
["*SENIOR   TOXICOLOGIST",null,100,null,null,null,0,null,"Investigation Work      ",false,{"$f":"IF(J86=TRUE,$F$106,\"\")","v":""}]
["*SENIOR ENGINEER",null,100,null,null,null,0,null,"Monitoring/Interim Work        ",false,""]
["*SENIOR GEOLOGIST",null,100,null,null,null,0,null,"Corrective Action Plan Work",false,""]
["*PROJECT MANAGER",null,100,null,null,null,0,null,"Report Preparation ",false,""]
["*PROJECT MANAGER",null,100,null,null,null,0]
["*PROJECT MANAGER",null,100,null,null,null,0,null,"Emergency/Initial Work   ",{"$f":"IF(J85=TRUE,1,\"\")","v":""}]
["*PROJECT COORDINATOR",null,72,null,null,null,0,null,"Investigation Work      ",{"$f":"IF(J86=TRUE,2,\"\")","v":""}]
["*PROJECT COORDINATOR",null,72,null,null,null,0,null,"Monitoring/Interim Work        ",{"$f":"IF(J87=TRUE,3,\"\")","v":""}]
["GEOLOGIST",null,72,null,null,null,0,null,"Corrective Action Plan Work",{"$f":"IF(J88=TRUE,4,\"\")","v":""}]
["ENGINEER",null,72,null,null,null,0,null,"Report Preparation ",{"$f":"IF(J89=TRUE,5,\"\")","v":""}]
["TOXICOLOGIST",null,72,null,null,null,0]
["ENVIRONMENTAL SPECIALIST",null,65,null,null,null,0]
["ENVIRONMENTAL SPECIALIST",null,65,null,null,null,0]
["ENVIRONMENTAL SPECIALIST",null,65,null,null,null,0]
["FOREMAN",null,65,null,null,null,0]
["DRAFTSMAN",null,65,null,null,null,0]
["OPERATOR",null,45,null,null,null,0]
["OPERATOR",null,45,null,null,null,0]
["LABORER",null,35,null,null,null,0]
["LABORER",null,35,null,null,null,0,null,{"$f":"IF(J85=TRUE,$M$11,IF(J86=TRUE,$M$12,IF(J87=TRUE,$M$13,IF(J88=TRUE,$M$14,IF(J89=TRUE,$M$15,0)))))","v":0}]
["SUBTOTAL OF THIS PAGE",null,null,null,null,{"$f":"SUM(G85:G105)","v":0}]
["TOTAL PERSONNEL COSTS",null,null,null,null,{"$f":"SUM(I105)","v":0},null,null,{"$f":"IF(F107>0,1,0)","v":0}]
["*There can be only one person in this designated job title performing these duties shown at any given period of time.  "]
["**Only a limited number of hours should be shown for this position. "]
["Page          of              (Personnel Supplementary Sheet)"]
[]
["PART 5.A"]
["PERSONNEL SUPPLEMENTARY SHEET"]
["Check Event:"]
[]
["1.        Rates shown on this form cannot be adjusted higher."]
["2.        (Rate) X (No. Hrs.) = Total"]
["3.        Personnel charges for work activities included in unit pricing should not be addressed on this form"]
["4.        For work performed prior to 4/1/2012, use the appropriate Trust Fund Guidance Document Rates."]
["PERSONNEL","EMPLOYEE NAME","RATE","WORK PERFORMED\nDATE,  LOCATION (field or office) and DESCRIPTION","INVOICE       NO.","No.     HRS","TOTAL"]
["DUTIES",null,null,null,null,null,null,null,null,null,"Total"]
["**PRINCIPAL",null,125,null,null,null,{"$f":"ROUND((C122*F122),2)","v":0},null,"Emergency/Initial Work   ",false,{"$f":"IF(J122=TRUE,$F$143,\"\")","v":""}]
["*SENIOR   TOXICOLOGIST",null,100,null,null,null,0,null,"Investigation Work      ",false,{"$f":"IF(J123=TRUE,$F$143,\"\")","v":""}]
["*SENIOR ENGINEER",null,100,null,null,null,0,null,"Monitoring/Interim Work        ",false,""]
["*SENIOR GEOLOGIST",null,100,null,null,null,0,null,"Corrective Action Plan Work",false,""]
["*PROJECT MANAGER",null,100,null,null,null,0,null,"Report Preparation ",false,""]
["*PROJECT MANAGER",null,100,null,null,null,0]
["*PROJECT MANAGER",null,100,null,null,null,0,null,"Emergency/Initial Work   ",{"$f":"IF(J122=TRUE,1,\"\")","v":""}]
["*PROJECT COORDINATOR",null,72,null,null,null,0,null,"Investigation Work      ",{"$f":"IF(J123=TRUE,2,\"\")","v":""}]
["*PROJECT COORDINATOR",null,72,null,null,null,0,null,"Monitoring/Interim Work        ",{"$f":"IF(J124=TRUE,3,\"\")","v":""}]
["GEOLOGIST",null,72,null,null,null,0,null,"Corrective Action Plan Work",{"$f":"IF(J125=TRUE,4,\"\")","v":""}]
["ENGINEER",null,72,null,null,null,0,null,"Report Preparation ",{"$f":"IF(J126=TRUE,5,\"\")","v":""}]
["TOXICOLOGIST",null,72,null,null,null,0]
["ENVIRONMENTAL SPECIALIST",null,65,null,null,null,0]
["ENVIRONMENTAL SPECIALIST",null,65,null,null,null,0]
["ENVIRONMENTAL SPECIALIST",null,65,null,null,null,0]
["FOREMAN",null,65,null,null,null,0]
["DRAFTSMAN",null,65,null,null,null,0]
["OPERATOR",null,45,null,null,null,0]
["OPERATOR",null,45,null,null,null,0]
["LABORER",null,35,null,null,null,0]
["LABORER",null,35,null,null,null,0,null,{"$f":"IF(J122=TRUE,$M$11,IF(J123=TRUE,$M$12,IF(J124=TRUE,$M$13,IF(J125=TRUE,$M$14,IF(J126=TRUE,$M$15,0)))))","v":0}]
["SUBTOTAL OF THIS PAGE",null,null,null,null,{"$f":"SUM(G122:G142)","v":0}]
["TOTAL PERSONNEL COSTS",null,null,null,null,{"$f":"SUM(I142)","v":0},null,null,{"$f":"IF(F144>0,1,0)","v":0}]
["*There can be only one person in this designated job title performing these duties shown at any given period of time.  "]
["**Only a limited number of hours should be shown for this position. "]
["Page          of              (Personnel Supplementary Sheet)"]
[]
["PART 5.A"]
["PERSONNEL SUPPLEMENTARY SHEET"]
["Check Event:"]
[]
["1.        Rates shown on this form cannot be adjusted higher."]
["2.        (Rate) X (No. Hrs.) = Total"]
["3.        Personnel charges for work activities included in unit pricing should not be addressed on this form"]
["4.        For work performed prior to 4/1/2012, use the appropriate Trust Fund Guidance Document Rates."]
["PERSONNEL","EMPLOYEE NAME","RATE","WORK PERFORMED\nDATE,  LOCATION (field or office) and DESCRIPTION","INVOICE       NO.","No.     HRS","TOTAL"]
["DUTIES"]
["**PRINCIPAL",null,125,null,null,null,{"$f":"ROUND((C159*F159),2)","v":0},null,null,null,"Total"]
["*SENIOR   TOXICOLOGIST",null,100,null,null,null,0,null,"Emergency/Initial Work   ",false,{"$f":"IF(J160=TRUE,$F$180,\"\")","v":""}]
["*SENIOR ENGINEER",null,100,null,null,null,0,null,"Investigation Work      ",false,{"$f":"IF(J161=TRUE,$F$180,\"\")","v":""}]
["*SENIOR GEOLOGIST",null,100,null,null,null,0,null,"Monitoring/Interim Work        ",false,""]
["*PROJECT MANAGER",null,100,null,null,null,0,null,"Corrective Action Plan Work",false,""]
["*PROJECT MANAGER",null,100,null,null,null,0,null,"Report Preparation ",false,""]
["*PROJECT MANAGER",null,100,null,null,null,0]
["*PROJECT COORDINATOR",null,72,null,null,null,0,null,"Emergency/Initial Work   ",{"$f":"IF(J160=TRUE,1,\"\")","v":""}]
["*PROJECT COORDINATOR",null,72,null,null,null,0,null,"Investigation Work      ",{"$f":"IF(J161=TRUE,2,\"\")","v":""}]
["GEOLOGIST",null,72,null,null,null,0,null,"Monitoring/Interim Work        ",{"$f":"IF(J162=TRUE,3,\"\")","v":""}]
["ENGINEER",null,72,null,null,null,0,null,"Corrective Action Plan Work",{"$f":"IF(J163=TRUE,4,\"\")","v":""}]
["TOXICOLOGIST",null,72,null,null,null,0,null,"Report Preparation ",{"$f":"IF(J164=TRUE,5,\"\")","v":""}]
["ENVIRONMENTAL SPECIALIST",null,65,null,null,null,0]
["ENVIRONMENTAL SPECIALIST",null,65,null,null,null,0]
["ENVIRONMENTAL SPECIALIST",null,65,null,null,null,0]
["FOREMAN",null,65,null,null,null,0]
["DRAFTSMAN",null,65,null,null,null,0]
["OPERATOR",null,45,null,null,null,0]
["OPERATOR",null,45,null,null,null,0]
["LABORER",null,35,null,null,null,0]
["LABORER",null,35,null,null,null,0,null,{"$f":"IF(J160=TRUE,$M$11,IF(J161=TRUE,$M$12,IF(J162=TRUE,$M$13,IF(J163=TRUE,$M$14,IF(J164=TRUE,$M$15,0)))))","v":0}]
["SUBTOTAL OF THIS PAGE",null,null,null,null,{"$f":"SUM(G159:G179)","v":0}]
["TOTAL PERSONNEL COSTS",null,null,null,null,{"$f":"SUM(I180)","v":0},null,null,{"$f":"IF(F181>0,1,0)","v":0}]
["*There can be only one person in this designated job title performing these duties shown at any given period of time.  "]
["**Only a limited number of hours should be shown for this position. "]
["Page          of              (Personnel Supplementary Sheet)"]

{"sheet":"Soil-Water Disposal","index":7,"n_rows":172,"n_cols":14,"rows_kept":172,"cut":false,"hidden":false,"merged":[[133,0,133,7],[134,0,134,7],[135,0,135,7],[136,0,136,7],[137,0,137,7],[143,0,143,7],[171,0,171,5],[138,0,138,7],[139,0,139,7],[140,0,140,7],[141,0,141,7],[142,0,142,7],[169,0,169,6],[170,0,170,6],[129,0,129,7],[130,0,130,7],[131,0,131,7],[98,0,98,7],[99,0,99,7],[100,0,100,7],[126,0,126,6],[127,0,127,6],[128,0,128,5],[93,0,93,7],[94,0,94,7],[95,0,95,7],[96,0,96,7],[97,0,97,7],[13,0,13,7],[43,0,43,7],[44,0,44,7],[45,0,45,7],[47,0,47,7],[42,0,42,5],[40,0,40,6],[41,0,41,6],[14,0,14,7],[46,0,46,7],[9,0,9,7],[10,0,10,7],[11,0,11,7],[12,0,12,7],[5,0,5,7],[7,0,7,7],[8,0,8,7],[0,0,0,7],[1,0,1,7],[2,0,2,7],[6,0,6,7],[3,0,3,7],[4,0,4,7],[48,0,48,7],[49,0,49,7],[50,0,50,7],[51,0,51,7],[52,0,52,7],[132,0,132,7],[53,0,53,7],[54,0,54,7],[55,0,55,7],[56,0,56,7],[57,0,57,7],[88,0,88,7],[90,0,90,7],[91,0,91,7],[92,0,92,7],[85,0,85,5],[86,0,86,7],[87,0,87,7],[83,0,83,6],[84,0,84,6],[89,0,89,7]]}
["PART 5.B"]
["SOIL/WATER DISPOSAL SUPPLEMENTARY SHEET"]
["Check Event:"]
["1.    The unit rate for purge water disposal related to Groundwater Sampling events is $4.00/gal."]
["2.    All other water disposal is under the unit rate of $0.55 /gal."]
["3.    Do not address the RAC markups on this page.  Indicate markups on the Miscellaneous Supplementary Sheet."]
["4.    Pre-approval is required from the Team Leader or ROG for all work."]
["5.    For disposal invoices: addresses, copies of manifests, bills of lading, etc. must be provided."]
["6.    (Tons [Soil]) X (Cost Per Unit) = Total",null,null,null,null,null,null,null,null," "]
["7.    (Gallons [Water]) X (Cost Per Unit) = Total"]
["8.    Soil drum disposal (not associated with excavation): $500.00 minimum, $200.00 for the first drum, $150.00 each additional "]
["       drum."]
["9.    For excavation/transportation/disposal unit rates, please refer to the MS Excel spreadsheet located at  ",null,null,null,null,null,null,null,null,"Soil Cuttings",null,"TONS","DRUMS"]
["      http://www.deq.louisiana.gov/trustfund",null,null,null,null,null,null,null,null,"Water",null,"GALLONS"]
["10.   For non-impacted soil and onsite, treated soil cost reductions, enter the tonnage value in the bottom two rows.",null,null,null,null,null,null,null,null,"Excavation",null,"TONS"]
["TYPE OF DISPOSAL \n(Soil or Water)","DISPOSAL DATE","RAC\nINVOICE\nNO.","OUTSIDE\nINVOICE\nNO.","TONS, DRUMS OR\nGALLONS","QUANTITY","COST \nPER\nUNIT","TOTAL",null,null,null,"Total",null,"Sheet total"]
[null,null,null,null,null,null,null,{"$f":"ROUND(IF(AND(A17=\"Excavation\",E17=\"TONS\"),VLOOKUP(F17,Data!$D$18:$F$5017,3),IF(AND(A17=\"Soil Cuttings\",E17=\"DRUMS\"),IF(F17<=3,500,(F17-1)*150+200),F17*G17)),2)","v":0},null,"Emergency/Initial Work   ",false,{"$f":"IF(K17=TRUE,$H$41,\"\")","v":""},"Emergency/Initial Work   ",{"$f":"SUM(L17,L60,L103,L146)","v":0}]
[null,null,null,null,null,null,null,{"$f":"ROUND(IF(AND(A18=\"Excavation\",E18=\"TONS\"),VLOOKUP(F18,Data!$D$18:$F$5017,3),IF(AND(A18=\"Soil Cuttings\",E18=\"DRUMS\"),IF(F18<=3,500,(F18-1)*150+200),F18*G18)),2)","v":0},null,"Investigation Work      ",false,{"$f":"IF(K18=TRUE,$H$41,\"\")","v":""},"Investigation Work      ",{"$f":"SUM(L18,L61,L104,L147)","v":0}]
[null,null,null,null,null,null,null,{"$f":"ROUND(IF(AND(A19=\"Excavation\",E19=\"TONS\"),VLOOKUP(F19,Data!$D$18:$F$5017,3),IF(AND(A19=\"Soil Cuttings\",E19=\"DRUMS\"),IF(F19<=3,500,(F19-1)*150+200),F19*G19)),2)","v":0},null,"Monitoring/Interim Work    ",false,"","Monitoring/Interim Work    ",{"$f":"SUM(L19,L62,L105,L148)","v":0}]
[null,null,null,null,null,null,null,{"$f":"ROUND(IF(AND(A20=\"Excavation\",E20=\"TONS\"),VLOOKUP(F20,Data!$D$18:$F$5017,3),IF(AND(A20=\"Soil Cuttings\",E20=\"DRUMS\"),IF(F20<=3,500,(F20-1)*150+200),F20*G20)),2)","v":0},null,"Corrective Action Plan Work",false,"","Corrective Action Plan Work",{"$f":"SUM(L20,L63,L106,L149)","v":0}]
[null,null,null,null,null,null,null,{"$f":"ROUND(IF(AND(A21=\"Excavation\",E21=\"TONS\"),VLOOKUP(F21,Data!$D$18:$F$5017,3),IF(AND(A21=\"Soil Cuttings\",E21=\"DRUMS\"),IF(F21<=3,500,(F21-1)*150+200),F21*G21)),2)","v":0}]
[null,null,null,null,null,null,null,{"$f":"ROUND(IF(AND(A22=\"Excavation\",E22=\"TONS\"),VLOOKUP(F22,Data!$D$18:$F$5017,3),IF(AND(A22=\"Soil Cuttings\",E22=\"DRUMS\"),IF(F22<=3,500,(F22-1)*150+200),F22*G22)),2)","v":0},null,"Emergency/Initial Work   ",{"$f":"IF(K17=TRUE,1,\"\")","v":""}]
[null,null,null,null,null,null,null,{"$f":"ROUND(IF(AND(A23=\"Excavation\",E23=\"TONS\"),VLOOKUP(F23,Data!$D$18:$F$5017,3),IF(AND(A23=\"Soil Cuttings\",E23=\"DRUMS\"),IF(F23<=3,500,(F23-1)*150+200),F23*G23)),2)","v":0},null,"Investigation Work      ",{"$f":"IF(K18=TRUE,2,\"\")","v":""}]
[null,null,null,null,null,null,null,{"$f":"ROUND(IF(AND(A24=\"Excavation\",E24=\"TONS\"),VLOOKUP(F24,Data!$D$18:$F$5017,3),IF(AND(A24=\"Soil Cuttings\",E24=\"DRUMS\"),IF(F24<=3,500,(F24-1)*150+200),F24*G24)),2)","v":0},null,"Monitoring/Interim Work    ",{"$f":"IF(K19=TRUE,3,\"\")","v":""}]
[null,null,null,null,null,null,null,{"$f":"ROUND(IF(AND(A25=\"Excavation\",E25=\"TONS\"),VLOOKUP(F25,Data!$D$18:$F$5017,3),IF(AND(A25=\"Soil Cuttings\",E25=\"DRUMS\"),IF(F25<=3,500,(F25-1)*150+200),F25*G25)),2)","v":0},null,"Corrective Action Plan Work",{"$f":"IF(K20=TRUE,4,\"\")","v":""}]
[null,null,null,null,null,null,null,{"$f":"ROUND(IF(AND(A26=\"Excavation\",E26=\"TONS\"),VLOOKUP(F26,Data!$D$18:$F$5017,3),IF(AND(A26=\"Soil Cuttings\",E26=\"DRUMS\"),IF(F26<=3,500,(F26-1)*150+200),F26*G26)),2)","v":0}]
[null,null,null,null,null,null,null,{"$f":"ROUND(IF(AND(A27=\"Excavation\",E27=\"TONS\"),VLOOKUP(F27,Data!$D$18:$F$5017,3),IF(AND(A27=\"Soil Cuttings\",E27=\"DRUMS\"),IF(F27<=3,500,(F27-1)*150+200),F27*G27)),2)","v":0}]
[null,null,null,null,null,null,null,{"$f":"ROUND(IF(AND(A28=\"Excavation\",E28=\"TONS\"),VLOOKUP(F28,Data!$D$18:$F$5017,3),IF(AND(A28=\"Soil Cuttings\",E28=\"DRUMS\"),IF(F28<=3,500,(F28-1)*150+200),F28*G28)),2)","v":0}]
[null,null,null,null,null,null,null,{"$f":"ROUND(IF(AND(A29=\"Excavation\",E29=\"TONS\"),VLOOKUP(F29,Data!$D$18:$F$5017,3),IF(AND(A29=\"Soil Cuttings\",E29=\"DRUMS\"),IF(F29<=3,500,(F29-1)*150+200),F29*G29)),2)","v":0}]
[null,null,null,null,null,null,null,{"$f":"ROUND(IF(AND(A30=\"Excavation\",E30=\"TONS\"),VLOOKUP(F30,Data!$D$18:$F$5017,3),IF(AND(A30=\"Soil Cuttings\",E30=\"DRUMS\"),IF(F30<=3,500,(F30-1)*150+200),F30*G30)),2)","v":0}]
[null,null,null,null,null,null,null,{"$f":"ROUND(IF(AND(A31=\"Excavation\",E31=\"TONS\"),VLOOKUP(F31,Data!$D$18:$F$5017,3),IF(AND(A31=\"Soil Cuttings\",E31=\"DRUMS\"),IF(F31<=3,500,(F31-1)*150+200),F31*G31)),2)","v":0}]
[null,null,null,null,null,null,null,{"$f":"ROUND(IF(AND(A32=\"Excavation\",E32=\"TONS\"),VLOOKUP(F32,Data!$D$18:$F$5017,3),IF(AND(A32=\"Soil Cuttings\",E32=\"DRUMS\"),IF(F32<=3,500,(F32-1)*150+200),F32*G32)),2)","v":0}]
[null,null,null,null,null,null,null,{"$f":"ROUND(IF(AND(A33=\"Excavation\",E33=\"TONS\"),VLOOKUP(F33,Data!$D$18:$F$5017,3),IF(AND(A33=\"Soil Cuttings\",E33=\"DRUMS\"),IF(F33<=3,500,(F33-1)*150+200),F33*G33)),2)","v":0}]
[null,null,null,null,null,null,null,{"$f":"ROUND(IF(AND(A34=\"Excavation\",E34=\"TONS\"),VLOOKUP(F34,Data!$D$18:$F$5017,3),IF(AND(A34=\"Soil Cuttings\",E34=\"DRUMS\"),IF(F34<=3,500,(F34-1)*150+200),F34*G34)),2)","v":0}]
[null,null,null,null,null,null,null,{"$f":"ROUND(IF(AND(A35=\"Excavation\",E35=\"TONS\"),VLOOKUP(F35,Data!$D$18:$F$5017,3),IF(AND(A35=\"Soil Cuttings\",E35=\"DRUMS\"),IF(F35<=3,500,(F35-1)*150+200),F35*G35)),2)","v":0}]
[null,null,null,null,null,null,null,{"$f":"ROUND(IF(AND(A36=\"Excavation\",E36=\"TONS\"),VLOOKUP(F36,Data!$D$18:$F$5017,3),IF(AND(A36=\"Soil Cuttings\",E36=\"DRUMS\"),IF(F36<=3,500,(F36-1)*150+200),F36*G36)),2)","v":0}]
[null,null,null,null,null,null,null,{"$f":"ROUND(IF(AND(A37=\"Excavation\",E37=\"TONS\"),VLOOKUP(F37,Data!$D$18:$F$5017,3),IF(AND(A37=\"Soil Cuttings\",E37=\"DRUMS\"),IF(F37<=3,500,(F37-1)*150+200),F37*G37)),2)","v":0}]
[null,null,null,null,null,null,null,{"$f":"ROUND(IF(AND(A38=\"Excavation\",E38=\"TONS\"),VLOOKUP(F38,Data!$D$18:$F$5017,3),IF(AND(A38=\"Soil Cuttings\",E38=\"DRUMS\"),IF(F38<=3,500,(F38-1)*150+200),F38*G38)),2)","v":0}]
["Non-Impacted Soil",null,null,null,"TONS",null,-45,{"$f":"ROUND(IF(AND(A39=\"Excavation\",E39=\"TONS\"),VLOOKUP(F39,Data!$D$18:$F$5017,3),IF(AND(A39=\"Soil Cuttings\",E39=\"DRUMS\"),IF(F39<=3,500,(F39-1)*150+200),F39*G39)),2)","v":0}]
["Treated Soil",null,null,null,"TONS",null,-30,{"$f":"ROUND(IF(AND(A40=\"Excavation\",E40=\"TONS\"),VLOOKUP(F40,Data!$D$18:$F$5017,3),IF(AND(A40=\"Soil Cuttings\",E40=\"DRUMS\"),IF(F40<=3,500,(F40-1)*150+200),F40*G40)),2)","v":0},null,{"$f":"IF(K17=TRUE,$N$17,IF(K18=TRUE,$N$18,IF(K19=TRUE,$N$19,IF(K20=TRUE,$N$20,0))))","v":0}]
["SUBTOTAL OF THIS PAGE",null,null,null,null,null,null,{"$f":"SUM(H17:H40)","v":0}]
["TOTAL DISPOSAL COSTS",null,null,null,null,null,null,{"$f":"SUM(J40)","v":0},null,{"$f":"IF(H42>0,1,0)","v":0}]
["Page               of               (Soil/Water Disposal Supplementary Sheet)"]
["PART 5.B"]
["SOIL/WATER DISPOSAL SUPPLEMENTARY SHEET"]
["Check Event:"]
["1.    The unit rate for purge water disposal related to Groundwater Sampling events is $4.00/gal."]
["2.    All other water disposal is under the unit rate of $0.55 /gal."]
["3.    Do not address the RAC markups on this page.  Indicate markups on the Miscellaneous Supplementary Sheet."]
["4.    Pre-approval is required from the Team Leader or ROG for all work."]
["5.    For disposal invoices: addresses, copies of manifests, bills of lading, etc. must be provided."]
["6.    (Tons [Soil]) X (Cost Per Unit) = Total",null,null,null,null,null,null,null,null," "]
["7.    (Gallons [Water]) X (Cost Per Unit) = Total"]
["8.    Soil drum disposal (not associated with excavation): $500.00 minimum, $200.00 for the first drum, $150.00 each additional "]
["       drum."]
["9.    For excavation/transportation/disposal unit rates, please refer to the MS Excel spreadsheet located at  "]
["      http://www.deq.louisiana.gov/trustfund"]
["10.   For non-impacted soil and onsite, treated soil cost reductions, enter the tonnage value in the bottom two rows."]
["TYPE OF DISPOSAL \n(Soil or Water)","DISPOSAL DATE","RAC\nINVOICE\nNO.","OUTSIDE\nINVOICE\nNO.","TONS, DRUMS OR\nGALLONS","QUANTITY","COST \nPER\nUNIT","TOTAL",null,null,null,"Total"]
[null,null,null,null,null,null,null,{"$f":"ROUND(IF(AND(A60=\"Excavation\",E60=\"TONS\"),VLOOKUP(F60,Data!$D$18:$F$5017,3),IF(AND(A60=\"Soil Cuttings\",E60=\"DRUMS\"),IF(F60<=3,500,(F60-1)*150+200),F60*G60)),2)","v":0},null,"Emergency/Initial Work   ",false,{"$f":"IF(K60=TRUE,$H$84,\"\")","v":""}]
[null,null,null,null,null,null,null,{"$f":"ROUND(IF(AND(A61=\"Excavation\",E61=\"TONS\"),VLOOKUP(F61,Data!$D$18:$F$5017,3),IF(AND(A61=\"Soil Cuttings\",E61=\"DRUMS\"),IF(F61<=3,500,(F61-1)*150+200),F61*G61)),2)","v":0},null,"Investigation Work      ",false,{"$f":"IF(K61=TRUE,$H$84,\"\")","v":""}]
[null,null,null,null,null,null,null,{"$f":"ROUND(IF(AND(A62=\"Excavation\",E62=\"TONS\"),VLOOKUP(F62,Data!$D$18:$F$5017,3),IF(AND(A62=\"Soil Cuttings\",E62=\"DRUMS\"),IF(F62<=3,500,(F62-1)*150+200),F62*G62)),2)","v":0},null,"Monitoring/Interim Work    ",false,""]
[null,null,null,null,null,null,null,{"$f":"ROUND(IF(AND(A63=\"Excavation\",E63=\"TONS\"),VLOOKUP(F63,Data!$D$18:$F$5017,3),IF(AND(A63=\"Soil Cuttings\",E63=\"DRUMS\"),IF(F63<=3,500,(F63-1)*150+200),F63*G63)),2)","v":0},null,"Corrective Action Plan Work",false,{"$f":"IF(K63=TRUE,$H$84,\"\")","v":""}]
[null,null,null,null,null,null,null,{"$f":"ROUND(IF(AND(A64=\"Excavation\",E64=\"TONS\"),VLOOKUP(F64,Data!$D$18:$F$5017,3),IF(AND(A64=\"Soil Cuttings\",E64=\"DRUMS\"),IF(F64<=3,500,(F64-1)*150+200),F64*G64)),2)","v":0}]
[null,null,null,null,null,null,null,{"$f":"ROUND(IF(AND(A65=\"Excavation\",E65=\"TONS\"),VLOOKUP(F65,Data!$D$18:$F$5017,3),IF(AND(A65=\"Soil Cuttings\",E65=\"DRUMS\"),IF(F65<=3,500,(F65-1)*150+200),F65*G65)),2)","v":0},null,"Emergency/Initial Work   ",{"$f":"IF(K60=TRUE,1,\"\")","v":""}]
[null,null,null,null,null,null,null,{"$f":"ROUND(IF(AND(A66=\"Excavation\",E66=\"TONS\"),VLOOKUP(F66,Data!$D$18:$F$5017,3),IF(AND(A66=\"Soil Cuttings\",E66=\"DRUMS\"),IF(F66<=3,500,(F66-1)*150+200),F66*G66)),2)","v":0},null,"Investigation Work      ",{"$f":"IF(K61=TRUE,2,\"\")","v":""}]
[null,null,null,null,null,null,null,{"$f":"ROUND(IF(AND(A67=\"Excavation\",E67=\"TONS\"),VLOOKUP(F67,Data!$D$18:$F$5017,3),IF(AND(A67=\"Soil Cuttings\",E67=\"DRUMS\"),IF(F67<=3,500,(F67-1)*150+200),F67*G67)),2)","v":0},null,"Monitoring/Interim Work    ",{"$f":"IF(K62=TRUE,3,\"\")","v":""}]
[null,null,null,null,null,null,null,{"$f":"ROUND(IF(AND(A68=\"Excavation\",E68=\"TONS\"),VLOOKUP(F68,Data!$D$18:$F$5017,3),IF(AND(A68=\"Soil Cuttings\",E68=\"DRUMS\"),IF(F68<=3,500,(F68-1)*150+200),F68*G68)),2)","v":0},null,"Corrective Action Plan Work",{"$f":"IF(K63=TRUE,4,\"\")","v":""}]
[null,null,null,null,null,null,null,{"$f":"ROUND(IF(AND(A69=\"Excavation\",E69=\"TONS\"),VLOOKUP(F69,Data!$D$18:$F$5017,3),IF(AND(A69=\"Soil Cuttings\",E69=\"DRUMS\"),IF(F69<=3,500,(F69-1)*150+200),F69*G69)),2)","v":0}]
[null,null,null,null,null,null,null,{"$f":"ROUND(IF(AND(A70=\"Excavation\",E70=\"TONS\"),VLOOKUP(F70,Data!$D$18:$F$5017,3),IF(AND(A70=\"Soil Cuttings\",E70=\"DRUMS\"),IF(F70<=3,500,(F70-1)*150+200),F70*G70)),2)","v":0}]
[null,null,null,null,null,null,null,{"$f":"ROUND(IF(AND(A71=\"Excavation\",E71=\"TONS\"),VLOOKUP(F71,Data!$D$18:$F$5017,3),IF(AND(A71=\"Soil Cuttings\",E71=\"DRUMS\"),IF(F71<=3,500,(F71-1)*150+200),F71*G71)),2)","v":0}]
[null,null,null,null,null,null,null,{"$f":"ROUND(IF(AND(A72=\"Excavation\",E72=\"TONS\"),VLOOKUP(F72,Data!$D$18:$F$5017,3),IF(AND(A72=\"Soil Cuttings\",E72=\"DRUMS\"),IF(F72<=3,500,(F72-1)*150+200),F72*G72)),2)","v":0}]
[null,null,null,null,null,null,null,{"$f":"ROUND(IF(AND(A73=\"Excavation\",E73=\"TONS\"),VLOOKUP(F73,Data!$D$18:$F$5017,3),IF(AND(A73=\"Soil Cuttings\",E73=\"DRUMS\"),IF(F73<=3,500,(F73-1)*150+200),F73*G73)),2)","v":0}]
[null,null,null,null,null,null,null,{"$f":"ROUND(IF(AND(A74=\"Excavation\",E74=\"TONS\"),VLOOKUP(F74,Data!$D$18:$F$5017,3),IF(AND(A74=\"Soil Cuttings\",E74=\"DRUMS\"),IF(F74<=3,500,(F74-1)*150+200),F74*G74)),2)","v":0}]
[null,null,null,null,null,null,null,{"$f":"ROUND(IF(AND(A75=\"Excavation\",E75=\"TONS\"),VLOOKUP(F75,Data!$D$18:$F$5017,3),IF(AND(A75=\"Soil Cuttings\",E75=\"DRUMS\"),IF(F75<=3,500,(F75-1)*150+200),F75*G75)),2)","v":0}]
[null,null,null,null,null,null,null,{"$f":"ROUND(IF(AND(A76=\"Excavation\",E76=\"TONS\"),VLOOKUP(F76,Data!$D$18:$F$5017,3),IF(AND(A76=\"Soil Cuttings\",E76=\"DRUMS\"),IF(F76<=3,500,(F76-1)*150+200),F76*G76)),2)","v":0}]
[null,null,null,null,null,null,null,{"$f":"ROUND(IF(AND(A77=\"Excavation\",E77=\"TONS\"),VLOOKUP(F77,Data!$D$18:$F$5017,3),IF(AND(A77=\"Soil Cuttings\",E77=\"DRUMS\"),IF(F77<=3,500,(F77-1)*150+200),F77*G77)),2)","v":0}]
[null,null,null,null,null,null,null,{"$f":"ROUND(IF(AND(A78=\"Excavation\",E78=\"TONS\"),VLOOKUP(F78,Data!$D$18:$F$5017,3),IF(AND(A78=\"Soil Cuttings\",E78=\"DRUMS\"),IF(F78<=3,500,(F78-1)*150+200),F78*G78)),2)","v":0}]
[null,null,null,null,null,null,null,{"$f":"ROUND(IF(AND(A79=\"Excavation\",E79=\"TONS\"),VLOOKUP(F79,Data!$D$18:$F$5017,3),IF(AND(A79=\"Soil Cuttings\",E79=\"DRUMS\"),IF(F79<=3,500,(F79-1)*150+200),F79*G79)),2)","v":0}]
[null,null,null,null,null,null,null,{"$f":"ROUND(IF(AND(A80=\"Excavation\",E80=\"TONS\"),VLOOKUP(F80,Data!$D$18:$F$5017,3),IF(AND(A80=\"Soil Cuttings\",E80=\"DRUMS\"),IF(F80<=3,500,(F80-1)*150+200),F80*G80)),2)","v":0}]
[null,null,null,null,null,null,null,{"$f":"ROUND(IF(AND(A81=\"Excavation\",E81=\"TONS\"),VLOOKUP(F81,Data!$D$18:$F$5017,3),IF(AND(A81=\"Soil Cuttings\",E81=\"DRUMS\"),IF(F81<=3,500,(F81-1)*150+200),F81*G81)),2)","v":0}]
["Non-Impacted Soil",null,null,null,"TONS",null,-45,{"$f":"ROUND(IF(AND(A82=\"Excavation\",E82=\"TONS\"),VLOOKUP(F82,Data!$D$18:$F$5017,3),IF(AND(A82=\"Soil Cuttings\",E82=\"DRUMS\"),IF(F82<=3,500,(F82-1)*150+200),F82*G82)),2)","v":0}]
["Treated Soil",null,null,null,"TONS",null,-30,{"$f":"ROUND(IF(AND(A83=\"Excavation\",E83=\"TONS\"),VLOOKUP(F83,Data!$D$18:$F$5017,3),IF(AND(A83=\"Soil Cuttings\",E83=\"DRUMS\"),IF(F83<=3,500,(F83-1)*150+200),F83*G83)),2)","v":0},null,{"$f":"IF(K60=TRUE,$N$17,IF(K61=TRUE,$N$18,IF(K62=TRUE,$N$19,IF(K63=TRUE,$N$20,0))))","v":0}]
["SUBTOTAL OF THIS PAGE",null,null,null,null,null,null,{"$f":"SUM(H60:H83)","v":0}]
["TOTAL DISPOSAL COSTS",null,null,null,null,null,null,{"$f":"SUM(J83)","v":0},null,{"$f":"IF(H85>0,1,0)","v":0}]
["Page               of               (Soil/Water Disposal Supplementary Sheet)"]
["PART 5.B"]
["SOIL/WATER DISPOSAL SUPPLEMENTARY SHEET"]
["Check Event:"]
["1.    The unit rate for purge water disposal related to Groundwater Sampling events is $4.00/gal."]
["2.    All other water disposal is under the unit rate of $0.55 /gal."]
["3.    Do not address the RAC markups on this page.  Indicate markups on the Miscellaneous Supplementary Sheet."]
["4.    Pre-approval is required from the Team Leader or ROG for all work."]
["5.    For disposal invoices: addresses, copies of manifests, bills of lading, etc. must be provided."]
["6.    (Tons [Soil]) X (Cost Per Unit) = Total",null,null,null,null,null,null,null,null," "]
["7.    (Gallons [Water]) X (Cost Per Unit) = Total"]
["8.    Soil drum disposal (not associated with excavation): $500.00 minimum, $200.00 for the first drum, $150.00 each additional "]
["       drum."]
["9.    For excavation/transportation/disposal unit rates, please refer to the MS Excel spreadsheet located at  "]
["      http://www.deq.louisiana.gov/trustfund"]
["10.   For non-impacted soil and onsite, treated soil cost reductions, enter the tonnage value in the bottom two rows."]
["TYPE OF DISPOSAL \n(Soil or Water)","DISPOSAL DATE","RAC\nINVOICE\nNO.","OUTSIDE\nINVOICE\nNO.","TONS, DRUMS OR\nGALLONS","QUANTITY","COST \nPER\nUNIT","TOTAL",null,null,null,"Total"]
[null,null,null,null,null,null,null,{"$f":"ROUND(IF(AND(A103=\"Excavation\",E103=\"TONS\"),VLOOKUP(F103,Data!$D$18:$F$5017,3),IF(AND(A103=\"Soil Cuttings\",E103=\"DRUMS\"),IF(F103<=3,500,(F103-1)*150+200),F103*G103)),2)","v":0},null,"Emergency/Initial Work   ",false,{"$f":"IF(K103=TRUE,$H$127,\"\")","v":""}]
[null,null,null,null,null,null,null,{"$f":"ROUND(IF(AND(A104=\"Excavation\",E104=\"TONS\"),VLOOKUP(F104,Data!$D$18:$F$5017,3),IF(AND(A104=\"Soil Cuttings\",E104=\"DRUMS\"),IF(F104<=3,500,(F104-1)*150+200),F104*G104)),2)","v":0},null,"Investigation Work      ",false,{"$f":"IF(K104=TRUE,$H$127,\"\")","v":""}]
[null,null,null,null,null,null,null,{"$f":"ROUND(IF(AND(A105=\"Excavation\",E105=\"TONS\"),VLOOKUP(F105,Data!$D$18:$F$5017,3),IF(AND(A105=\"Soil Cuttings\",E105=\"DRUMS\"),IF(F105<=3,500,(F105-1)*150+200),F105*G105)),2)","v":0},null,"Monitoring/Interim Work    ",false,""]
[null,null,null,null,null,null,null,{"$f":"ROUND(IF(AND(A106=\"Excavation\",E106=\"TONS\"),VLOOKUP(F106,Data!$D$18:$F$5017,3),IF(AND(A106=\"Soil Cuttings\",E106=\"DRUMS\"),IF(F106<=3,500,(F106-1)*150+200),F106*G106)),2)","v":0},null,"Corrective Action Plan Work",false,""]
[null,null,null,null,null,null,null,{"$f":"ROUND(IF(AND(A107=\"Excavation\",E107=\"TONS\"),VLOOKUP(F107,Data!$D$18:$F$5017,3),IF(AND(A107=\"Soil Cuttings\",E107=\"DRUMS\"),IF(F107<=3,500,(F107-1)*150+200),F107*G107)),2)","v":0}]
[null,null,null,null,null,null,null,{"$f":"ROUND(IF(AND(A108=\"Excavation\",E108=\"TONS\"),VLOOKUP(F108,Data!$D$18:$F$5017,3),IF(AND(A108=\"Soil Cuttings\",E108=\"DRUMS\"),IF(F108<=3,500,(F108-1)*150+200),F108*G108)),2)","v":0},null,"Emergency/Initial Work   ",{"$f":"IF(K103=TRUE,1,\"\")","v":""}]
[null,null,null,null,null,null,null,{"$f":"ROUND(IF(AND(A109=\"Excavation\",E109=\"TONS\"),VLOOKUP(F109,Data!$D$18:$F$5017,3),IF(AND(A109=\"Soil Cuttings\",E109=\"DRUMS\"),IF(F109<=3,500,(F109-1)*150+200),F109*G109)),2)","v":0},null,"Investigation Work      ",{"$f":"IF(K104=TRUE,2,\"\")","v":""}]
[null,null,null,null,null,null,null,{"$f":"ROUND(IF(AND(A110=\"Excavation\",E110=\"TONS\"),VLOOKUP(F110,Data!$D$18:$F$5017,3),IF(AND(A110=\"Soil Cuttings\",E110=\"DRUMS\"),IF(F110<=3,500,(F110-1)*150+200),F110*G110)),2)","v":0},null,"Monitoring/Interim Work    ",{"$f":"IF(K105=TRUE,3,\"\")","v":""}]
[null,null,null,null,null,null,null,{"$f":"ROUND(IF(AND(A111=\"Excavation\",E111=\"TONS\"),VLOOKUP(F111,Data!$D$18:$F$5017,3),IF(AND(A111=\"Soil Cuttings\",E111=\"DRUMS\"),IF(F111<=3,500,(F111-1)*150+200),F111*G111)),2)","v":0},null,"Corrective Action Plan Work",{"$f":"IF(K106=TRUE,4,\"\")","v":""}]
[null,null,null,null,null,null,null,{"$f":"ROUND(IF(AND(A112=\"Excavation\",E112=\"TONS\"),VLOOKUP(F112,Data!$D$18:$F$5017,3),IF(AND(A112=\"Soil Cuttings\",E112=\"DRUMS\"),IF(F112<=3,500,(F112-1)*150+200),F112*G112)),2)","v":0}]
[null,null,null,null,null,null,null,{"$f":"ROUND(IF(AND(A113=\"Excavation\",E113=\"TONS\"),VLOOKUP(F113,Data!$D$18:$F$5017,3),IF(AND(A113=\"Soil Cuttings\",E113=\"DRUMS\"),IF(F113<=3,500,(F113-1)*150+200),F113*G113)),2)","v":0}]
[null,null,null,null,null,null,null,{"$f":"ROUND(IF(AND(A114=\"Excavation\",E114=\"TONS\"),VLOOKUP(F114,Data!$D$18:$F$5017,3),IF(AND(A114=\"Soil Cuttings\",E114=\"DRUMS\"),IF(F114<=3,500,(F114-1)*150+200),F114*G114)),2)","v":0}]
[null,null,null,null,null,null,null,{"$f":"ROUND(IF(AND(A115=\"Excavation\",E115=\"TONS\"),VLOOKUP(F115,Data!$D$18:$F$5017,3),IF(AND(A115=\"Soil Cuttings\",E115=\"DRUMS\"),IF(F115<=3,500,(F115-1)*150+200),F115*G115)),2)","v":0}]
[null,null,null,null,null,null,null,{"$f":"ROUND(IF(AND(A116=\"Excavation\",E116=\"TONS\"),VLOOKUP(F116,Data!$D$18:$F$5017,3),IF(AND(A116=\"Soil Cuttings\",E116=\"DRUMS\"),IF(F116<=3,500,(F116-1)*150+200),F116*G116)),2)","v":0}]
[null,null,null,null,null,null,null,{"$f":"ROUND(IF(AND(A117=\"Excavation\",E117=\"TONS\"),VLOOKUP(F117,Data!$D$18:$F$5017,3),IF(AND(A117=\"Soil Cuttings\",E117=\"DRUMS\"),IF(F117<=3,500,(F117-1)*150+200),F117*G117)),2)","v":0}]
[null,null,null,null,null,null,null,{"$f":"ROUND(IF(AND(A118=\"Excavation\",E118=\"TONS\"),VLOOKUP(F118,Data!$D$18:$F$5017,3),IF(AND(A118=\"Soil Cuttings\",E118=\"DRUMS\"),IF(F118<=3,500,(F118-1)*150+200),F118*G118)),2)","v":0}]
[null,null,null,null,null,null,null,{"$f":"ROUND(IF(AND(A119=\"Excavation\",E119=\"TONS\"),VLOOKUP(F119,Data!$D$18:$F$5017,3),IF(AND(A119=\"Soil Cuttings\",E119=\"DRUMS\"),IF(F119<=3,500,(F119-1)*150+200),F119*G119)),2)","v":0}]
[null,null,null,null,null,null,null,{"$f":"ROUND(IF(AND(A120=\"Excavation\",E120=\"TONS\"),VLOOKUP(F120,Data!$D$18:$F$5017,3),IF(AND(A120=\"Soil Cuttings\",E120=\"DRUMS\"),IF(F120<=3,500,(F120-1)*150+200),F120*G120)),2)","v":0}]
[null,null,null,null,null,null,null,{"$f":"ROUND(IF(AND(A121=\"Excavation\",E121=\"TONS\"),VLOOKUP(F121,Data!$D$18:$F$5017,3),IF(AND(A121=\"Soil Cuttings\",E121=\"DRUMS\"),IF(F121<=3,500,(F121-1)*150+200),F121*G121)),2)","v":0}]
[null,null,null,null,null,null,null,{"$f":"ROUND(IF(AND(A122=\"Excavation\",E122=\"TONS\"),VLOOKUP(F122,Data!$D$18:$F$5017,3),IF(AND(A122=\"Soil Cuttings\",E122=\"DRUMS\"),IF(F122<=3,500,(F122-1)*150+200),F122*G122)),2)","v":0}]
[null,null,null,null,null,null,null,{"$f":"ROUND(IF(AND(A123=\"Excavation\",E123=\"TONS\"),VLOOKUP(F123,Data!$D$18:$F$5017,3),IF(AND(A123=\"Soil Cuttings\",E123=\"DRUMS\"),IF(F123<=3,500,(F123-1)*150+200),F123*G123)),2)","v":0}]
[null,null,null,null,null,null,null,{"$f":"ROUND(IF(AND(A124=\"Excavation\",E124=\"TONS\"),VLOOKUP(F124,Data!$D$18:$F$5017,3),IF(AND(A124=\"Soil Cuttings\",E124=\"DRUMS\"),IF(F124<=3,500,(F124-1)*150+200),F124*G124)),2)","v":0}]
["Non-Impacted Soil",null,null,null,"TONS",null,-45,{"$f":"ROUND(IF(AND(A125=\"Excavation\",E125=\"TONS\"),VLOOKUP(F125,Data!$D$18:$F$5017,3),IF(AND(A125=\"Soil Cuttings\",E125=\"DRUMS\"),IF(F125<=3,500,(F125-1)*150+200),F125*G125)),2)","v":0}]
["Treated Soil",null,null,null,"TONS",null,-30,{"$f":"ROUND(IF(AND(A126=\"Excavation\",E126=\"TONS\"),VLOOKUP(F126,Data!$D$18:$F$5017,3),IF(AND(A126=\"Soil Cuttings\",E126=\"DRUMS\"),IF(F126<=3,500,(F126-1)*150+200),F126*G126)),2)","v":0},null,{"$f":"IF(K103=TRUE,$N$17,IF(K104=TRUE,$N$18,IF(K105=TRUE,$N$19,IF(K106=TRUE,$N$20,0))))","v":0}]
["SUBTOTAL OF THIS PAGE",null,null,null,null,null,null,{"$f":"SUM(H103:H126)","v":0}]
["TOTAL DISPOSAL COSTS",null,null,null,null,null,null,{"$f":"SUM(J126)","v":0},null,{"$f":"IF(H128>0,1,0)","v":0}]
["Page               of               (Soil/Water Disposal Supplementary Sheet)"]
["PART 5.B"]
["SOIL/WATER DISPOSAL SUPPLEMENTARY SHEET"]
["Check Event:"]
["1.    The unit rate for purge water disposal related to Groundwater Sampling events is $4.00/gal."]
["2.    All other water disposal is under the unit rate of $0.55 /gal."]
["3.    Do not address the RAC markups on this page.  Indicate markups on the Miscellaneous Supplementary Sheet."]
["4.    Pre-approval is required from the Team Leader or ROG for all work."]
["5.    For disposal invoices: addresses, copies of manifests, bills of lading, etc. must be provided."]
["6.    (Tons [Soil]) X (Cost Per Unit) = Total",null,null,null,null,null,null,null,null," "]
["7.    (Gallons [Water]) X (Cost Per Unit) = Total"]
["8.    Soil drum disposal (not associated with excavation): $500.00 minimum, $200.00 for the first drum, $150.00 each additional "]
["       drum."]
["9.    For excavation/transportation/disposal unit rates, please refer to the MS Excel spreadsheet located at  "]
["      http://www.deq.louisiana.gov/trustfund"]
["10.   For non-impacted soil and onsite, treated soil cost reductions, enter the tonnage value in the bottom two rows."]
["TYPE OF DISPOSAL \n(Soil or Water)","DISPOSAL DATE","RAC\nINVOICE\nNO.","OUTSIDE\nINVOICE\nNO.","TONS, DRUMS OR\nGALLONS","QUANTITY","COST \nPER\nUNIT","TOTAL",null,null,null,"Total"]
[null,null,null,null,null,null,null,{"$f":"ROUND(IF(AND(A146=\"Excavation\",E146=\"TONS\"),VLOOKUP(F146,Data!$D$18:$F$5017,3),IF(AND(A146=\"Soil Cuttings\",E146=\"DRUMS\"),IF(F146<=3,500,(F146-1)*150+200),F146*G146)),2)","v":0},null,"Emergency/Initial Work   ",false,{"$f":"IF(K146=TRUE,$H$170,\"\")","v":""}]
[null,null,null,null,null,null,null,{"$f":"ROUND(IF(AND(A147=\"Excavation\",E147=\"TONS\"),VLOOKUP(F147,Data!$D$18:$F$5017,3),IF(AND(A147=\"Soil Cuttings\",E147=\"DRUMS\"),IF(F147<=3,500,(F147-1)*150+200),F147*G147)),2)","v":0},null,"Investigation Work      ",false,{"$f":"IF(K147=TRUE,$H$170,\"\")","v":""}]
[null,null,null,null,null,null,null,{"$f":"ROUND(IF(AND(A148=\"Excavation\",E148=\"TONS\"),VLOOKUP(F148,Data!$D$18:$F$5017,3),IF(AND(A148=\"Soil Cuttings\",E148=\"DRUMS\"),IF(F148<=3,500,(F148-1)*150+200),F148*G148)),2)","v":0},null,"Monitoring/Interim Work    ",false,""]
[null,null,null,null,null,null,null,{"$f":"ROUND(IF(AND(A149=\"Excavation\",E149=\"TONS\"),VLOOKUP(F149,Data!$D$18:$F$5017,3),IF(AND(A149=\"Soil Cuttings\",E149=\"DRUMS\"),IF(F149<=3,500,(F149-1)*150+200),F149*G149)),2)","v":0},null,"Corrective Action Plan Work",false,""]
[null,null,null,null,null,null,null,{"$f":"ROUND(IF(AND(A150=\"Excavation\",E150=\"TONS\"),VLOOKUP(F150,Data!$D$18:$F$5017,3),IF(AND(A150=\"Soil Cuttings\",E150=\"DRUMS\"),IF(F150<=3,500,(F150-1)*150+200),F150*G150)),2)","v":0}]
[null,null,null,null,null,null,null,{"$f":"ROUND(IF(AND(A151=\"Excavation\",E151=\"TONS\"),VLOOKUP(F151,Data!$D$18:$F$5017,3),IF(AND(A151=\"Soil Cuttings\",E151=\"DRUMS\"),IF(F151<=3,500,(F151-1)*150+200),F151*G151)),2)","v":0},null,"Emergency/Initial Work   ",{"$f":"IF(K146=TRUE,1,\"\")","v":""}]
[null,null,null,null,null,null,null,{"$f":"ROUND(IF(AND(A152=\"Excavation\",E152=\"TONS\"),VLOOKUP(F152,Data!$D$18:$F$5017,3),IF(AND(A152=\"Soil Cuttings\",E152=\"DRUMS\"),IF(F152<=3,500,(F152-1)*150+200),F152*G152)),2)","v":0},null,"Investigation Work      ",{"$f":"IF(K147=TRUE,2,\"\")","v":""}]
[null,null,null,null,null,null,null,{"$f":"ROUND(IF(AND(A153=\"Excavation\",E153=\"TONS\"),VLOOKUP(F153,Data!$D$18:$F$5017,3),IF(AND(A153=\"Soil Cuttings\",E153=\"DRUMS\"),IF(F153<=3,500,(F153-1)*150+200),F153*G153)),2)","v":0},null,"Monitoring/Interim Work    ",{"$f":"IF(K148=TRUE,3,\"\")","v":""}]
[null,null,null,null,null,null,null,{"$f":"ROUND(IF(AND(A154=\"Excavation\",E154=\"TONS\"),VLOOKUP(F154,Data!$D$18:$F$5017,3),IF(AND(A154=\"Soil Cuttings\",E154=\"DRUMS\"),IF(F154<=3,500,(F154-1)*150+200),F154*G154)),2)","v":0},null,"Corrective Action Plan Work",{"$f":"IF(K149=TRUE,4,\"\")","v":""}]
[null,null,null,null,null,null,null,{"$f":"ROUND(IF(AND(A155=\"Excavation\",E155=\"TONS\"),VLOOKUP(F155,Data!$D$18:$F$5017,3),IF(AND(A155=\"Soil Cuttings\",E155=\"DRUMS\"),IF(F155<=3,500,(F155-1)*150+200),F155*G155)),2)","v":0}]
[null,null,null,null,null,null,null,{"$f":"ROUND(IF(AND(A156=\"Excavation\",E156=\"TONS\"),VLOOKUP(F156,Data!$D$18:$F$5017,3),IF(AND(A156=\"Soil Cuttings\",E156=\"DRUMS\"),IF(F156<=3,500,(F156-1)*150+200),F156*G156)),2)","v":0}]
[null,null,null,null,null,null,null,{"$f":"ROUND(IF(AND(A157=\"Excavation\",E157=\"TONS\"),VLOOKUP(F157,Data!$D$18:$F$5017,3),IF(AND(A157=\"Soil Cuttings\",E157=\"DRUMS\"),IF(F157<=3,500,(F157-1)*150+200),F157*G157)),2)","v":0}]
[null,null,null,null,null,null,null,{"$f":"ROUND(IF(AND(A158=\"Excavation\",E158=\"TONS\"),VLOOKUP(F158,Data!$D$18:$F$5017,3),IF(AND(A158=\"Soil Cuttings\",E158=\"DRUMS\"),IF(F158<=3,500,(F158-1)*150+200),F158*G158)),2)","v":0}]
[null,null,null,null,null,null,null,{"$f":"ROUND(IF(AND(A159=\"Excavation\",E159=\"TONS\"),VLOOKUP(F159,Data!$D$18:$F$5017,3),IF(AND(A159=\"Soil Cuttings\",E159=\"DRUMS\"),IF(F159<=3,500,(F159-1)*150+200),F159*G159)),2)","v":0}]
[null,null,null,null,null,null,null,{"$f":"ROUND(IF(AND(A160=\"Excavation\",E160=\"TONS\"),VLOOKUP(F160,Data!$D$18:$F$5017,3),IF(AND(A160=\"Soil Cuttings\",E160=\"DRUMS\"),IF(F160<=3,500,(F160-1)*150+200),F160*G160)),2)","v":0}]
[null,null,null,null,null,null,null,{"$f":"ROUND(IF(AND(A161=\"Excavation\",E161=\"TONS\"),VLOOKUP(F161,Data!$D$18:$F$5017,3),IF(AND(A161=\"Soil Cuttings\",E161=\"DRUMS\"),IF(F161<=3,500,(F161-1)*150+200),F161*G161)),2)","v":0}]
[null,null,null,null,null,null,null,{"$f":"ROUND(IF(AND(A162=\"Excavation\",E162=\"TONS\"),VLOOKUP(F162,Data!$D$18:$F$5017,3),IF(AND(A162=\"Soil Cuttings\",E162=\"DRUMS\"),IF(F162<=3,500,(F162-1)*150+200),F162*G162)),2)","v":0}]
[null,null,null,null,null,null,null,{"$f":"ROUND(IF(AND(A163=\"Excavation\",E163=\"TONS\"),VLOOKUP(F163,Data!$D$18:$F$5017,3),IF(AND(A163=\"Soil Cuttings\",E163=\"DRUMS\"),IF(F163<=3,500,(F163-1)*150+200),F163*G163)),2)","v":0}]
[null,null,null,null,null,null,null,{"$f":"ROUND(IF(AND(A164=\"Excavation\",E164=\"TONS\"),VLOOKUP(F164,Data!$D$18:$F$5017,3),IF(AND(A164=\"Soil Cuttings\",E164=\"DRUMS\"),IF(F164<=3,500,(F164-1)*150+200),F164*G164)),2)","v":0}]
[null,null,null,null,null,null,null,{"$f":"ROUND(IF(AND(A165=\"Excavation\",E165=\"TONS\"),VLOOKUP(F165,Data!$D$18:$F$5017,3),IF(AND(A165=\"Soil Cuttings\",E165=\"DRUMS\"),IF(F165<=3,500,(F165-1)*150+200),F165*G165)),2)","v":0}]
[null,null,null,null,null,null,null,{"$f":"ROUND(IF(AND(A166=\"Excavation\",E166=\"TONS\"),VLOOKUP(F166,Data!$D$18:$F$5017,3),IF(AND(A166=\"Soil Cuttings\",E166=\"DRUMS\"),IF(F166<=3,500,(F166-1)*150+200),F166*G166)),2)","v":0}]
[null,null,null,null,null,null,null,{"$f":"ROUND(IF(AND(A167=\"Excavation\",E167=\"TONS\"),VLOOKUP(F167,Data!$D$18:$F$5017,3),IF(AND(A167=\"Soil Cuttings\",E167=\"DRUMS\"),IF(F167<=3,500,(F167-1)*150+200),F167*G167)),2)","v":0}]
["Non-Impacted Soil",null,null,null,"TONS",null,-45,{"$f":"ROUND(IF(AND(A168=\"Excavation\",E168=\"TONS\"),VLOOKUP(F168,Data!$D$18:$F$5017,3),IF(AND(A168=\"Soil Cuttings\",E168=\"DRUMS\"),IF(F168<=3,500,(F168-1)*150+200),F168*G168)),2)","v":0}]
["Treated Soil",null,null,null,"TONS",null,-30,{"$f":"ROUND(IF(AND(A169=\"Excavation\",E169=\"TONS\"),VLOOKUP(F169,Data!$D$18:$F$5017,3),IF(AND(A169=\"Soil Cuttings\",E169=\"DRUMS\"),IF(F169<=3,500,(F169-1)*150+200),F169*G169)),2)","v":0},null,{"$f":"IF(K146=TRUE,$N$17,IF(K147=TRUE,$N$18,IF(K148=TRUE,$N$19,IF(K149=TRUE,$N$20,0))))","v":0}]
["SUBTOTAL OF THIS PAGE",null,null,null,null,null,null,{"$f":"SUM(H146:H169)","v":0}]
["TOTAL DISPOSAL COSTS",null,null,null,null,null,null,{"$f":"SUM(J169)","v":0},null,{"$f":"IF(H171>0,1,0)","v":0}]
["Page               of               (Soil/Water Disposal Supplementary Sheet)"]

{"sheet":"Data","index":8,"n_rows":5019,"n_cols":6,"rows_kept":5019,"cut":false,"hidden":true,"merged":[[1,0,1,5],[7,0,7,2]]}
[]
["TONNAGE 1 - 99"]
[]
["Minimum Price",null,null,null,null,8500]
["Price / Ton (1 - 99 tons)",null,null,null,null,100]
[]
[null,null,null,null,"VARIABLE"]
["Tonnage Ranges",null,null,"Range Amounts","Price / Ton","Increments"]
[100,"-",250,{"$f":"C9-A9","v":150},185]
[251,"-",500,{"$f":"C10-C9","v":250},148,0.24666666666667486]
[501,"-",1000,{"$f":"C11-C10","v":500},122,0.1039800000000955]
[1001,"-",2000,{"$f":"C12-C11","v":1000},100,4.408817635271757E-2]
[2001,"<",null,null,90,9.9659659659619825E-3]
[]
[]
[]
[null,null,null,"TONS","PRICE / TON","TOTAL"]
[null,null,null,1,{"$f":"F18/D18","v":8600},{"$f":"+$F$4+($F$5*D18)","v":8600}]
[null,null,null,2,{"$f":"F19/D19","v":4350},8700]
[null,null,null,3,2933.3333333333335,8800]
[null,null,null,4,2225,8900]
[null,null,null,5,1800,9000]
[null,null,null,6,1516.6666666666667,9100]
[null,null,null,7,1314.2857142857142,9200]
[null,null,null,8,1162.5,9300]
[null,null,null,9,1044.4444444444443,9400]
[null,null,null,10,950,9500]
[null,null,null,11,872.72727272727275,9600]
[null,null,null,12,808.33333333333337,9700]
[null,null,null,13,753.84615384615381,9800]
[null,null,null,14,707.14285714285711,9900]
[null,null,null,15,666.66666666666663,10000]
[null,null,null,16,631.25,10100]
[null,null,null,17,600,10200]
[null,null,null,18,572.22222222222217,10300]
[null,null,null,19,547.36842105263156,10400]
[null,null,null,20,525,10500]
[null,null,null,21,504.76190476190476,10600]
[null,null,null,22,486.36363636363637,10700]
[null,null,null,23,469.56521739130437,10800]
[null,null,null,24,454.16666666666669,10900]
[null,null,null,25,440,11000]
[null,null,null,26,426.92307692307691,11100]
[null,null,null,27,414.81481481481484,11200]
[null,null,null,28,403.57142857142856,11300]
[null,null,null,29,393.10344827586209,11400]
[null,null,null,30,383.33333333333331,11500]
[null,null,null,31,374.19354838709677,11600]
[null,null,null,32,365.625,11700]
[null,null,null,33,357.57575757575756,11800]
[null,null,null,34,350,11900]
[null,null,null,35,342.85714285714283,12000]
[null,null,null,36,336.11111111111109,12100]
[null,null,null,37,329.72972972972974,12200]
[null,null,null,38,323.68421052631578,12300]
[null,null,null,39,317.94871794871796,12400]
[null,null,null,40,312.5,12500]
[null,null,null,41,307.3170731707317,12600]
[null,null,null,42,302.38095238095241,12700]
[null,null,null,43,297.67441860465118,12800]
[null,null,null,44,293.18181818181819,12900]
[null,null,null,45,288.88888888888891,13000]
[null,null,null,46,284.78260869565219,13100]
[null,null,null,47,280.85106382978722,13200]
[null,null,null,48,277.08333333333331,13300]
[null,null,null,49,273.46938775510205,13400]
[null,null,null,50,270,13500]
[null,null,null,51,266.66666666666669,13600]
[null,null,null,52,263.46153846153845,13700]
[null,null,null,53,260.37735849056605,13800]
[null,null,null,54,257.40740740740739,13900]
[null,null,null,55,254.54545454545453,14000]
[null,null,null,56,251.78571428571428,14100]
[null,null,null,57,249.12280701754386,14200]
[null,null,null,58,246.55172413793105,14300]
[null,null,null,59,244.06779661016949,14400]
[null,null,null,60,241.66666666666666,14500]
[null,null,null,61,239.34426229508196,14600]
[null,null,null,62,237.09677419354838,14700]
[null,null,null,63,234.92063492063491,14800]
[null,null,null,64,232.8125,14900]
[null,null,null,65,230.76923076923077,{"$f":"+$F$4+($F$5*D82)","v":15000}]
[null,null,null,66,{"$f":"F83/D83","v":228.78787878787878},15100]
[null,null,null,67,226.86567164179104,15200]
[null,null,null,68,225,15300]
[null,null,null,69,223.18840579710144,15400]
[null,null,null,70,221.42857142857142,15500]
[null,null,null,71,219.71830985915494,15600]
[null,null,null,72,218.05555555555554,15700]
[null,null,null,73,216.43835616438355,15800]
[null,null,null,74,214.86486486486487,15900]
[null,null,null,75,213.33333333333334,16000]
[null,null,null,76,211.84210526315789,16100]
[null,null,null,77,210.3896103896104,16200]
[null,null,null,78,208.97435897435898,16300]
[null,null,null,79,207.59493670886076,16400]
[null,null,null,80,206.25,16500]
[null,null,null,81,204.93827160493828,16600]
[null,null,null,82,203.65853658536585,16700]
[null,null,null,83,202.40963855421685,16800]
[null,null,null,84,201.1904761904762,16900]
[null,null,null,85,200,17000]
[null,null,null,86,198.83720930232559,17100]
[null,null,null,87,197.70114942528735,17200]
[null,null,null,88,196.59090909090909,17300]
[null,null,null,89,195.50561797752809,17400]
[null,null,null,90,194.44444444444446,17500]
[null,null,null,91,193.4065934065934,17600]
[null,null,null,92,192.39130434782609,17700]
[null,null,null,93,191.3978494623656,17800]
[null,null,null,94,190.42553191489361,17900]
[null,null,null,95,189.47368421052633,18000]
[null,null,null,96,188.54166666666666,18100]
[null,null,null,97,187.62886597938143,18200]
[null,null,null,98,186.73469387755102,18300]
[null,null,null,99,185.85858585858585,18400]
[null,null,null,100,{"$f":"E9","v":185},{"$f":"E117*D117","v":18500}]
[null,null,null,101,{"$f":"E117-$F$10","v":184.75333333333333},{"$f":"E118*D118","v":18660.086666666666}]
[null,null,null,102,184.50666666666666,18819.68]
[null,null,null,103,184.26,18978.78]
[null,null,null,104,184.01333333333332,19137.386666666665]
[null,null,null,105,183.76666666666665,19295.5]
[null,null,null,106,183.51999999999998,19453.12]
[null,null,null,107,183.27333333333331,19610.246666666666]
[null,null,null,108,183.02666666666664,19766.879999999997]
[null,null,null,109,182.77999999999997,19923.019999999997]
[null,null,null,110,182.5333333333333,20078.666666666664]
[null,null,null,111,182.28666666666663,20233.819999999996]
[null,null,null,112,182.03999999999996,20388.479999999996]
[null,null,null,113,181.79333333333329,20542.646666666664]
[null,null,null,114,181.54666666666662,20696.319999999996]
[null,null,null,115,181.29999999999995,20849.499999999996]
[null,null,null,116,181.05333333333328,21002.186666666661]
[null,null,null,117,180.80666666666662,21154.379999999994]
[null,null,null,118,180.55999999999995,21306.079999999994]
[null,null,null,119,180.31333333333328,21457.28666666666]
[null,null,null,120,180.06666666666661,21607.999999999993]
[null,null,null,121,179.81999999999994,21758.219999999994]
[null,null,null,122,179.57333333333327,21907.946666666659]
[null,null,null,123,179.3266666666666,22057.179999999993]
[null,null,null,124,179.07999999999993,22205.919999999991]
[null,null,null,125,178.83333333333326,22354.166666666657]
[null,null,null,126,178.58666666666659,22501.919999999991]
[null,null,null,127,178.33999999999992,22649.179999999989]
[null,null,null,128,178.09333333333325,22795.946666666656]
[null,null,null,129,177.84666666666658,22942.21999999999]
[null,null,null,130,177.59999999999991,23087.999999999989]
[null,null,null,131,177.35333333333324,23233.286666666656]
[null,null,null,132,177.10666666666657,23378.079999999987]
[null,null,null,133,176.8599999999999,23522.379999999986]
[null,null,null,134,176.61333333333323,23666.186666666654]
[null,null,null,135,176.36666666666656,23809.499999999985]
[null,null,null,136,176.11999999999989,23952.319999999985]
[null,null,null,137,175.87333333333322,24094.646666666653]
[null,null,null,138,175.62666666666655,24236.479999999985]
[null,null,null,139,175.37999999999988,24377.819999999985]
[null,null,null,140,175.13333333333321,24518.66666666665]
[null,null,null,141,174.88666666666654,24659.019999999982]
[null,null,null,142,174.63999999999987,24798.879999999983]
[null,null,null,143,174.3933333333332,24938.246666666648]
[null,null,null,144,174.14666666666653,25077.119999999981]
[null,null,null,145,173.89999999999986,25215.499999999982]
[null,null,null,146,173.65333333333319,25353.386666666647]
[null,null,null,147,173.40666666666652,25490.779999999981]
[null,null,null,148,173.15999999999985,25627.679999999978]
[null,null,null,149,172.91333333333318,25764.086666666644]
[null,null,null,150,172.66666666666652,25899.999999999978]
[null,null,null,151,172.41999999999985,26035.419999999976]
[null,null,null,152,172.17333333333318,26170.346666666643]
[null,null,null,153,171.92666666666651,26304.779999999977]
[null,null,null,154,171.67999999999984,26438.719999999976]
[null,null,null,155,171.43333333333317,26572.166666666642]
[null,null,null,156,171.1866666666665,26705.119999999974]
[null,null,null,157,170.93999999999983,26837.579999999973]
[null,null,null,158,170.69333333333316,26969.54666666664]
[null,null,null,159,170.44666666666649,27101.019999999971]
[null,null,null,160,170.19999999999982,27231.999999999971]
[null,null,null,161,169.95333333333315,27362.486666666638]
[null,null,null,162,169.70666666666648,27492.47999999997]
[null,null,null,163,169.45999999999981,27621.97999999997]
[null,null,null,164,169.21333333333314,27750.986666666635]
[null,null,null,165,{"$f":"E181-$F$10","v":168.96666666666647},{"$f":"E182*D182","v":27879.499999999967}]
[null,null,null,166,168.7199999999998,28007.519999999968]
[null,null,null,167,168.47333333333313,28135.046666666633]
[null,null,null,168,168.22666666666646,28262.079999999965]
[null,null,null,169,167.97999999999979,28388.619999999966]
[null,null,null,170,167.73333333333312,28514.666666666631]
[null,null,null,171,167.48666666666645,28640.219999999965]
[null,null,null,172,167.23999999999978,28765.279999999962]
[null,null,null,173,166.99333333333311,28889.846666666628]
[null,null,null,174,166.74666666666644,29013.919999999962]
[null,null,null,175,166.49999999999977,29137.49999999996]
[null,null,null,176,166.2533333333331,29260.586666666626]
[null,null,null,177,166.00666666666643,29383.17999999996]
[null,null,null,178,165.75999999999976,29505.279999999959]
[null,null,null,179,165.51333333333309,29626.886666666625]
[null,null,null,180,165.26666666666642,29747.999999999956]
[null,null,null,181,165.01999999999975,29868.619999999955]
[null,null,null,182,164.77333333333308,29988.746666666622]
[null,null,null,183,164.52666666666642,30108.379999999954]
[null,null,null,184,164.27999999999975,30227.519999999953]
[null,null,null,185,164.03333333333308,30346.166666666621]
[null,null,null,186,163.78666666666641,30464.319999999952]
[null,null,null,187,163.53999999999974,30581.979999999952]
[null,null,null,188,163.29333333333307,30699.146666666617]
[null,null,null,189,163.0466666666664,30815.819999999949]
[null,null,null,190,162.79999999999973,30931.999999999949]
[null,null,null,191,162.55333333333306,31047.686666666614]
[null,null,null,192,162.30666666666639,31162.879999999946]
[null,null,null,193,162.05999999999972,31277.579999999947]
[null,null,null,194,161.81333333333305,31391.786666666612]
[null,null,null,195,161.56666666666638,31505.499999999945]
[null,null,null,196,161.31999999999971,31618.719999999943]
[null,null,null,197,161.07333333333304,31731.446666666609]
[null,null,null,198,160.82666666666637,31843.679999999942]
[null,null,null,199,160.5799999999997,31955.41999999994]
[null,null,null,200,160.33333333333303,32066.666666666606]
[null,null,null,201,160.08666666666636,32177.41999999994]
[null,null,null,202,159.83999999999969,32287.679999999938]
[null,null,null,203,159.59333333333302,32397.446666666605]
[null,null,null,204,159.34666666666635,32506.719999999936]
[null,null,null,205,159.09999999999968,32615.499999999935]
[null,null,null,206,158.85333333333301,32723.786666666601]
[null,null,null,207,158.60666666666634,32831.579999999936]
[null,null,null,208,158.35999999999967,32938.879999999932]
[null,null,null,209,158.113333333333,33045.686666666596]
[null,null,null,210,157.86666666666633,33151.999999999927]
[null,null,null,211,157.61999999999966,33257.819999999927]
[null,null,null,212,157.37333333333299,33363.146666666595]
[null,null,null,213,157.12666666666632,33467.97999999993]
[null,null,null,214,156.87999999999965,33572.319999999927]
[null,null,null,215,156.63333333333298,33676.166666666591]
[null,null,null,216,156.38666666666631,33779.519999999924]
[null,null,null,217,156.13999999999965,33882.379999999925]
[null,null,null,218,155.89333333333298,33984.746666666586]
[null,null,null,219,155.64666666666631,34086.619999999923]
[null,null,null,220,155.39999999999964,34187.99999999992]
[null,null,null,221,155.15333333333297,34288.886666666585]
[null,null,null,222,154.9066666666663,34389.279999999919]
[null,null,null,223,154.65999999999963,34489.17999999992]
[null,null,null,224,154.41333333333296,34588.586666666582]
[null,null,null,225,154.16666666666629,34687.499999999913]
[null,null,null,226,153.91999999999962,34785.919999999911]
[null,null,null,227,153.67333333333295,34883.846666666577]
[null,null,null,228,153.42666666666628,34981.279999999912]
[null,null,null,229,{"$f":"E245-$F$10","v":153.17999999999961},{"$f":"E246*D246","v":35078.219999999914}]
[null,null,null,230,152.93333333333294,35174.666666666577]
[null,null,null,231,152.68666666666627,35270.619999999908]
[null,null,null,232,152.4399999999996,35366.079999999907]
[null,null,null,233,152.19333333333293,35461.046666666574]
[null,null,null,234,151.94666666666626,35555.519999999902]
[null,null,null,235,151.69999999999959,35649.499999999905]
[null,null,null,236,151.45333333333292,35742.986666666569]
[null,null,null,237,151.20666666666625,35835.979999999901]
[null,null,null,238,150.95999999999958,35928.479999999901]
[null,null,null,239,150.71333333333291,36020.486666666569]
[null,null,null,240,150.46666666666624,36111.999999999898]
[null,null,null,241,150.21999999999957,36203.019999999895]
[null,null,null,242,149.9733333333329,36293.54666666656]
[null,null,null,243,149.72666666666623,36383.579999999893]
[null,null,null,244,149.47999999999956,36473.119999999893]
[null,null,null,245,149.23333333333289,36562.166666666562]
[null,null,null,246,148.98666666666622,36650.719999999892]
[null,null,null,247,148.73999999999955,36738.77999999989]
[null,null,null,248,148.49333333333288,36826.346666666555]
[null,null,null,249,148.24666666666621,36913.419999999889]
[null,null,null,250,147.99999999999955,36999.999999999884]
[null,null,null,251,{"$f":"E267-$F$11","v":147.89601999999945},37121.901019999859]
[null,null,null,252,147.79203999999936,37243.594079999835]
[null,null,null,253,147.68805999999927,37365.079179999811]
[null,null,null,254,147.58407999999918,37486.356319999788]
[null,null,null,255,147.48009999999908,37607.425499999765]
[null,null,null,256,147.37611999999899,37728.286719999742]
[null,null,null,257,147.2721399999989,37848.939979999719]
[null,null,null,258,147.16815999999881,37969.385279999689]
[null,null,null,259,147.06417999999871,38089.622619999667]
[null,null,null,260,146.96019999999862,38209.651999999638]
[null,null,null,261,146.85621999999853,38329.473419999616]
[null,null,null,262,146.75223999999844,38449.086879999588]
[null,null,null,263,146.64825999999834,38568.492379999567]
[null,null,null,264,146.54427999999825,38687.689919999539]
[null,null,null,265,146.44029999999816,38806.679499999511]
[null,null,null,266,146.33631999999807,38925.461119999483]
[null,null,null,267,{"$f":"E283-$F$11","v":146.23233999999798},39044.034779999456]
[null,null,null,268,146.12835999999788,39162.400479999429]
[null,null,null,269,146.02437999999779,39280.558219999402]
[null,null,null,270,145.9203999999977,39398.507999999376]
[null,null,null,271,145.81641999999761,39516.24981999935]
[null,null,null,272,145.71243999999751,39633.783679999324]
[null,null,null,273,145.60845999999742,39751.109579999298]
[null,null,null,274,145.50447999999733,39868.227519999265]
[null,null,null,275,145.40049999999724,39985.13749999924]
[null,null,null,276,145.29651999999714,40101.839519999208]
[null,null,null,277,145.19253999999705,40218.333579999184]
[null,null,null,278,145.08855999999696,40334.619679999152]
[null,null,null,279,144.98457999999687,40450.697819999128]
[null,null,null,280,144.88059999999678,40566.567999999097]
[null,null,null,281,144.77661999999668,40682.230219999066]
[null,null,null,282,144.67263999999659,40797.684479999036]
[null,null,null,283,144.5686599999965,40912.930779999006]
[null,null,null,284,144.46467999999641,41027.969119998976]
[null,null,null,285,144.36069999999631,41142.799499998946]
[null,null,null,286,144.25671999999622,41257.421919998917]
[null,null,null,287,144.15273999999613,41371.836379998887]
[null,null,null,288,144.04875999999604,41486.042879998859]
[null,null,null,289,143.94477999999594,41600.04141999883]
[null,null,null,290,143.84079999999585,41713.831999998794]
[null,null,null,291,143.73681999999576,41827.414619998766]
[null,null,null,292,143.63283999999567,41940.789279998731]
[null,null,null,293,143.52885999999557,{"$f":"E310*D310","v":42053.955979998704}]
[null,null,null,294,143.42487999999548,42166.914719998669]
[null,null,null,295,143.32089999999539,42279.665499998642]
[null,null,null,296,143.2169199999953,42392.208319998608]
[null,null,null,297,143.11293999999521,42504.543179998574]
[null,null,null,298,143.00895999999511,42616.670079998541]
[null,null,null,299,142.90497999999502,42728.589019998508]
[null,null,null,300,142.80099999999493,42840.299999998475]
[null,null,null,301,142.69701999999484,42951.803019998442]
[null,null,null,302,142.59303999999474,43063.09807999841]
[null,null,null,303,142.48905999999465,43174.185179998378]
[null,null,null,304,142.38507999999456,43285.064319998346]
[null,null,null,305,142.28109999999447,43395.735499998314]
[null,null,null,306,142.17711999999437,43506.198719998276]
[null,null,null,307,142.07313999999428,43616.453979998245]
[null,null,null,308,141.96915999999419,43726.501279998207]
[null,null,null,309,141.8651799999941,43836.340619998176]
[null,null,null,310,141.76119999999401,43945.971999998139]
[null,null,null,311,141.65721999999391,44055.395419998109]
[null,null,null,312,141.55323999999382,44164.610879998072]
[null,null,null,313,141.44925999999373,44273.618379998035]
[null,null,null,314,141.34527999999364,44382.417919997999]
[null,null,null,315,{"$f":"E331-$F$11","v":141.24129999999354},44491.009499997963]
[null,null,null,316,141.13731999999345,44599.393119997927]
[null,null,null,317,141.03333999999336,44707.568779997891]
[null,null,null,318,140.92935999999327,44815.536479997856]
[null,null,null,319,140.82537999999317,44923.296219997821]
[null,null,null,320,140.72139999999308,45030.847999997786]
[null,null,null,321,140.61741999999299,45138.191819997752]
[null,null,null,322,140.5134399999929,45245.32767999771]
[null,null,null,323,140.40945999999281,45352.255579997676]
[null,null,null,324,140.30547999999271,45458.975519997635]
[null,null,null,325,140.20149999999262,45565.487499997602]
[null,null,null,326,140.09751999999253,45671.791519997561]
[null,null,null,327,139.99353999999244,45777.887579997529]
[null,null,null,328,139.88955999999234,45883.775679997489]
[null,null,null,329,139.78557999999225,45989.455819997449]
[null,null,null,330,139.68159999999216,46094.92799999741]
[null,null,null,331,139.57761999999207,46200.192219997371]
[null,null,null,332,139.47363999999197,46305.248479997332]
[null,null,null,333,139.36965999999188,46410.096779997293]
[null,null,null,334,139.26567999999179,46514.737119997255]
[null,null,null,335,139.1616999999917,46619.169499997217]
[null,null,null,336,139.0577199999916,46723.393919997179]
[null,null,null,337,138.95373999999151,46827.410379997142]
[null,null,null,338,138.84975999999142,46931.218879997097]
[null,null,null,339,138.74577999999133,47034.81941999706]
[null,null,null,340,138.64179999999124,47138.211999997016]
[null,null,null,341,138.53781999999114,47241.39661999698]
[null,null,null,342,138.43383999999105,47344.373279996937]
[null,null,null,343,138.32985999999096,47447.141979996901]
[null,null,null,344,138.22587999999087,47549.702719996858]
[null,null,null,345,138.12189999999077,47652.055499996815]
[null,null,null,346,138.01791999999068,47754.200319996773]
[null,null,null,347,137.91393999999059,47856.137179996731]
[null,null,null,348,137.8099599999905,47957.866079996689]
[null,null,null,349,137.7059799999904,48059.387019996648]
[null,null,null,350,137.60199999999031,48160.699999996606]
[null,null,null,351,137.49801999999022,48261.805019996566]
[null,null,null,352,137.39403999999013,48362.702079996525]
[null,null,null,353,137.29005999999004,48463.391179996484]
[null,null,null,354,137.18607999998994,48563.872319996437]
[null,null,null,355,137.08209999998985,48664.145499996397]
[null,null,null,356,136.97811999998976,48764.21071999635]
[null,null,null,357,136.87413999998967,{"$f":"E374*D374","v":48864.067979996311}]
[null,null,null,358,136.77015999998957,48963.717279996265]
[null,null,null,359,136.66617999998948,49063.158619996226]
[null,null,null,360,136.56219999998939,49162.39199999618]
[null,null,null,361,136.4582199999893,49261.417419996134]
[null,null,null,362,136.3542399999892,49360.234879996089]
[null,null,null,363,136.25025999998911,49458.844379996044]
[null,null,null,364,136.14627999998902,49557.245919995999]
[null,null,null,365,136.04229999998893,49655.439499995955]
[null,null,null,366,135.93831999998883,49753.425119995911]
[null,null,null,367,135.83433999998874,49851.202779995867]
[null,null,null,368,135.73035999998865,49948.772479995823]
[null,null,null,369,135.62637999998856,50046.13421999578]
[null,null,null,370,135.52239999998847,50143.287999995729]
[null,null,null,371,135.41841999998837,50240.233819995687]
[null,null,null,372,135.31443999998828,50336.971679995637]
[null,null,null,373,135.21045999998819,50433.501579995595]
[null,null,null,374,135.1064799999881,50529.823519995545]
[null,null,null,375,135.002499999988,50625.937499995503]
[null,null,null,376,134.89851999998791,50721.843519995455]
[null,null,null,377,134.79453999998782,50817.541579995406]
[null,null,null,378,134.69055999998773,50913.031679995358]
[null,null,null,379,{"$f":"E395-$F$11","v":134.58657999998763},51008.31381999531]
[null,null,null,380,134.48259999998754,51103.387999995262]
[null,null,null,381,134.37861999998745,51198.254219995215]
[null,null,null,382,134.27463999998736,51292.912479995168]
[null,null,null,383,134.17065999998727,51387.362779995121]
[null,null,null,384,134.06667999998717,51481.605119995074]
[null,null,null,385,133.96269999998708,51575.639499995028]
[null,null,null,386,133.85871999998699,51669.465919994975]
[null,null,null,387,133.7547399999869,51763.084379994929]
[null,null,null,388,133.6507599999868,51856.494879994876]
[null,null,null,389,133.54677999998671,51949.697419994831]
[null,null,null,390,133.44279999998662,52042.691999994779]
[null,null,null,391,133.33881999998653,52135.478619994734]
[null,null,null,392,133.23483999998643,52228.057279994682]
[null,null,null,393,133.13085999998634,52320.427979994631]
[null,null,null,394,133.02687999998625,52412.59071999458]
[null,null,null,395,132.92289999998616,52504.545499994529]
[null,null,null,396,132.81891999998606,52596.292319994478]
[null,null,null,397,132.71493999998597,52687.831179994428]
[null,null,null,398,132.61095999998588,52779.162079994378]
[null,null,null,399,132.50697999998579,52870.285019994328]
[null,null,null,400,132.4029999999857,52961.199999994278]
[null,null,null,401,132.2990199999856,53051.907019994229]
[null,null,null,402,132.19503999998551,53142.406079994173]
[null,null,null,403,132.09105999998542,53232.697179994124]
[null,null,null,404,131.98707999998533,53322.780319994068]
[null,null,null,405,131.88309999998523,53412.65549999402]
[null,null,null,406,131.77911999998514,53502.322719993965]
[null,null,null,407,131.67513999998505,53591.781979993917]
[null,null,null,408,131.57115999998496,53681.033279993862]
[null,null,null,409,131.46717999998486,53770.076619993808]
[null,null,null,410,131.36319999998477,53858.911999993754]
[null,null,null,411,131.25921999998468,53947.5394199937]
[null,null,null,412,131.15523999998459,54035.958879993646]
[null,null,null,413,131.0512599999845,54124.170379993593]
[null,null,null,414,130.9472799999844,54212.17391999354]
[null,null,null,415,130.84329999998431,54299.969499993487]
[null,null,null,416,130.73931999998422,54387.557119993435]
[null,null,null,417,130.63533999998413,54474.936779993383]
[null,null,null,418,130.53135999998403,54562.108479993323]
[null,null,null,419,130.42737999998394,54649.072219993272]
[null,null,null,420,130.32339999998385,54735.827999993213]
[null,null,null,421,130.21941999998376,{"$f":"E438*D438","v":54822.375819993162}]
[null,null,null,422,130.11543999998366,54908.715679993104]
[null,null,null,423,130.01145999998357,54994.847579993053]
[null,null,null,424,129.90747999998348,55080.771519992995]
[null,null,null,425,129.80349999998339,55166.487499992938]
[null,null,null,426,129.69951999998329,55251.995519992881]
[null,null,null,427,129.5955399999832,55337.295579992824]
[null,null,null,428,129.49155999998311,55422.387679992768]
[null,null,null,429,129.38757999998302,55507.271819992711]
[null,null,null,430,129.28359999998293,55591.947999992655]
[null,null,null,431,129.17961999998283,55676.4162199926]
[null,null,null,432,129.07563999998274,55760.676479992544]
[null,null,null,433,128.97165999998265,55844.728779992489]
[null,null,null,434,128.86767999998256,55928.573119992427]
[null,null,null,435,128.76369999998246,56012.209499992372]
[null,null,null,436,128.65971999998237,56095.63791999231]
[null,null,null,437,128.55573999998228,56178.858379992256]
[null,null,null,438,128.45175999998219,56261.870879992195]
[null,null,null,439,128.34777999998209,56344.675419992142]
[null,null,null,440,128.243799999982,56427.271999992081]
[null,null,null,441,128.13981999998191,56509.660619992021]
[null,null,null,442,128.03583999998182,56591.841279991961]
[null,null,null,443,{"$f":"E459-$F$11","v":127.93185999998173},56673.813979991901]
[null,null,null,444,127.82787999998163,56755.578719991841]
[null,null,null,445,127.72389999998154,56837.135499991782]
[null,null,null,446,127.61991999998145,56918.484319991723]
[null,null,null,447,127.51593999998136,56999.625179991664]
[null,null,null,448,127.41195999998126,57080.558079991606]
[null,null,null,449,127.30797999998117,57161.283019991548]
[null,null,null,450,127.20399999998108,57241.799999991483]
[null,null,null,451,127.10001999998099,57322.109019991425]
[null,null,null,452,126.99603999998089,57402.210079991361]
[null,null,null,453,126.8920599999808,57482.103179991303]
[null,null,null,454,126.78807999998071,57561.788319991239]
[null,null,null,455,126.68409999998062,57641.265499991183]
[null,null,null,456,126.58011999998052,57720.534719991119]
[null,null,null,457,126.47613999998043,57799.595979991056]
[null,null,null,458,126.37215999998034,57878.449279990993]
[null,null,null,459,126.26817999998025,57957.09461999093]
[null,null,null,460,126.16419999998016,58035.531999990868]
[null,null,null,461,126.06021999998006,58113.761419990806]
[null,null,null,462,125.95623999997997,58191.782879990744]
[null,null,null,463,125.85225999997988,58269.596379990682]
[null,null,null,464,125.74827999997979,58347.201919990621]
[null,null,null,465,125.64429999997969,58424.59949999056]
[null,null,null,466,125.5403199999796,58501.789119990492]
[null,null,null,467,125.43633999997951,58578.770779990431]
[null,null,null,468,125.33235999997942,58655.544479990363]
[null,null,null,469,125.22837999997932,58732.110219990303]
[null,null,null,470,125.12439999997923,58808.467999990236]
[null,null,null,471,125.02041999997914,58884.617819990177]
[null,null,null,472,124.91643999997905,58960.55967999011]
[null,null,null,473,124.81245999997896,59036.293579990044]
[null,null,null,474,124.70847999997886,59111.819519989978]
[null,null,null,475,124.60449999997877,59187.137499989913]
[null,null,null,476,124.50051999997868,59262.247519989847]
[null,null,null,477,124.39653999997859,59337.149579989782]
[null,null,null,478,124.29255999997849,59411.843679989717]
[null,null,null,479,124.1885799999784,59486.329819989653]
[null,null,null,480,124.08459999997831,59560.607999989588]
[null,null,null,481,123.98061999997822,59634.678219989524]
[null,null,null,482,123.87663999997812,59708.540479989453]
[null,null,null,483,123.77265999997803,59782.19477998939]
[null,null,null,484,123.66867999997794,59855.641119989319]
[null,null,null,485,123.56469999997785,{"$f":"E502*D502","v":59928.879499989256}]
[null,null,null,486,123.46071999997775,60001.909919989186]
[null,null,null,487,123.35673999997766,60074.732379989124]
[null,null,null,488,123.25275999997757,60147.346879989054]
[null,null,null,489,123.14877999997748,60219.753419988985]
[null,null,null,490,123.04479999997739,60291.951999988916]
[null,null,null,491,122.94081999997729,60363.942619988848]
[null,null,null,492,122.8368399999772,60435.725279988779]
[null,null,null,493,122.73285999997711,60507.299979988711]
[null,null,null,494,122.62887999997702,60578.666719988643]
[null,null,null,495,122.52489999997692,60649.825499988576]
[null,null,null,496,122.42091999997683,60720.776319988508]
[null,null,null,497,122.31693999997674,60791.519179988441]
[null,null,null,498,122.21295999997665,60862.054079988367]
[null,null,null,499,122.10897999997655,60932.381019988301]
[null,null,null,500,122.00499999997646,61002.499999988228]
[null,null,null,501,{"$f":"E517-$F$12","v":121.96091182362375},61102.416823635496]
[null,null,null,502,121.91682364727103,61202.245470930058]
[null,null,null,503,121.87273547091831,61301.985941871913]
[null,null,null,504,121.8286472945656,61401.638236461062]
[null,null,null,505,121.78455911821288,61501.202354697503]
[null,null,null,506,121.74047094186017,61600.678296581245]
[null,null,null,507,121.69638276550745,61700.066062112281]
[null,null,null,508,121.65229458915474,61799.365651290602]
[null,null,null,509,121.60820641280202,61898.577064116231]
[null,null,null,510,121.5641182364493,61997.700300589146]
[null,null,null,511,121.52003006009659,62096.735360709354]
[null,null,null,512,121.47594188374387,62195.682244476862]
[null,null,null,513,121.43185370739116,62294.540951891664]
[null,null,null,514,121.38776553103844,62393.311482953759]
[null,null,null,515,121.34367735468572,62491.993837663147]
[null,null,null,516,121.29958917833301,62590.588016019829]
[null,null,null,517,121.25550100198029,62689.09401802381]
[null,null,null,518,121.21141282562758,62787.511843675085]
[null,null,null,519,121.16732464927486,62885.841492973654]
[null,null,null,520,121.12323647292214,62984.082965919515]
[null,null,null,521,121.07914829656943,63082.23626251267]
[null,null,null,522,121.03506012021671,63180.301382753125]
[null,null,null,523,120.990971943864,63278.278326640873]
[null,null,null,524,120.94688376751128,63376.167094175908]
[null,null,null,525,120.90279559115857,63473.96768535825]
[null,null,null,526,120.85870741480585,63571.680100187878]
[null,null,null,527,120.81461923845313,63669.304338664799]
[null,null,null,528,120.77053106210042,63766.84040078902]
[null,null,null,529,120.7264428857477,63864.288286560535]
[null,null,null,530,120.68235470939499,63961.647995979343]
[null,null,null,531,120.63826653304227,64058.919529045445]
[null,null,null,532,120.59417835668955,64156.102885758839]
[null,null,null,533,120.55009018033684,64253.198066119534]
[null,null,null,534,120.50600200398412,64350.205070127522]
[null,null,null,535,120.46191382763141,64447.123897782803]
[null,null,null,536,120.41782565127869,64543.954549085378]
[null,null,null,537,120.37373747492597,64640.697024035246]
[null,null,null,538,120.32964929857326,64737.351322632414]
[null,null,null,539,120.28556112222054,64833.917444876875]
[null,null,null,540,120.24147294586783,64930.395390768623]
[null,null,null,541,120.19738476951511,65026.785160307678]
[null,null,null,542,120.15329659316239,65123.086753494019]
[null,null,null,543,120.10920841680968,65219.300170327653]
[null,null,null,544,120.06512024045696,65315.425410808588]
[null,null,null,545,120.02103206410425,65411.462474936816]
[null,null,null,546,119.97694388775153,65507.411362712337]
[null,null,null,547,119.93285571139882,65603.272074135151]
[null,null,null,548,119.8887675350461,65699.044609205259]
[null,null,null,549,119.84467935869338,{"$f":"E566*D566","v":65794.728967922667}]
[null,null,null,550,119.80059118234067,65890.325150287361]
[null,null,null,551,119.75650300598795,65985.833156299355]
[null,null,null,552,119.71241482963524,66081.25298595865]
[null,null,null,553,119.66832665328252,66176.584639265231]
[null,null,null,554,119.6242384769298,66271.828116219112]
[null,null,null,555,119.58015030057709,66366.98341682028]
[null,null,null,556,119.53606212422437,66462.050541068747]
[null,null,null,557,119.49197394787166,66557.029488964516]
[null,null,null,558,119.44788577151894,66651.92026050757]
[null,null,null,559,119.40379759516622,66746.722855697924]
[null,null,null,560,119.35970941881351,66841.437274535565]
[null,null,null,561,119.31562124246079,66936.063517020506]
[null,null,null,562,119.27153306610808,67030.601583152733]
[null,null,null,563,119.22744488975536,67125.051472932275]
[null,null,null,564,119.18335671340265,67219.413186359088]
[null,null,null,565,{"$f":"E581-$F$12","v":119.13926853704993},67313.686723433217]
[null,null,null,566,119.09518036069721,67407.872084154616]
[null,null,null,567,119.0510921843445,67501.969268523331]
[null,null,null,568,119.00700400799178,67595.978276539332]
[null,null,null,569,118.96291583163907,67689.899108202633]
[null,null,null,570,118.91882765528635,67783.73176351322]
[null,null,null,571,118.87473947893363,67877.476242471108]
[null,null,null,572,118.83065130258092,67971.132545076282]
[null,null,null,573,118.7865631262282,68064.700671328756]
[null,null,null,574,118.74247494987549,68158.18062122853]
[null,null,null,575,118.69838677352277,68251.572394775591]
[null,null,null,576,118.65429859717005,68344.875991969951]
[null,null,null,577,118.61021042081734,68438.091412811598]
[null,null,null,578,118.56612224446462,68531.218657300546]
[null,null,null,579,118.52203406811191,68624.257725436793]
[null,null,null,580,118.47794589175919,68717.208617220327]
[null,null,null,581,118.43385771540648,68810.071332651161]
[null,null,null,582,118.38976953905376,68902.845871729281]
[null,null,null,583,118.34568136270104,68995.532234454702]
[null,null,null,584,118.30159318634833,69088.130420827423]
[null,null,null,585,118.25750500999561,69180.64043084743]
[null,null,null,586,118.2134168336429,69273.062264514738]
[null,null,null,587,118.16932865729018,69365.395921829331]
[null,null,null,588,118.12524048093746,69457.641402791225]
[null,null,null,589,118.08115230458475,69549.79870740042]
[null,null,null,590,118.03706412823203,69641.8678356569]
[null,null,null,591,117.99297595187932,69733.848787560681]
[null,null,null,592,117.9488877755266,69825.741563111747]
[null,null,null,593,117.90479959917388,69917.546162310115]
[null,null,null,594,117.86071142282117,70009.262585155768]
[null,null,null,595,117.81662324646845,70100.890831648736]
[null,null,null,596,117.77253507011574,70192.430901788975]
[null,null,null,597,117.72844689376302,70283.88279557653]
[null,null,null,598,117.6843587174103,70375.246513011356]
[null,null,null,599,117.64027054105759,70466.522054093497]
[null,null,null,600,117.59618236470487,70557.709418822924]
[null,null,null,601,117.55209418835216,70648.808607199651]
[null,null,null,602,117.50800601199944,70739.819619223665]
[null,null,null,603,117.46391783564673,70830.742454894978]
[null,null,null,604,117.41982965929401,70921.577114213578]
[null,null,null,605,117.37574148294129,71012.323597179478]
[null,null,null,606,117.33165330658858,71102.981903792679]
[null,null,null,607,117.28756513023586,71193.552034053166]
[null,null,null,608,117.24347695388315,71284.033987960953]
[null,null,null,609,117.19938877753043,71374.427765516026]
[null,null,null,610,117.15530060117771,71464.733366718399]
[null,null,null,611,117.111212424825,71554.950791568073]
[null,null,null,612,117.06712424847228,71645.080040065033]
[null,null,null,613,117.02303607211957,{"$f":"E630*D630","v":71735.121112209294}]
[null,null,null,614,116.97894789576685,71825.07400800084]
[null,null,null,615,116.93485971941413,71914.938727439687]
[null,null,null,616,116.89077154306142,72004.715270525834]
[null,null,null,617,116.8466833667087,72094.403637259267]
[null,null,null,618,116.80259519035599,72184.003827640001]
[null,null,null,619,116.75850701400327,72273.515841668021]
[null,null,null,620,116.71441883765056,72362.939679343341]
[null,null,null,621,116.67033066129784,72452.275340665961]
[null,null,null,622,116.62624248494512,72541.522825635868]
[null,null,null,623,116.58215430859241,72630.682134253075]
[null,null,null,624,116.53806613223969,72719.753266517568]
[null,null,null,625,116.49397795588698,72808.736222429361]
[null,null,null,626,116.44988977953426,72897.63100198844]
[null,null,null,627,116.40580160318154,72986.437605194835]
[null,null,null,628,116.36171342682883,73075.1560320485]
[null,null,null,629,{"$f":"E645-$F$12","v":116.31762525047611},73163.786282549481]
[null,null,null,630,116.2735370741234,73252.328356697733]
[null,null,null,631,116.22944889777068,73340.782254493301]
[null,null,null,632,116.18536072141796,73429.147975936154]
[null,null,null,633,116.14127254506525,73517.425521026307]
[null,null,null,634,116.09718436871253,73605.614889763747]
[null,null,null,635,116.05309619235982,73693.716082148487]
[null,null,null,636,116.0090080160071,73781.729098180513]
[null,null,null,637,115.96491983965439,73869.653937859839]
[null,null,null,638,115.92083166330167,73957.490601186466]
[null,null,null,639,115.87674348694895,74045.239088160379]
[null,null,null,640,115.83265531059624,74132.899398781592]
[null,null,null,641,115.78856713424352,74220.471533050091]
[null,null,null,642,115.74447895789081,74307.955490965891]
[null,null,null,643,115.70039078153809,74395.351272528991]
[null,null,null,644,115.65630260518537,74482.658877739377]
[null,null,null,645,115.61221442883266,74569.878306597064]
[null,null,null,646,115.56812625247994,74657.009559102036]
[null,null,null,647,115.52403807612723,74744.052635254309]
[null,null,null,648,115.47994989977451,74831.007535053883]
[null,null,null,649,115.43586172342179,74917.874258500742]
[null,null,null,650,115.39177354706908,75004.652805594902]
[null,null,null,651,115.34768537071636,75091.343176336348]
[null,null,null,652,115.30359719436365,75177.945370725094]
[null,null,null,653,115.25950901801093,75264.459388761141]
[null,null,null,654,115.21542084165822,75350.885230444474]
[null,null,null,655,115.1713326653055,75437.222895775107]
[null,null,null,656,115.12724448895278,75523.472384753026]
[null,null,null,657,115.08315631260007,75609.633697378245]
[null,null,null,658,115.03906813624735,75695.706833650751]
[null,null,null,659,114.99497995989464,75781.691793570571]
[null,null,null,660,114.95089178354192,75867.588577137663]
[null,null,null,661,114.9068036071892,75953.39718435207]
[null,null,null,662,114.86271543083649,76039.117615213749]
[null,null,null,663,114.81862725448377,76124.749869722742]
[null,null,null,664,114.77453907813106,76210.293947879021]
[null,null,null,665,114.73045090177834,76295.749849682601]
[null,null,null,666,114.68636272542562,76381.117575133467]
[null,null,null,667,114.64227454907291,76466.397124231633]
[null,null,null,668,114.59818637272019,76551.588496977085]
[null,null,null,669,114.55409819636748,76636.691693369838]
[null,null,null,670,114.51001002001476,76721.706713409891]
[null,null,null,671,114.46592184366204,76806.63355709723]
[null,null,null,672,114.42183366730933,76891.472224431869]
[null,null,null,673,114.37774549095661,76976.222715413795]
[null,null,null,674,114.3336573146039,77060.88503004302]
[null,null,null,675,114.28956913825118,77145.459168319547]
[null,null,null,676,114.24548096189847,77229.945130243359]
[null,null,null,677,114.20139278554575,{"$f":"E694*D694","v":77314.342915814472}]
[null,null,null,678,114.15730460919303,77398.65252503287]
[null,null,null,679,114.11321643284032,77482.87395789857]
[null,null,null,680,114.0691282564876,77567.007214411569]
[null,null,null,681,114.02504008013489,77651.052294571855]
[null,null,null,682,113.98095190378217,77735.009198379441]
[null,null,null,683,113.93686372742945,77818.877925834313]
[null,null,null,684,113.89277555107674,77902.658476936485]
[null,null,null,685,113.84868737472402,77986.350851685958]
[null,null,null,686,113.80459919837131,78069.955050082717]
[null,null,null,687,113.76051102201859,78153.471072126777]
[null,null,null,688,113.71642284566587,78236.898917818122]
[null,null,null,689,113.67233466931316,78320.238587156768]
[null,null,null,690,113.62824649296044,78403.490080142699]
[null,null,null,691,113.58415831660773,78486.653396775946]
[null,null,null,692,113.54007014025501,78569.728537056464]
[null,null,null,693,{"$f":"E709-$F$12","v":113.4959819639023},78652.715500984297]
[null,null,null,694,113.45189378754958,78735.614288559402]
[null,null,null,695,113.40780561119686,78818.424899781821]
[null,null,null,696,113.36371743484415,78901.147334651527]
[null,null,null,697,113.31962925849143,78983.781593168533]
[null,null,null,698,113.27554108213872,79066.327675332825]
[null,null,null,699,113.231452905786,79148.785581144417]
[null,null,null,700,113.18736472943328,79231.155310603295]
[null,null,null,701,113.14327655308057,79313.436863709474]
[null,null,null,702,113.09918837672785,79395.630240462953]
[null,null,null,703,113.05510020037514,79477.735440863718]
[null,null,null,704,113.01101202402242,79559.752464911784]
[null,null,null,705,112.9669238476697,79641.681312607136]
[null,null,null,706,112.92283567131699,79723.521983949788]
[null,null,null,707,112.87874749496427,79805.27447893974]
[null,null,null,708,112.83465931861156,79886.938797576979]
[null,null,null,709,112.79057114225884,79968.514939861518]
[null,null,null,710,112.74648296590613,80050.002905793343]
[null,null,null,711,112.70239478955341,80131.402695372468]
[null,null,null,712,112.65830661320069,80212.714308598894]
[null,null,null,713,112.61421843684798,80293.937745472605]
[null,null,null,714,112.57013026049526,80375.073005993618]
[null,null,null,715,112.52604208414255,80456.120090161916]
[null,null,null,716,112.48195390778983,80537.078997977515]
[null,null,null,717,112.43786573143711,80617.949729440414]
[null,null,null,718,112.3937775550844,80698.732284550599]
[null,null,null,719,112.34968937873168,80779.426663308084]
[null,null,null,720,112.30560120237897,80860.032865712856]
[null,null,null,721,112.26151302602625,80940.550891764928]
[null,null,null,722,112.21742484967353,81020.980741464286]
[null,null,null,723,112.17333667332082,81101.322414810958]
[null,null,null,724,112.1292484969681,81181.575911804903]
[null,null,null,725,112.08516032061539,81261.741232446162]
[null,null,null,726,112.04107214426267,81341.818376734693]
[null,null,null,727,111.99698396790996,81421.807344670538]
[null,null,null,728,111.95289579155724,81501.70813625367]
[null,null,null,729,111.90880761520452,81581.520751484102]
[null,null,null,730,111.86471943885181,81661.24519036182]
[null,null,null,731,111.82063126249909,81740.881452886839]
[null,null,null,732,111.77654308614638,81820.429539059143]
[null,null,null,733,111.73245490979366,81899.889448878748]
[null,null,null,734,111.68836673344094,81979.261182345654]
[null,null,null,735,111.64427855708823,82058.544739459845]
[null,null,null,736,111.60019038073551,82137.740120221337]
[null,null,null,737,111.5561022043828,82216.847324630115]
[null,null,null,738,111.51201402803008,82295.866352686193]
[null,null,null,739,111.46792585167736,82374.797204389572]
[null,null,null,740,111.42383767532465,82453.639879740236]
[null,null,null,741,111.37974949897193,{"$f":"E758*D758","v":82532.394378738201}]
[null,null,null,742,111.33566132261922,82611.060701383452]
[null,null,null,743,111.2915731462665,82689.638847676004]
[null,null,null,744,111.24748496991378,82768.128817615856]
[null,null,null,745,111.20339679356107,82846.530611202994]
[null,null,null,746,111.15930861720835,82924.844228437432]
[null,null,null,747,111.11522044085564,83003.069669319157]
[null,null,null,748,111.07113226450292,83081.206933848182]
[null,null,null,749,111.02704408815021,83159.256022024507]
[null,null,null,750,110.98295591179749,83237.216933848118]
[null,null,null,751,110.93886773544477,83315.08966931903]
[null,null,null,752,110.89477955909206,83392.874228437227]
[null,null,null,753,110.85069138273934,83470.570611202726]
[null,null,null,754,110.80660320638663,83548.17881761551]
[null,null,null,755,110.76251503003391,83625.698847675609]
[null,null,null,756,110.71842685368119,83703.130701382979]
[null,null,null,757,{"$f":"E773-$F$12","v":110.67433867732848},83780.474378737665]
[null,null,null,758,110.63025050097576,83857.729879739622]
[null,null,null,759,110.58616232462305,83934.897204388893]
[null,null,null,760,110.54207414827033,84011.976352685451]
[null,null,null,761,110.49798597191761,84088.96732462931]
[null,null,null,762,110.4538977955649,84165.870120220454]
[null,null,null,763,110.40980961921218,84242.684739458899]
[null,null,null,764,110.36572144285947,84319.411182344629]
[null,null,null,765,110.32163326650675,84396.04944887766]
[null,null,null,766,110.27754509015404,84472.599539057992]
[null,null,null,767,110.23345691380132,84549.061452885609]
[null,null,null,768,110.1893687374486,84625.435190360527]
[null,null,null,769,110.14528056109589,84701.720751482731]
[null,null,null,770,110.10119238474317,84777.918136252236]
[null,null,null,771,110.05710420839046,84854.027344669041]
[null,null,null,772,110.01301603203774,84930.048376733132]
[null,null,null,773,109.96892785568502,85005.981232444523]
[null,null,null,774,109.92483967933231,85081.8259118032]
[null,null,null,775,109.88075150297959,85157.582414809178]
[null,null,null,776,109.83666332662688,85233.250741462456]
[null,null,null,777,109.79257515027416,85308.83089176302]
[null,null,null,778,109.74848697392144,85384.322865710885]
[null,null,null,779,109.70439879756873,85459.726663306035]
[null,null,null,780,109.66031062121601,85535.042284548486]
[null,null,null,781,109.6162224448633,85610.269729438238]
[null,null,null,782,109.57213426851058,85685.408997975275]
[null,null,null,783,109.52804609215787,85760.460090159613]
[null,null,null,784,109.48395791580515,85835.423005991237]
[null,null,null,785,109.43986973945243,85910.297745470161]
[null,null,null,786,109.39578156309972,85985.084308596372]
[null,null,null,787,109.351693386747,86059.782695369897]
[null,null,null,788,109.30760521039429,86134.392905790693]
[null,null,null,789,109.26351703404157,86208.914939858805]
[null,null,null,790,109.21942885768885,86283.348797574188]
[null,null,null,791,109.17534068133614,86357.694478936886]
[null,null,null,792,109.13125250498342,86431.95198394687]
[null,null,null,793,109.08716432863071,86506.121312604155]
[null,null,null,794,109.04307615227799,86580.202464908725]
[null,null,null,795,108.99898797592527,86654.195440860596]
[null,null,null,796,108.95489979957256,86728.100240459753]
[null,null,null,797,108.91081162321984,86801.91686370621]
[null,null,null,798,108.86672344686713,86875.645310599968]
[null,null,null,799,108.82263527051441,86949.285581141012]
[null,null,null,800,108.77854709416169,87022.837675329356]
[null,null,null,801,108.73445891780898,87096.301593164986]
[null,null,null,802,108.69037074145626,87169.677334647917]
[null,null,null,803,108.64628256510355,87242.964899778148]
[null,null,null,804,108.60219438875083,87316.164288555665]
[null,null,null,805,108.55810621239812,{"$f":"E822*D822","v":87389.275500980482}]
[null,null,null,806,108.5140180360454,87462.298537052586]
[null,null,null,807,108.46992985969268,87535.23339677199]
[null,null,null,808,108.42584168333997,87608.080080138694]
[null,null,null,809,108.38175350698725,87680.838587152684]
[null,null,null,810,108.33766533063454,87753.508917813975]
[null,null,null,811,108.29357715428182,87826.091072122552]
[null,null,null,812,108.2494889779291,87898.585050078429]
[null,null,null,813,108.20540080157639,87970.990851681607]
[null,null,null,814,108.16131262522367,88043.30847693207]
[null,null,null,815,108.11722444887096,88115.537925829834]
[null,null,null,816,108.07313627251824,88187.679198374884]
[null,null,null,817,108.02904809616552,88259.732294567235]
[null,null,null,818,107.98495991981281,88331.697214406871]
[null,null,null,819,107.94087174346009,88403.573957893823]
[null,null,null,820,107.89678356710738,88475.362525028046]
[null,null,null,821,{"$f":"E837-$F$12","v":107.85269539075466},88547.062915809584]
[null,null,null,822,107.80860721440195,88618.675130238393]
[null,null,null,823,107.76451903804923,88690.199168314517]
[null,null,null,824,107.72043086169651,88761.635030037927]
[null,null,null,825,107.6763426853438,88832.982715408638]
[null,null,null,826,107.63225450899108,88904.242224426634]
[null,null,null,827,107.58816633263837,88975.413557091932]
[null,null,null,828,107.54407815628565,89046.496713404515]
[null,null,null,829,107.49998997993293,89117.491693364398]
[null,null,null,830,107.45590180358022,89188.398496971582]
[null,null,null,831,107.4118136272275,89259.217124226052]
[null,null,null,832,107.36772545087479,89329.947575127822]
[null,null,null,833,107.32363727452207,89400.589849676879]
[null,null,null,834,107.27954909816935,89471.143947873235]
[null,null,null,835,107.23546092181664,89541.609869716893]
[null,null,null,836,107.19137274546392,89611.987615207836]
[null,null,null,837,107.14728456911121,89682.27718434608]
[null,null,null,838,107.10319639275849,89752.478577131609]
[null,null,null,839,107.05910821640578,89822.591793564439]
[null,null,null,840,107.01502004005306,89892.61683364457]
[null,null,null,841,106.97093186370034,89962.553697371986]
[null,null,null,842,106.92684368734763,90032.402384746703]
[null,null,null,843,106.88275551099491,90102.162895768706]
[null,null,null,844,106.8386673346422,90171.83523043801]
[null,null,null,845,106.79457915828948,90241.419388754613]
[null,null,null,846,106.75049098193676,90310.915370718503]
[null,null,null,847,106.70640280558405,90380.323176329694]
[null,null,null,848,106.66231462923133,90449.64280558817]
[null,null,null,849,106.61822645287862,90518.874258493946]
[null,null,null,850,106.5741382765259,90588.017535047009]
[null,null,null,851,106.53005010017318,90657.072635247387]
[null,null,null,852,106.48596192382047,90726.039559095036]
[null,null,null,853,106.44187374746775,90794.91830659]
[null,null,null,854,106.39778557111504,90863.708877732235]
[null,null,null,855,106.35369739476232,90932.411272521786]
[null,null,null,856,106.30960921840961,91001.025490958622]
[null,null,null,857,106.26552104205689,91069.551533042759]
[null,null,null,858,106.22143286570417,91137.989398774182]
[null,null,null,859,106.17734468935146,91206.339088152905]
[null,null,null,860,106.13325651299874,91274.600601178914]
[null,null,null,861,106.08916833664603,91342.773937852224]
[null,null,null,862,106.04508016029331,91410.859098172834]
[null,null,null,863,106.00099198394059,91478.85608214073]
[null,null,null,864,105.95690380758788,91546.764889755927]
[null,null,null,865,105.91281563123516,91614.585521018409]
[null,null,null,866,105.86872745488245,91682.317975928192]
[null,null,null,867,105.82463927852973,91749.962254485275]
[null,null,null,868,105.78055110217701,91817.518356689645]
[null,null,null,869,105.7364629258243,{"$f":"E886*D886","v":91884.986282541315}]
[null,null,null,870,105.69237474947158,91952.366032040271]
[null,null,null,871,105.64828657311887,92019.657605186527]
[null,null,null,872,105.60419839676615,92086.861001980084]
[null,null,null,873,105.56011022041343,92153.976222420926]
[null,null,null,874,105.51602204406072,92221.003266509069]
[null,null,null,875,105.471933867708,92287.942134244498]
[null,null,null,876,105.42784569135529,92354.792825627228]
[null,null,null,877,105.38375751500257,92421.555340657258]
[null,null,null,878,105.33966933864986,92488.229679334574]
[null,null,null,879,105.29558116229714,92554.81584165919]
[null,null,null,880,105.25149298594442,92621.313827631093]
[null,null,null,881,105.20740480959171,92687.723637250296]
[null,null,null,882,105.16331663323899,92754.045270516785]
[null,null,null,883,105.11922845688628,92820.278727430588]
[null,null,null,884,105.07514028053356,92886.424007991664]
[null,null,null,885,{"$f":"E901-$F$12","v":105.03105210418084},92952.481112200054]
[null,null,null,886,104.98696392782813,93018.450040055715]
[null,null,null,887,104.94287575147541,93084.330791558692]
[null,null,null,888,104.8987875751227,93150.123366708955]
[null,null,null,889,104.85469939876998,93215.827765506518]
[null,null,null,890,104.81061122241726,93281.443987951367]
[null,null,null,891,104.76652304606455,93346.972034043516]
[null,null,null,892,104.72243486971183,93412.411903782951]
[null,null,null,893,104.67834669335912,93477.763597169687]
[null,null,null,894,104.6342585170064,93543.027114203724]
[null,null,null,895,104.59017034065369,93608.202454885046]
[null,null,null,896,104.54608216430097,93673.289619213669]
[null,null,null,897,104.50199398794825,93738.288607189577]
[null,null,null,898,104.45790581159554,93803.199418812786]
[null,null,null,899,104.41381763524282,93868.022054083296]
[null,null,null,900,104.36972945889011,93932.756513001092]
[null,null,null,901,104.32564128253739,93997.402795566188]
[null,null,null,902,104.28155310618467,94061.96090177857]
[null,null,null,903,104.23746492983196,94126.430831638252]
[null,null,null,904,104.19337675347924,94190.812585145235]
[null,null,null,905,104.14928857712653,94255.106162299504]
[null,null,null,906,104.10520040077381,94319.311563101073]
[null,null,null,907,104.06111222442109,94383.428787549929]
[null,null,null,908,104.01702404806838,94447.457835646084]
[null,null,null,909,103.97293587171566,94511.398707389541]
[null,null,null,910,103.92884769536295,94575.251402780283]
[null,null,null,911,103.88475951901023,94639.015921818325]
[null,null,null,912,103.84067134265752,94702.692264503654]
[null,null,null,913,103.7965831663048,94766.280430836283]
[null,null,null,914,103.75249498995208,94829.780420816198]
[null,null,null,915,103.70840681359937,94893.192234443428]
[null,null,null,916,103.66431863724665,94956.515871717929]
[null,null,null,917,103.62023046089394,95019.751332639746]
[null,null,null,918,103.57614228454122,95082.898617208833]
[null,null,null,919,103.5320541081885,95145.957725425236]
[null,null,null,920,103.48796593183579,95208.928657288925]
[null,null,null,921,103.44387775548307,95271.811412799914]
[null,null,null,922,103.39978957913036,95334.605991958189]
[null,null,null,923,103.35570140277764,95397.312394763765]
[null,null,null,924,103.31161322642492,95459.930621216627]
[null,null,null,925,103.26752505007221,95522.460671316789]
[null,null,null,926,103.22343687371949,95584.902545064251]
[null,null,null,927,103.17934869736678,95647.256242459]
[null,null,null,928,103.13526052101406,95709.521763501049]
[null,null,null,929,103.09117234466135,95771.699108190383]
[null,null,null,930,103.04708416830863,95833.788276527019]
[null,null,null,931,103.00299599195591,95895.789268510955]
[null,null,null,932,102.9589078156032,95957.702084142176]
[null,null,null,933,102.91481963925048,{"$f":"E950*D950","v":96019.526723420699}]
[null,null,null,934,102.87073146289777,96081.263186346507]
[null,null,null,935,102.82664328654505,96142.911472919615]
[null,null,null,936,102.78255511019233,96204.471583140024]
[null,null,null,937,102.73846693383962,96265.943517007719]
[null,null,null,938,102.6943787574869,96327.327274522715]
[null,null,null,939,102.65029058113419,96388.622855684996]
[null,null,null,940,102.60620240478147,96449.830260494578]
[null,null,null,941,102.56211422842875,96510.949488951461]
[null,null,null,942,102.51802605207604,96571.980541055629]
[null,null,null,943,102.47393787572332,96632.923416807098]
[null,null,null,944,102.42984969937061,96693.778116205853]
[null,null,null,945,102.38576152301789,96754.544639251908]
[null,null,null,946,102.34167334666517,96815.222985945249]
[null,null,null,947,102.29758517031246,96875.813156285905]
[null,null,null,948,102.25349699395974,96936.315150273833]
[null,null,null,949,{"$f":"E965-$F$12","v":102.20940881760703},96996.728967909075]
[null,null,null,950,102.16532064125431,97057.054609191589]
[null,null,null,951,102.1212324649016,97117.292074121418]
[null,null,null,952,102.07714428854888,97177.441362698533]
[null,null,null,953,102.03305611219616,97237.502474922949]
[null,null,null,954,101.98896793584345,97297.47541079465]
[null,null,null,955,101.94487975949073,97357.360170313652]
[null,null,null,956,101.90079158313802,97417.15675347994]
[null,null,null,957,101.8567034067853,97476.865160293528]
[null,null,null,958,101.81261523043258,97536.485390754417]
[null,null,null,959,101.76852705407987,97596.017444862591]
[null,null,null,960,101.72443887772715,97655.461322618066]
[null,null,null,961,101.68035070137444,97714.817024020827]
[null,null,null,962,101.63626252502172,97774.084549070889]
[null,null,null,963,101.592174348669,97833.263897768251]
[null,null,null,964,101.54808617231629,97892.355070112899]
[null,null,null,965,101.50399799596357,97951.358066104847]
[null,null,null,966,101.45990981961086,98010.272885744082]
[null,null,null,967,101.41582164325814,98069.099529030616]
[null,null,null,968,101.37173346690543,98127.837995964452]
[null,null,null,969,101.32764529055271,98186.488286545573]
[null,null,null,970,101.28355711419999,98245.050400773995]
[null,null,null,971,101.23946893784728,98303.524338649702]
[null,null,null,972,101.19538076149456,98361.91010017271]
[null,null,null,973,101.15129258514185,98420.207685343019]
[null,null,null,974,101.10720440878913,98478.417094160613]
[null,null,null,975,101.06311623243641,98536.538326625508]
[null,null,null,976,101.0190280560837,98594.571382737689]
[null,null,null,977,100.97493987973098,98652.516262497171]
[null,null,null,978,100.93085170337827,98710.372965903938]
[null,null,null,979,100.88676352702555,98768.141492958021]
[null,null,null,980,100.84267535067283,98825.821843659374]
[null,null,null,981,100.79858717432012,98883.414018008043]
[null,null,null,982,100.7544989979674,98940.918016003983]
[null,null,null,983,100.71041082161469,98998.333837647238]
[null,null,null,984,100.66632264526197,99055.66148293778]
[null,null,null,985,100.62223446890926,99112.900951875621]
[null,null,null,986,100.57814629255654,99170.052244460749]
[null,null,null,987,100.53405811620382,99227.115360693177]
[null,null,null,988,100.48996993985111,99284.090300572891]
[null,null,null,989,100.44588176349839,99340.977064099905]
[null,null,null,990,100.40179358714568,99397.77565127422]
[null,null,null,991,100.35770541079296,99454.486062095821]
[null,null,null,992,100.31361723444024,99511.108296564722]
[null,null,null,993,100.26952905808753,99567.642354680909]
[null,null,null,994,100.22544088173481,99624.088236444397]
[null,null,null,995,100.1813527053821,99680.445941855185]
[null,null,null,996,100.13726452902938,99736.715470913259]
[null,null,null,997,100.09317635267666,{"$f":"E1014*D1014","v":99792.896823618634}]
[null,null,null,998,100.04908817632395,99848.989999971294]
[null,null,null,999,100.00499999997123,99904.994999971255]
[null,null,null,1000,99.960911823618517,99960.911823618517]
[null,null,null,1001,{"$f":"E1017-$F$13","v":99.950945857652556},100050.89680351022]
[null,null,null,1002,99.940979891686595,100140.86185146996]
[null,null,null,1003,99.931013925720634,100230.8069674978]
[null,null,null,1004,99.921047959754674,100320.73215159369]
[null,null,null,1005,99.911081993788713,100410.63740375766]
[null,null,null,1006,99.901116027822752,100500.52272398969]
[null,null,null,1007,99.891150061856791,100590.38811228979]
[null,null,null,1008,99.881184095890831,100680.23356865796]
[null,null,null,1009,99.87121812992487,100770.0590930942]
[null,null,null,1010,99.861252163958909,100859.8646855985]
[null,null,null,1011,99.851286197992948,100949.65034617086]
[null,null,null,1012,99.841320232026987,101039.41607481131]
[null,null,null,1013,99.831354266061027,101129.16187151981]
[null,null,null,1014,99.821388300095066,101218.8877362964]
[null,null,null,1015,99.811422334129105,101308.59366914105]
[null,null,null,1016,99.801456368163144,101398.27967005376]
[null,null,null,1017,99.791490402197184,101487.94573903453]
[null,null,null,1018,99.781524436231223,101577.59187608339]
[null,null,null,1019,99.771558470265262,101667.21808120031]
[null,null,null,1020,99.761592504299301,101756.82435438529]
[null,null,null,1021,99.75162653833334,101846.41069563835]
[null,null,null,1022,99.74166057236738,101935.97710495946]
[null,null,null,1023,99.731694606401419,102025.52358234866]
[null,null,null,1024,99.721728640435458,102115.05012780591]
[null,null,null,1025,99.711762674469497,102204.55674133124]
[null,null,null,1026,99.701796708503537,102294.04342292463]
[null,null,null,1027,99.691830742537576,102383.51017258609]
[null,null,null,1028,99.681864776571615,102472.95699031562]
[null,null,null,1029,99.671898810605654,102562.38387611322]
[null,null,null,1030,99.661932844639693,102651.79082997888]
[null,null,null,1031,99.651966878673733,102741.17785191262]
[null,null,null,1032,99.642000912707772,102830.54494191441]
[null,null,null,1033,99.632034946741811,102919.8920999843]
[null,null,null,1034,99.62206898077585,103009.21932612223]
[null,null,null,1035,99.61210301480989,103098.52662032824]
[null,null,null,1036,99.602137048843929,103187.81398260231]
[null,null,null,1037,99.592171082877968,103277.08141294445]
[null,null,null,1038,99.582205116912007,103366.32891135466]
[null,null,null,1039,99.572239150946046,103455.55647783294]
[null,null,null,1040,99.562273184980086,103544.76411237929]
[null,null,null,1041,99.552307219014125,103633.95181499371]
[null,null,null,1042,99.542341253048164,103723.11958567619]
[null,null,null,1043,99.532375287082203,103812.26742442674]
[null,null,null,1044,99.522409321116243,103901.39533124535]
[null,null,null,1045,99.512443355150282,103990.50330613204]
[null,null,null,1046,99.502477389184321,104079.5913490868]
[null,null,null,1047,99.49251142321836,104168.65946010963]
[null,null,null,1048,99.4825454572524,104257.70763920051]
[null,null,null,1049,99.472579491286439,104346.73588635947]
[null,null,null,1050,99.462613525320478,104435.74420158651]
[null,null,null,1051,99.452647559354517,104524.7325848816]
[null,null,null,1052,99.442681593388556,104613.70103624476]
[null,null,null,1053,99.432715627422596,104702.64955567599]
[null,null,null,1054,99.422749661456635,104791.5781431753]
[null,null,null,1055,99.412783695490674,104880.48679874266]
[null,null,null,1056,99.402817729524713,104969.3755223781]
[null,null,null,1057,99.392851763558753,105058.2443140816]
[null,null,null,1058,99.382885797592792,105147.09317385318]
[null,null,null,1059,99.372919831626831,105235.92210169282]
[null,null,null,1060,99.36295386566087,105324.73109760052]
[null,null,null,1061,99.352987899694909,{"$f":"E1078*D1078","v":105413.52016157629}]
[null,null,null,1062,99.343021933728949,105502.28929362014]
[null,null,null,1063,99.333055967762988,105591.03849373206]
[null,null,null,1064,99.323090001797027,105679.76776191204]
[null,null,null,1065,{"$f":"E1081-$F$13","v":99.313124035831066},105768.47709816009]
[null,null,null,1066,99.303158069865106,105857.1665024762]
[null,null,null,1067,99.293192103899145,105945.83597486038]
[null,null,null,1068,99.283226137933184,106034.48551531264]
[null,null,null,1069,99.273260171967223,106123.11512383296]
[null,null,null,1070,99.263294206001262,106211.72480042135]
[null,null,null,1071,99.253328240035302,106300.31454507781]
[null,null,null,1072,99.243362274069341,106388.88435780234]
[null,null,null,1073,99.23339630810338,106477.43423859493]
[null,null,null,1074,99.223430342137419,106565.96418745558]
[null,null,null,1075,99.213464376171459,106654.47420438431]
[null,null,null,1076,99.203498410205498,106742.96428938111]
[null,null,null,1077,99.193532444239537,106831.43444244599]
[null,null,null,1078,99.183566478273576,106919.88466357891]
[null,null,null,1079,99.173600512307615,107008.31495277991]
[null,null,null,1080,99.163634546341655,107096.72531004899]
[null,null,null,1081,99.153668580375694,107185.11573538612]
[null,null,null,1082,99.143702614409733,107273.48622879133]
[null,null,null,1083,99.133736648443772,107361.8367902646]
[null,null,null,1084,99.123770682477812,107450.16741980595]
[null,null,null,1085,99.113804716511851,107538.47811741536]
[null,null,null,1086,99.10383875054589,107626.76888309284]
[null,null,null,1087,99.093872784579929,107715.03971683838]
[null,null,null,1088,99.083906818613968,107803.290618652]
[null,null,null,1089,99.073940852648008,107891.52158853368]
[null,null,null,1090,99.063974886682047,107979.73262648343]
[null,null,null,1091,99.054008920716086,108067.92373250125]
[null,null,null,1092,99.044042954750125,108156.09490658714]
[null,null,null,1093,99.034076988784165,108244.24614874109]
[null,null,null,1094,99.024111022818204,108332.37745896312]
[null,null,null,1095,99.014145056852243,108420.4888372532]
[null,null,null,1096,99.004179090886282,108508.58028361137]
[null,null,null,1097,98.994213124920321,108596.65179803759]
[null,null,null,1098,98.984247158954361,108684.70338053189]
[null,null,null,1099,98.9742811929884,108772.73503109426]
[null,null,null,1100,98.964315227022439,108860.74674972468]
[null,null,null,1101,98.954349261056478,108948.73853642319]
[null,null,null,1102,98.944383295090518,109036.71039118976]
[null,null,null,1103,98.934417329124557,109124.66231402439]
[null,null,null,1104,98.924451363158596,109212.59430492709]
[null,null,null,1105,98.914485397192635,109300.50636389786]
[null,null,null,1106,98.904519431226674,109388.3984909367]
[null,null,null,1107,98.894553465260714,109476.27068604362]
[null,null,null,1108,98.884587499294753,109564.12294921858]
[null,null,null,1109,98.874621533328792,109651.95528046163]
[null,null,null,1110,98.864655567362831,109739.76767977275]
[null,null,null,1111,98.854689601396871,109827.56014715192]
[null,null,null,1112,98.84472363543091,109915.33268259917]
[null,null,null,1113,98.834757669464949,110003.08528611448]
[null,null,null,1114,98.824791703498988,110090.81795769787]
[null,null,null,1115,98.814825737533027,110178.53069734933]
[null,null,null,1116,98.804859771567067,110266.22350506885]
[null,null,null,1117,98.794893805601106,110353.89638085643]
[null,null,null,1118,98.784927839635145,110441.54932471209]
[null,null,null,1119,98.774961873669184,110529.18233663581]
[null,null,null,1120,98.764995907703224,110616.7954166276]
[null,null,null,1121,98.755029941737263,110704.38856468747]
[null,null,null,1122,98.745063975771302,110791.9617808154]
[null,null,null,1123,98.735098009805341,110879.51506501139]
[null,null,null,1124,98.72513204383938,110967.04841727547]
[null,null,null,1125,98.71516607787342,{"$f":"E1142*D1142","v":111054.5618376076}]
[null,null,null,1126,98.705200111907459,111142.0553260078]
[null,null,null,1127,98.695234145941498,111229.52888247606]
[null,null,null,1128,98.685268179975537,111316.98250701241]
[null,null,null,1129,{"$f":"E1145-$F$13","v":98.675302214009577},111404.41619961681]
[null,null,null,1130,98.665336248043616,111491.82996028928]
[null,null,null,1131,98.655370282077655,111579.22378902983]
[null,null,null,1132,98.645404316111694,111666.59768583844]
[null,null,null,1133,98.635438350145733,111753.95165071511]
[null,null,null,1134,98.625472384179773,111841.28568365987]
[null,null,null,1135,98.615506418213812,111928.59978467268]
[null,null,null,1136,98.605540452247851,112015.89395375356]
[null,null,null,1137,98.59557448628189,112103.16819090251]
[null,null,null,1138,98.58560852031593,112190.42249611953]
[null,null,null,1139,98.575642554349969,112277.65686940461]
[null,null,null,1140,98.565676588384008,112364.87131075776]
[null,null,null,1141,98.555710622418047,112452.06582017899]
[null,null,null,1142,98.545744656452086,112539.24039766828]
[null,null,null,1143,98.535778690486126,112626.39504322564]
[null,null,null,1144,98.525812724520165,112713.52975685107]
[null,null,null,1145,98.515846758554204,112800.64453854457]
[null,null,null,1146,98.505880792588243,112887.73938830613]
[null,null,null,1147,98.495914826622283,112974.81430613576]
[null,null,null,1148,98.485948860656322,113061.86929203346]
[null,null,null,1149,98.475982894690361,113148.90434599922]
[null,null,null,1150,98.4660169287244,113235.91946803305]
[null,null,null,1151,98.456050962758439,113322.91465813496]
[null,null,null,1152,98.446084996792479,113409.88991630494]
[null,null,null,1153,98.436119030826518,113496.84524254297]
[null,null,null,1154,98.426153064860557,113583.78063684909]
[null,null,null,1155,98.416187098894596,113670.69609922326]
[null,null,null,1156,98.406221132928636,113757.59162966551]
[null,null,null,1157,98.396255166962675,113844.46722817581]
[null,null,null,1158,98.386289200996714,113931.32289475419]
[null,null,null,1159,98.376323235030753,114018.15862940064]
[null,null,null,1160,98.366357269064792,114104.97443211515]
[null,null,null,1161,98.356391303098832,114191.77030289774]
[null,null,null,1162,98.346425337132871,114278.54624174839]
[null,null,null,1163,98.33645937116691,114365.30224866711]
[null,null,null,1164,98.326493405200949,114452.03832365391]
[null,null,null,1165,98.316527439234989,114538.75446670876]
[null,null,null,1166,98.306561473269028,114625.45067783169]
[null,null,null,1167,98.296595507303067,114712.12695702267]
[null,null,null,1168,98.286629541337106,114798.78330428174]
[null,null,null,1169,98.276663575371145,114885.41971960886]
[null,null,null,1170,98.266697609405185,114972.03620300407]
[null,null,null,1171,98.256731643439224,115058.63275446733]
[null,null,null,1172,98.246765677473263,115145.20937399866]
[null,null,null,1173,98.236799711507302,115231.76606159807]
[null,null,null,1174,98.226833745541342,115318.30281726553]
[null,null,null,1175,98.216867779575381,115404.81964100107]
[null,null,null,1176,98.20690181360942,115491.31653280467]
[null,null,null,1177,98.196935847643459,115577.79349267636]
[null,null,null,1178,98.186969881677499,115664.2505206161]
[null,null,null,1179,98.177003915711538,115750.68761662391]
[null,null,null,1180,98.167037949745577,115837.10478069978]
[null,null,null,1181,98.157071983779616,115923.50201284373]
[null,null,null,1182,98.147106017813655,116009.87931305575]
[null,null,null,1183,98.137140051847695,116096.23668133582]
[null,null,null,1184,98.127174085881734,116182.57411768398]
[null,null,null,1185,98.117208119915773,116268.89162210019]
[null,null,null,1186,98.107242153949812,116355.18919458448]
[null,null,null,1187,98.097276187983852,116441.46683513683]
[null,null,null,1188,98.087310222017891,116527.72454375726]
[null,null,null,1189,98.07734425605193,{"$f":"E1206*D1206","v":116613.96232044575}]
[null,null,null,1190,98.067378290085969,116700.1801652023]
[null,null,null,1191,98.057412324120008,116786.37807802693]
[null,null,null,1192,98.047446358154048,116872.55605891962]
[null,null,null,1193,{"$f":"E1209-$F$13","v":98.037480392188087},116958.71410788038]
[null,null,null,1194,98.027514426222126,117044.85222490922]
[null,null,null,1195,98.017548460256165,117130.97041000612]
[null,null,null,1196,98.007582494290205,117217.06866317109]
[null,null,null,1197,97.997616528324244,117303.14698440411]
[null,null,null,1198,97.987650562358283,117389.20537370522]
[null,null,null,1199,97.977684596392322,117475.24383107439]
[null,null,null,1200,97.967718630426361,117561.26235651164]
[null,null,null,1201,97.957752664460401,117647.26095001693]
[null,null,null,1202,97.94778669849444,117733.23961159031]
[null,null,null,1203,97.937820732528479,117819.19834123176]
[null,null,null,1204,97.927854766562518,117905.13713894127]
[null,null,null,1205,97.917888800596558,117991.05600471885]
[null,null,null,1206,97.907922834630597,118076.95493856449]
[null,null,null,1207,97.897956868664636,118162.83394047822]
[null,null,null,1208,97.887990902698675,118248.69301046]
[null,null,null,1209,97.878024936732714,118334.53214850985]
[null,null,null,1210,97.868058970766754,118420.35135462777]
[null,null,null,1211,97.858093004800793,118506.15062881376]
[null,null,null,1212,97.848127038834832,118591.92997106782]
[null,null,null,1213,97.838161072868871,118677.68938138994]
[null,null,null,1214,97.828195106902911,118763.42885978014]
[null,null,null,1215,97.81822914093695,118849.1484062384]
[null,null,null,1216,97.808263174970989,118934.84802076472]
[null,null,null,1217,97.798297209005028,119020.52770335913]
[null,null,null,1218,97.788331243039067,119106.18745402158]
[null,null,null,1219,97.778365277073107,119191.82727275211]
[null,null,null,1220,97.768399311107146,119277.44715955072]
[null,null,null,1221,97.758433345141185,119363.04711441739]
[null,null,null,1222,97.748467379175224,119448.62713735213]
[null,null,null,1223,97.738501413209264,119534.18722835493]
[null,null,null,1224,97.728535447243303,119619.72738742581]
[null,null,null,1225,97.718569481277342,119705.24761456474]
[null,null,null,1226,97.708603515311381,119790.74790977176]
[null,null,null,1227,97.69863754934542,119876.22827304683]
[null,null,null,1228,97.68867158337946,119961.68870438998]
[null,null,null,1229,97.678705617413499,120047.12920380119]
[null,null,null,1230,97.668739651447538,120132.54977128048]
[null,null,null,1231,97.658773685481577,120217.95040682782]
[null,null,null,1232,97.648807719515617,120303.33111044324]
[null,null,null,1233,97.638841753549656,120388.69188212673]
[null,null,null,1234,97.628875787583695,120474.03272187828]
[null,null,null,1235,97.618909821617734,120559.3536296979]
[null,null,null,1236,97.608943855651773,120644.65460558559]
[null,null,null,1237,97.598977889685813,120729.93564954135]
[null,null,null,1238,97.589011923719852,120815.19676156518]
[null,null,null,1239,97.579045957753891,120900.43794165707]
[null,null,null,1240,97.56907999178793,120985.65918981703]
[null,null,null,1241,97.55911402582197,121070.86050604506]
[null,null,null,1242,97.549148059856009,121156.04189034116]
[null,null,null,1243,97.539182093890048,121241.20334270532]
[null,null,null,1244,97.529216127924087,121326.34486313756]
[null,null,null,1245,97.519250161958126,121411.46645163787]
[null,null,null,1246,97.509284195992166,121496.56810820624]
[null,null,null,1247,97.499318230026205,121581.64983284268]
[null,null,null,1248,97.489352264060244,121666.71162554718]
[null,null,null,1249,97.479386298094283,121751.75348631977]
[null,null,null,1250,97.469420332128323,121836.7754151604]
[null,null,null,1251,97.459454366162362,121921.77741206912]
[null,null,null,1252,97.449488400196401,122006.7594770459]
[null,null,null,1253,97.43952243423044,{"$f":"E1270*D1270","v":122091.72161009074}]
[null,null,null,1254,97.429556468264479,122176.66381120366]
[null,null,null,1255,97.419590502298519,122261.58608038464]
[null,null,null,1256,97.409624536332558,122346.48841763369]
[null,null,null,1257,{"$f":"E1273-$F$13","v":97.399658570366597},122431.37082295082]
[null,null,null,1258,97.389692604400636,122516.23329633599]
[null,null,null,1259,97.379726638434676,122601.07583778926]
[null,null,null,1260,97.369760672468715,122685.89844731058]
[null,null,null,1261,97.359794706502754,122770.70112489998]
[null,null,null,1262,97.349828740536793,122855.48387055744]
[null,null,null,1263,97.339862774570832,122940.24668428296]
[null,null,null,1264,97.329896808604872,123024.98956607656]
[null,null,null,1265,97.319930842638911,123109.71251593823]
[null,null,null,1266,97.30996487667295,123194.41553386796]
[null,null,null,1267,97.299998910706989,123279.09861986575]
[null,null,null,1268,97.290032944741029,123363.76177393162]
[null,null,null,1269,97.280066978775068,123448.40499606555]
[null,null,null,1270,97.270101012809107,123533.02828626757]
[null,null,null,1271,97.260135046843146,123617.63164453764]
[null,null,null,1272,97.250169080877185,123702.21507087578]
[null,null,null,1273,97.240203114911225,123786.77856528199]
[null,null,null,1274,97.230237148945264,123871.32212775627]
[null,null,null,1275,97.220271182979303,123955.84575829862]
[null,null,null,1276,97.210305217013342,124040.34945690903]
[null,null,null,1277,97.200339251047382,124124.83322358751]
[null,null,null,1278,97.190373285081421,124209.29705833405]
[null,null,null,1279,97.18040731911546,124293.74096114868]
[null,null,null,1280,97.170441353149499,124378.16493203136]
[null,null,null,1281,97.160475387183538,124462.56897098212]
[null,null,null,1282,97.150509421217578,124546.95307800094]
[null,null,null,1283,97.140543455251617,124631.31725308782]
[null,null,null,1284,97.130577489285656,124715.66149624278]
[null,null,null,1285,97.120611523319695,124799.98580746581]
[null,null,null,1286,97.110645557353735,124884.2901867569]
[null,null,null,1287,97.100679591387774,124968.57463411607]
[null,null,null,1288,97.090713625421813,125052.83914954329]
[null,null,null,1289,97.080747659455852,125137.0837330386]
[null,null,null,1290,97.070781693489891,125221.30838460196]
[null,null,null,1291,97.060815727523931,125305.5131042334]
[null,null,null,1292,97.05084976155797,125389.6978919329]
[null,null,null,1293,97.040883795592009,125473.86274770046]
[null,null,null,1294,97.030917829626048,125558.00767153611]
[null,null,null,1295,97.020951863660088,125642.13266343981]
[null,null,null,1296,97.010985897694127,125726.23772341158]
[null,null,null,1297,97.001019931728166,125810.32285145143]
[null,null,null,1298,96.991053965762205,125894.38804755935]
[null,null,null,1299,96.981087999796245,125978.43331173532]
[null,null,null,1300,96.971122033830284,126062.45864397936]
[null,null,null,1301,96.961156067864323,126146.46404429148]
[null,null,null,1302,96.951190101898362,126230.44951267166]
[null,null,null,1303,96.941224135932401,126314.41504911993]
[null,null,null,1304,96.931258169966441,126398.36065363623]
[null,null,null,1305,96.92129220400048,126482.28632622062]
[null,null,null,1306,96.911326238034519,126566.19206687309]
[null,null,null,1307,96.901360272068558,126650.0778755936]
[null,null,null,1308,96.891394306102598,126733.9437523822]
[null,null,null,1309,96.881428340136637,126817.78969723886]
[null,null,null,1310,96.871462374170676,126901.61571016359]
[null,null,null,1311,96.861496408204715,126985.42179115638]
[null,null,null,1312,96.851530442238754,127069.20794021725]
[null,null,null,1313,96.841564476272794,127152.97415734618]
[null,null,null,1314,96.831598510306833,127236.72044254318]
[null,null,null,1315,96.821632544340872,127320.44679580825]
[null,null,null,1316,96.811666578374911,127404.15321714139]
[null,null,null,1317,96.801700612408951,{"$f":"E1334*D1334","v":127487.83970654258}]
[null,null,null,1318,96.79173464644299,127571.50626401186]
[null,null,null,1319,96.781768680477029,127655.15288954921]
[null,null,null,1320,96.771802714511068,127738.77958315461]
[null,null,null,1321,{"$f":"E1337-$F$13","v":96.761836748545107},127822.38634482809]
[null,null,null,1322,96.751870782579147,127905.97317456963]
[null,null,null,1323,96.741904816613186,127989.54007237924]
[null,null,null,1324,96.731938850647225,128073.08703825693]
[null,null,null,1325,96.721972884681264,128156.61407220268]
[null,null,null,1326,96.712006918715304,128240.12117421649]
[null,null,null,1327,96.702040952749343,128323.60834429838]
[null,null,null,1328,96.692074986783382,128407.07558244833]
[null,null,null,1329,96.682109020817421,128490.52288866635]
[null,null,null,1330,96.67214305485146,128573.95026295244]
[null,null,null,1331,96.6621770888855,128657.3577053066]
[null,null,null,1332,96.652211122919539,128740.74521572882]
[null,null,null,1333,96.642245156953578,128824.11279421912]
[null,null,null,1334,96.632279190987617,128907.46044077748]
[null,null,null,1335,96.622313225021657,128990.7881554039]
[null,null,null,1336,96.612347259055696,129074.09593809841]
[null,null,null,1337,96.602381293089735,129157.38378886097]
[null,null,null,1338,96.592415327123774,129240.65170769161]
[null,null,null,1339,96.582449361157813,129323.89969459031]
[null,null,null,1340,96.572483395191853,129407.12774955708]
[null,null,null,1341,96.562517429225892,129490.33587259192]
[null,null,null,1342,96.552551463259931,129573.52406369483]
[null,null,null,1343,96.54258549729397,129656.6923228658]
[null,null,null,1344,96.53261953132801,129739.84065010484]
[null,null,null,1345,96.522653565362049,129822.96904541196]
[null,null,null,1346,96.512687599396088,129906.07750878713]
[null,null,null,1347,96.502721633430127,129989.16604023038]
[null,null,null,1348,96.492755667464166,130072.2346397417]
[null,null,null,1349,96.482789701498206,130155.28330732108]
[null,null,null,1350,96.472823735532245,130238.31204296854]
[null,null,null,1351,96.462857769566284,130321.32084668404]
[null,null,null,1352,96.452891803600323,130404.30971846764]
[null,null,null,1353,96.442925837634363,130487.27865831929]
[null,null,null,1354,96.432959871668402,130570.22766623902]
[null,null,null,1355,96.422993905702441,130653.15674222681]
[null,null,null,1356,96.41302793973648,130736.06588628267]
[null,null,null,1357,96.403061973770519,130818.9550984066]
[null,null,null,1358,96.393096007804559,130901.8243785986]
[null,null,null,1359,96.383130041838598,130984.67372685866]
[null,null,null,1360,96.373164075872637,131067.50314318678]
[null,null,null,1361,96.363198109906676,131150.31262758299]
[null,null,null,1362,96.353232143940716,131233.10218004725]
[null,null,null,1363,96.343266177974755,131315.8718005796]
[null,null,null,1364,96.333300212008794,131398.62148917999]
[null,null,null,1365,96.323334246042833,131481.35124584846]
[null,null,null,1366,96.313368280076872,131564.06107058501]
[null,null,null,1367,96.303402314110912,131646.75096338961]
[null,null,null,1368,96.293436348144951,131729.42092426229]
[null,null,null,1369,96.28347038217899,131812.07095320305]
[null,null,null,1370,96.273504416213029,131894.70105021185]
[null,null,null,1371,96.263538450247069,131977.31121528873]
[null,null,null,1372,96.253572484281108,132059.90144843367]
[null,null,null,1373,96.243606518315147,132142.47174964671]
[null,null,null,1374,96.233640552349186,132225.02211892779]
[null,null,null,1375,96.223674586383225,132307.55255627693]
[null,null,null,1376,96.213708620417265,132390.06306169415]
[null,null,null,1377,96.203742654451304,132472.55363517944]
[null,null,null,1378,96.193776688485343,132555.02427673282]
[null,null,null,1379,96.183810722519382,132637.47498635424]
[null,null,null,1380,96.173844756553422,132719.90576404371]
[null,null,null,1381,96.163878790587461,{"$f":"E1398*D1398","v":132802.31660980129}]
[null,null,null,1382,96.1539128246215,132884.70752362692]
[null,null,null,1383,96.143946858655539,132967.07850552062]
[null,null,null,1384,96.133980892689578,133049.42955548238]
[null,null,null,1385,{"$f":"E1401-$F$13","v":96.124014926723618},133131.76067351221]
[null,null,null,1386,96.114048960757657,133214.07185961012]
[null,null,null,1387,96.104082994791696,133296.36311377608]
[null,null,null,1388,96.094117028825735,133378.63443601012]
[null,null,null,1389,96.084151062859775,133460.88582631224]
[null,null,null,1390,96.074185096893814,133543.1172846824]
[null,null,null,1391,96.064219130927853,133625.32881112065]
[null,null,null,1392,96.054253164961892,133707.52040562694]
[null,null,null,1393,96.044287198995931,133789.69206820134]
[null,null,null,1394,96.034321233029971,133871.84379884377]
[null,null,null,1395,96.02435526706401,133953.97559755429]
[null,null,null,1396,96.014389301098049,134036.08746433287]
[null,null,null,1397,96.004423335132088,134118.17939917953]
[null,null,null,1398,95.994457369166128,134200.25140209423]
[null,null,null,1399,95.984491403200167,134282.30347307705]
[null,null,null,1400,95.974525437234206,134364.33561212788]
[null,null,null,1401,95.964559471268245,134446.34781924682]
[null,null,null,1402,95.954593505302284,134528.34009443381]
[null,null,null,1403,95.944627539336324,134610.31243768887]
[null,null,null,1404,95.934661573370363,134692.26484901199]
[null,null,null,1405,95.924695607404402,134774.19732840318]
[null,null,null,1406,95.914729641438441,134856.10987586246]
[null,null,null,1407,95.904763675472481,134938.00249138978]
[null,null,null,1408,95.89479770950652,135019.87517498518]
[null,null,null,1409,95.884831743540559,135101.72792664866]
[null,null,null,1410,95.874865777574598,135183.56074638019]
[null,null,null,1411,95.864899811608637,135265.37363417979]
[null,null,null,1412,95.854933845642677,135347.16659004745]
[null,null,null,1413,95.844967879676716,135428.93961398321]
[null,null,null,1414,95.835001913710755,135510.69270598702]
[null,null,null,1415,95.825035947744794,135592.42586605888]
[null,null,null,1416,95.815069981778834,135674.13909419882]
[null,null,null,1417,95.805104015812873,135755.83239040684]
[null,null,null,1418,95.795138049846912,135837.50575468293]
[null,null,null,1419,95.785172083880951,135919.15918702708]
[null,null,null,1420,95.775206117914991,136000.79268743927]
[null,null,null,1421,95.76524015194903,136082.40625591957]
[null,null,null,1422,95.755274185983069,136163.99989246792]
[null,null,null,1423,95.745308220017108,136245.57359708435]
[null,null,null,1424,95.735342254051147,136327.12736976883]
[null,null,null,1425,95.725376288085187,136408.66121052139]
[null,null,null,1426,95.715410322119226,136490.17511934202]
[null,null,null,1427,95.705444356153265,136571.6690962307]
[null,null,null,1428,95.695478390187304,136653.14314118747]
[null,null,null,1429,95.685512424221344,136734.59725421231]
[null,null,null,1430,95.675546458255383,136816.03143530519]
[null,null,null,1431,95.665580492289422,136897.44568446616]
[null,null,null,1432,95.655614526323461,136978.84000169521]
[null,null,null,1433,95.6456485603575,137060.2143869923]
[null,null,null,1434,95.63568259439154,137141.56884035747]
[null,null,null,1435,95.625716628425579,137222.9033617907]
[null,null,null,1436,95.615750662459618,137304.217951292]
[null,null,null,1437,95.605784696493657,137385.51260886138]
[null,null,null,1438,95.595818730527697,137466.78733449883]
[null,null,null,1439,95.585852764561736,137548.04212820434]
[null,null,null,1440,95.575886798595775,137629.27698997792]
[null,null,null,1441,95.565920832629814,137710.49191981956]
[null,null,null,1442,95.555954866663853,137791.68691772927]
[null,null,null,1443,95.545988900697893,137872.86198370706]
[null,null,null,1444,95.536022934731932,137954.0171177529]
[null,null,null,1445,95.526056968765971,{"$f":"E1462*D1462","v":138035.15231986681}]
[null,null,null,1446,95.51609100280001,138116.26759004881]
[null,null,null,1447,95.50612503683405,138197.36292829888]
[null,null,null,1448,95.496159070868089,138278.43833461701]
[null,null,null,1449,{"$f":"E1465-$F$13","v":95.486193104902128},138359.49380900318]
[null,null,null,1450,95.476227138936167,138440.52935145743]
[null,null,null,1451,95.466261172970206,138521.54496197976]
[null,null,null,1452,95.456295207004246,138602.54064057017]
[null,null,null,1453,95.446329241038285,138683.51638722862]
[null,null,null,1454,95.436363275072324,138764.47220195516]
[null,null,null,1455,95.426397309106363,138845.40808474977]
[null,null,null,1456,95.416431343140403,138926.32403561243]
[null,null,null,1457,95.406465377174442,139007.22005454317]
[null,null,null,1458,95.396499411208481,139088.09614154196]
[null,null,null,1459,95.38653344524252,139168.95229660883]
[null,null,null,1460,95.376567479276559,139249.78851974377]
[null,null,null,1461,95.366601513310599,139330.6048109468]
[null,null,null,1462,95.356635547344638,139411.40117021787]
[null,null,null,1463,95.346669581378677,139492.17759755699]
[null,null,null,1464,95.336703615412716,139572.93409296422]
[null,null,null,1465,95.326737649446756,139653.6706564395]
[null,null,null,1466,95.316771683480795,139734.38728798286]
[null,null,null,1467,95.306805717514834,139815.08398759426]
[null,null,null,1468,95.296839751548873,139895.76075527375]
[null,null,null,1469,95.286873785582912,139976.41759102131]
[null,null,null,1470,95.276907819616952,140057.05449483692]
[null,null,null,1471,95.266941853650991,140137.67146672061]
[null,null,null,1472,95.25697588768503,140218.26850667235]
[null,null,null,1473,95.247009921719069,140298.8456146922]
[null,null,null,1474,95.237043955753109,140379.40279078009]
[null,null,null,1475,95.227077989787148,140459.94003493604]
[null,null,null,1476,95.217112023821187,140540.45734716006]
[null,null,null,1477,95.207146057855226,140620.95472745216]
[null,null,null,1478,95.197180091889265,140701.43217581234]
[null,null,null,1479,95.187214125923305,140781.88969224057]
[null,null,null,1480,95.177248159957344,140862.32727673688]
[null,null,null,1481,95.167282193991383,140942.74492930123]
[null,null,null,1482,95.157316228025422,141023.14264993367]
[null,null,null,1483,95.147350262059462,141103.52043863418]
[null,null,null,1484,95.137384296093501,141183.87829540274]
[null,null,null,1485,95.12741833012754,141264.21622023941]
[null,null,null,1486,95.117452364161579,141344.5342131441]
[null,null,null,1487,95.107486398195618,141424.8322741169]
[null,null,null,1488,95.097520432229658,141505.11040315774]
[null,null,null,1489,95.087554466263697,141585.36860026664]
[null,null,null,1490,95.077588500297736,141665.60686544364]
[null,null,null,1491,95.067622534331775,141745.82519868869]
[null,null,null,1492,95.057656568365815,141826.02360000179]
[null,null,null,1493,95.047690602399854,141906.20206938297]
[null,null,null,1494,95.037724636433893,141986.36060683223]
[null,null,null,1495,95.027758670467932,142066.49921234956]
[null,null,null,1496,95.017792704501971,142146.61788593495]
[null,null,null,1497,95.007826738536011,142226.71662758841]
[null,null,null,1498,94.99786077257005,142306.79543730995]
[null,null,null,1499,94.987894806604089,142386.85431509954]
[null,null,null,1500,94.977928840638128,142466.89326095718]
[null,null,null,1501,94.967962874672168,142546.91227488292]
[null,null,null,1502,94.957996908706207,142626.91135687672]
[null,null,null,1503,94.948030942740246,142706.89050693859]
[null,null,null,1504,94.938064976774285,142786.84972506852]
[null,null,null,1505,94.928099010808324,142866.78901126652]
[null,null,null,1506,94.918133044842364,142946.7083655326]
[null,null,null,1507,94.908167078876403,143026.60778786673]
[null,null,null,1508,94.898201112910442,143106.48727826893]
[null,null,null,1509,94.888235146944481,{"$f":"E1526*D1526","v":143186.34683673922}]
[null,null,null,1510,94.878269180978521,143266.18646327755]
[null,null,null,1511,94.86830321501256,143346.00615788397]
[null,null,null,1512,94.858337249046599,143425.80592055846]
[null,null,null,1513,{"$f":"E1529-$F$13","v":94.848371283080638},143505.585751301]
[null,null,null,1514,94.838405317114677,143585.34565011162]
[null,null,null,1515,94.828439351148717,143665.08561699031]
[null,null,null,1516,94.818473385182756,143744.80565193706]
[null,null,null,1517,94.808507419216795,143824.50575495188]
[null,null,null,1518,94.798541453250834,143904.18592603476]
[null,null,null,1519,94.788575487284874,143983.84616518574]
[null,null,null,1520,94.778609521318913,144063.48647240474]
[null,null,null,1521,94.768643555352952,144143.10684769184]
[null,null,null,1522,94.758677589386991,144222.707291047]
[null,null,null,1523,94.74871162342103,144302.28780247024]
[null,null,null,1524,94.73874565745507,144381.84838196152]
[null,null,null,1525,94.728779691489109,144461.38902952088]
[null,null,null,1526,94.718813725523148,144540.90974514832]
[null,null,null,1527,94.708847759557187,144620.41052884381]
[null,null,null,1528,94.698881793591227,144699.89138060738]
[null,null,null,1529,94.688915827625266,144779.35230043903]
[null,null,null,1530,94.678949861659305,144858.79328833873]
[null,null,null,1531,94.668983895693344,144938.2143443065]
[null,null,null,1532,94.659017929727383,145017.61546834235]
[null,null,null,1533,94.649051963761423,145096.99666044625]
[null,null,null,1534,94.639085997795462,145176.35792061823]
[null,null,null,1535,94.629120031829501,145255.69924885829]
[null,null,null,1536,94.61915406586354,145335.0206451664]
[null,null,null,1537,94.60918809989758,145414.32210954258]
[null,null,null,1538,94.599222133931619,145493.60364198682]
[null,null,null,1539,94.589256167965658,145572.86524249916]
[null,null,null,1540,94.579290201999697,145652.10691107952]
[null,null,null,1541,94.569324236033736,145731.32864772799]
[null,null,null,1542,94.559358270067776,145810.53045244451]
[null,null,null,1543,94.549392304101815,145889.71232522911]
[null,null,null,1544,94.539426338135854,145968.87426608175]
[null,null,null,1545,94.529460372169893,146048.01627500248]
[null,null,null,1546,94.519494406203933,146127.13835199128]
[null,null,null,1547,94.509528440237972,146206.24049704813]
[null,null,null,1548,94.499562474272011,146285.32271017306]
[null,null,null,1549,94.48959650830605,146364.38499136607]
[null,null,null,1550,94.47963054234009,146443.42734062715]
[null,null,null,1551,94.469664576374129,146522.44975795626]
[null,null,null,1552,94.459698610408168,146601.45224335347]
[null,null,null,1553,94.449732644442207,146680.43479681874]
[null,null,null,1554,94.439766678476246,146759.39741835208]
[null,null,null,1555,94.429800712510286,146838.3401079535]
[null,null,null,1556,94.419834746544325,146917.26286562296]
[null,null,null,1557,94.409868780578364,146996.16569136051]
[null,null,null,1558,94.399902814612403,147075.04858516614]
[null,null,null,1559,94.389936848646443,147153.91154703981]
[null,null,null,1560,94.379970882680482,147232.75457698156]
[null,null,null,1561,94.370004916714521,147311.57767499136]
[null,null,null,1562,94.36003895074856,147390.38084106924]
[null,null,null,1563,94.350072984782599,147469.1640752152]
[null,null,null,1564,94.340107018816639,147547.92737742921]
[null,null,null,1565,94.330141052850678,147626.67074771132]
[null,null,null,1566,94.320175086884717,147705.39418606146]
[null,null,null,1567,94.310209120918756,147784.0976924797]
[null,null,null,1568,94.300243154952796,147862.78126696599]
[null,null,null,1569,94.290277188986835,147941.44490952033]
[null,null,null,1570,94.280311223020874,148020.08862014278]
[null,null,null,1571,94.270345257054913,148098.71239883328]
[null,null,null,1572,94.260379291088952,148177.31624559182]
[null,null,null,1573,94.250413325122992,{"$f":"E1590*D1590","v":148255.90016041847}]
[null,null,null,1574,94.240447359157031,148334.46414331318]
[null,null,null,1575,94.23048139319107,148413.00819427593]
[null,null,null,1576,94.220515427225109,148491.53231330676]
[null,null,null,1577,{"$f":"E1593-$F$13","v":94.210549461259149},148570.03650040567]
[null,null,null,1578,94.200583495293188,148648.52075557265]
[null,null,null,1579,94.190617529327227,148726.98507880769]
[null,null,null,1580,94.180651563361266,148805.4294701108]
[null,null,null,1581,94.170685597395305,148883.85392948196]
[null,null,null,1582,94.160719631429345,148962.25845692123]
[null,null,null,1583,94.150753665463384,149040.64305242852]
[null,null,null,1584,94.140787699497423,149119.00771600392]
[null,null,null,1585,94.130821733531462,149197.35244764737]
[null,null,null,1586,94.120855767565502,149275.67724735889]
[null,null,null,1587,94.110889801599541,149353.98211513847]
[null,null,null,1588,94.10092383563358,149432.26705098612]
[null,null,null,1589,94.090957869667619,149510.53205490185]
[null,null,null,1590,94.080991903701658,149588.77712688563]
[null,null,null,1591,94.071025937735698,149667.00226693749]
[null,null,null,1592,94.061059971769737,149745.20747505742]
[null,null,null,1593,94.051094005803776,149823.39275124541]
[null,null,null,1594,94.041128039837815,149901.55809550147]
[null,null,null,1595,94.031162073871855,149979.70350782562]
[null,null,null,1596,94.021196107905894,150057.82898821781]
[null,null,null,1597,94.011230141939933,150135.93453667808]
[null,null,null,1598,94.001264175973972,150214.02015320639]
[null,null,null,1599,93.991298210008011,150292.08583780282]
[null,null,null,1600,93.981332244042051,150370.1315904673]
[null,null,null,1601,93.97136627807609,150448.15741119982]
[null,null,null,1602,93.961400312110129,150526.16330000042]
[null,null,null,1603,93.951434346144168,150604.1492568691]
[null,null,null,1604,93.941468380178208,150682.11528180583]
[null,null,null,1605,93.931502414212247,150760.06137481067]
[null,null,null,1606,93.921536448246286,150837.98753588353]
[null,null,null,1607,93.911570482280325,150915.89376502449]
[null,null,null,1608,93.901604516314364,150993.78006223351]
[null,null,null,1609,93.891638550348404,151071.64642751057]
[null,null,null,1610,93.881672584382443,151149.49286085574]
[null,null,null,1611,93.871706618416482,151227.31936226896]
[null,null,null,1612,93.861740652450521,151305.12593175023]
[null,null,null,1613,93.851774686484561,151382.9125692996]
[null,null,null,1614,93.8418087205186,151460.67927491703]
[null,null,null,1615,93.831842754552639,151538.4260486025]
[null,null,null,1616,93.821876788586678,151616.15289035608]
[null,null,null,1617,93.811910822620717,151693.85980017771]
[null,null,null,1618,93.801944856654757,151771.54677806739]
[null,null,null,1619,93.791978890688796,151849.21382402515]
[null,null,null,1620,93.782012924722835,151926.86093805099]
[null,null,null,1621,93.772046958756874,152004.4881201449]
[null,null,null,1622,93.762080992790914,152082.09537030687]
[null,null,null,1623,93.752115026824953,152159.68268853691]
[null,null,null,1624,93.742149060858992,152237.250074835]
[null,null,null,1625,93.732183094893031,152314.79752920117]
[null,null,null,1626,93.72221712892707,152392.32505163542]
[null,null,null,1627,93.71225116296111,152469.83264213771]
[null,null,null,1628,93.702285196995149,152547.32030070809]
[null,null,null,1629,93.692319231029188,152624.78802734654]
[null,null,null,1630,93.682353265063227,152702.23582205307]
[null,null,null,1631,93.672387299097267,152779.66368482765]
[null,null,null,1632,93.662421333131306,152857.07161567028]
[null,null,null,1633,93.652455367165345,152934.45961458102]
[null,null,null,1634,93.642489401199384,153011.82768155981]
[null,null,null,1635,93.632523435233423,153089.17581660664]
[null,null,null,1636,93.622557469267463,153166.50401972156]
[null,null,null,1637,93.612591503301502,{"$f":"E1654*D1654","v":153243.81229090455}]
[null,null,null,1638,93.602625537335541,153321.10063015562]
[null,null,null,1639,93.59265957136958,153398.36903747474]
[null,null,null,1640,93.58269360540362,153475.61751286194]
[null,null,null,1641,{"$f":"E1657-$F$13","v":93.572727639437659},153552.84605631721]
[null,null,null,1642,93.562761673471698,153630.05466784054]
[null,null,null,1643,93.552795707505737,153707.24334743194]
[null,null,null,1644,93.542829741539776,153784.41209509139]
[null,null,null,1645,93.532863775573816,153861.56091081892]
[null,null,null,1646,93.522897809607855,153938.68979461453]
[null,null,null,1647,93.512931843641894,154015.79874647819]
[null,null,null,1648,93.502965877675933,154092.88776640993]
[null,null,null,1649,93.492999911709973,154169.95685440974]
[null,null,null,1650,93.483033945744012,154247.00601047761]
[null,null,null,1651,93.473067979778051,154324.03523461355]
[null,null,null,1652,93.46310201381209,154401.04452681757]
[null,null,null,1653,93.453136047846129,154478.03388708964]
[null,null,null,1654,93.443170081880169,154555.00331542979]
[null,null,null,1655,93.433204115914208,154631.95281183801]
[null,null,null,1656,93.423238149948247,154708.88237631429]
[null,null,null,1657,93.413272183982286,154785.79200885864]
[null,null,null,1658,93.403306218016326,154862.68170947107]
[null,null,null,1659,93.393340252050365,154939.55147815155]
[null,null,null,1660,93.383374286084404,155016.40131490011]
[null,null,null,1661,93.373408320118443,155093.23121971675]
[null,null,null,1662,93.363442354152482,155170.04119260143]
[null,null,null,1663,93.353476388186522,155246.8312335542]
[null,null,null,1664,93.343510422220561,155323.60134257501]
[null,null,null,1665,93.3335444562546,155400.35151966391]
[null,null,null,1666,93.323578490288639,155477.08176482088]
[null,null,null,1667,93.313612524322679,155553.7920780459]
[null,null,null,1668,93.303646558356718,155630.48245933899]
[null,null,null,1669,93.293680592390757,155707.15290870017]
[null,null,null,1670,93.283714626424796,155783.80342612942]
[null,null,null,1671,93.273748660458836,155860.43401162673]
[null,null,null,1672,93.263782694492875,155937.04466519208]
[null,null,null,1673,93.253816728526914,156013.63538682554]
[null,null,null,1674,93.243850762560953,156090.20617652705]
[null,null,null,1675,93.233884796594992,156166.75703429661]
[null,null,null,1676,93.223918830629032,156243.28796013424]
[null,null,null,1677,93.213952864663071,156319.79895403996]
[null,null,null,1678,93.20398689869711,156396.29001601375]
[null,null,null,1679,93.194020932731149,156472.76114605559]
[null,null,null,1680,93.184054966765189,156549.21234416551]
[null,null,null,1681,93.174089000799228,156625.64361034351]
[null,null,null,1682,93.164123034833267,156702.05494458956]
[null,null,null,1683,93.154157068867306,156778.44634690369]
[null,null,null,1684,93.144191102901345,156854.81781728586]
[null,null,null,1685,93.134225136935385,156931.16935573611]
[null,null,null,1686,93.124259170969424,157007.50096225445]
[null,null,null,1687,93.114293205003463,157083.81263684086]
[null,null,null,1688,93.104327239037502,157160.10437949531]
[null,null,null,1689,93.094361273071542,157236.37619021782]
[null,null,null,1690,93.084395307105581,157312.62806900844]
[null,null,null,1691,93.07442934113962,157388.8600158671]
[null,null,null,1692,93.064463375173659,157465.07203079382]
[null,null,null,1693,93.054497409207698,157541.26411378864]
[null,null,null,1694,93.044531443241738,157617.43626485151]
[null,null,null,1695,93.034565477275777,157693.58848398243]
[null,null,null,1696,93.024599511309816,157769.72077118146]
[null,null,null,1697,93.014633545343855,157845.83312644853]
[null,null,null,1698,93.004667579377895,157921.92554978366]
[null,null,null,1699,92.994701613411934,157997.99804118689]
[null,null,null,1700,92.984735647445973,158074.05060065814]
[null,null,null,1701,92.974769681480012,{"$f":"E1718*D1718","v":158150.0832281975}]
[null,null,null,1702,92.964803715514051,158226.09592380491]
[null,null,null,1703,92.954837749548091,158302.0886874804]
[null,null,null,1704,92.94487178358213,158378.06151922396]
[null,null,null,1705,{"$f":"E1721-$F$13","v":92.934905817616169},158454.01441903558]
[null,null,null,1706,92.924939851650208,158529.94738691524]
[null,null,null,1707,92.914973885684248,158605.86042286301]
[null,null,null,1708,92.905007919718287,158681.75352687883]
[null,null,null,1709,92.895041953752326,158757.62669896273]
[null,null,null,1710,92.885075987786365,158833.47993911468]
[null,null,null,1711,92.875110021820404,158909.31324733471]
[null,null,null,1712,92.865144055854444,158985.12662362281]
[null,null,null,1713,92.855178089888483,159060.92006797896]
[null,null,null,1714,92.845212123922522,159136.6935804032]
[null,null,null,1715,92.835246157956561,159212.44716089551]
[null,null,null,1716,92.825280191990601,159288.18080945587]
[null,null,null,1717,92.81531422602464,159363.8945260843]
[null,null,null,1718,92.805348260058679,159439.58831078082]
[null,null,null,1719,92.795382294092718,159515.26216354538]
[null,null,null,1720,92.785416328126757,159590.91608437803]
[null,null,null,1721,92.775450362160797,159666.55007327872]
[null,null,null,1722,92.765484396194836,159742.16413024752]
[null,null,null,1723,92.755518430228875,159817.75825528434]
[null,null,null,1724,92.745552464262914,159893.33244838926]
[null,null,null,1725,92.735586498296954,159968.88670956224]
[null,null,null,1726,92.725620532330993,160044.4210388033]
[null,null,null,1727,92.715654566365032,160119.9354361124]
[null,null,null,1728,92.705688600399071,160195.42990148958]
[null,null,null,1729,92.69572263443311,160270.90443493484]
[null,null,null,1730,92.68575666846715,160346.35903644818]
[null,null,null,1731,92.675790702501189,160421.79370602957]
[null,null,null,1732,92.665824736535228,160497.208443679]
[null,null,null,1733,92.655858770569267,160572.60324939655]
[null,null,null,1734,92.645892804603307,160647.97812318214]
[null,null,null,1735,92.635926838637346,160723.33306503578]
[null,null,null,1736,92.625960872671385,160798.66807495753]
[null,null,null,1737,92.615994906705424,160873.98315294733]
[null,null,null,1738,92.606028940739463,160949.27829900518]
[null,null,null,1739,92.596062974773503,161024.55351313113]
[null,null,null,1740,92.586097008807542,161099.80879532511]
[null,null,null,1741,92.576131042841581,161175.04414558719]
[null,null,null,1742,92.56616507687562,161250.25956391732]
[null,null,null,1743,92.55619911090966,161325.45505031553]
[null,null,null,1744,92.546233144943699,161400.63060478182]
[null,null,null,1745,92.536267178977738,161475.78622731616]
[null,null,null,1746,92.526301213011777,161550.92191791857]
[null,null,null,1747,92.516335247045816,161626.03767658904]
[null,null,null,1748,92.506369281079856,161701.13350332758]
[null,null,null,1749,92.496403315113895,161776.2093981342]
[null,null,null,1750,92.486437349147934,161851.26536100887]
[null,null,null,1751,92.476471383181973,161926.30139195162]
[null,null,null,1752,92.466505417216013,162001.31749096245]
[null,null,null,1753,92.456539451250052,162076.31365804133]
[null,null,null,1754,92.446573485284091,162151.28989318831]
[null,null,null,1755,92.43660751931813,162226.24619640331]
[null,null,null,1756,92.426641553352169,162301.1825676864]
[null,null,null,1757,92.416675587386209,162376.09900703756]
[null,null,null,1758,92.406709621420248,162450.99551445679]
[null,null,null,1759,92.396743655454287,162525.87208994408]
[null,null,null,1760,92.386777689488326,162600.72873349945]
[null,null,null,1761,92.376811723522366,162675.56544512289]
[null,null,null,1762,92.366845757556405,162750.38222481438]
[null,null,null,1763,92.356879791590444,162825.17907257396]
[null,null,null,1764,92.346913825624483,162899.95598840158]
[null,null,null,1765,92.336947859658522,{"$f":"E1782*D1782","v":162974.7129722973}]
[null,null,null,1766,92.326981893692562,163049.45002426105]
[null,null,null,1767,92.317015927726601,163124.16714429291]
[null,null,null,1768,92.30704996176064,163198.86433239281]
[null,null,null,1769,{"$f":"E1785-$F$13","v":92.297083995794679},163273.54158856079]
[null,null,null,1770,92.287118029828719,163348.19891279683]
[null,null,null,1771,92.277152063862758,163422.83630510094]
[null,null,null,1772,92.267186097896797,163497.45376547312]
[null,null,null,1773,92.257220131930836,163572.05129391336]
[null,null,null,1774,92.247254165964875,163646.62889042168]
[null,null,null,1775,92.237288199998915,163721.18655499807]
[null,null,null,1776,92.227322234032954,163795.72428764252]
[null,null,null,1777,92.217356268066993,163870.24208835504]
[null,null,null,1778,92.207390302101032,163944.73995713564]
[null,null,null,1779,92.197424336135072,164019.21789398429]
[null,null,null,1780,92.187458370169111,164093.67589890101]
[null,null,null,1781,92.17749240420315,164168.11397188582]
[null,null,null,1782,92.167526438237189,164242.53211293867]
[null,null,null,1783,92.157560472271228,164316.9303220596]
[null,null,null,1784,92.147594506305268,164391.30859924859]
[null,null,null,1785,92.137628540339307,164465.66694450568]
[null,null,null,1786,92.127662574373346,164540.00535783079]
[null,null,null,1787,92.117696608407385,164614.323839224]
[null,null,null,1788,92.107730642441425,164688.62238868527]
[null,null,null,1789,92.097764676475464,164762.90100621461]
[null,null,null,1790,92.087798710509503,164837.159691812]
[null,null,null,1791,92.077832744543542,164911.39844547748]
[null,null,null,1792,92.067866778577581,164985.61726721103]
[null,null,null,1793,92.057900812611621,165059.81615701262]
[null,null,null,1794,92.04793484664566,165133.9951148823]
[null,null,null,1795,92.037968880679699,165208.15414082006]
[null,null,null,1796,92.028002914713738,165282.29323482586]
[null,null,null,1797,92.018036948747778,165356.41239689974]
[null,null,null,1798,92.008070982781817,165430.51162704171]
[null,null,null,1799,91.998105016815856,165504.59092525172]
[null,null,null,1800,91.988139050849895,165578.6502915298]
[null,null,null,1801,91.978173084883935,165652.68972587597]
[null,null,null,1802,91.968207118917974,165726.70922829019]
[null,null,null,1803,91.958241152952013,165800.70879877248]
[null,null,null,1804,91.948275186986052,165874.68843732282]
[null,null,null,1805,91.938309221020091,165948.64814394127]
[null,null,null,1806,91.928343255054131,166022.58791862777]
[null,null,null,1807,91.91837728908817,166096.50776138232]
[null,null,null,1808,91.908411323122209,166170.40767220495]
[null,null,null,1809,91.898445357156248,166244.28765109566]
[null,null,null,1810,91.888479391190288,166318.14769805441]
[null,null,null,1811,91.878513425224327,166391.98781308124]
[null,null,null,1812,91.868547459258366,166465.80799617615]
[null,null,null,1813,91.858581493292405,166539.60824733914]
[null,null,null,1814,91.848615527326444,166613.38856657018]
[null,null,null,1815,91.838649561360484,166687.14895386927]
[null,null,null,1816,91.828683595394523,166760.88940923646]
[null,null,null,1817,91.818717629428562,166834.60993267171]
[null,null,null,1818,91.808751663462601,166908.310524175]
[null,null,null,1819,91.798785697496641,166981.9911837464]
[null,null,null,1820,91.78881973153068,167055.65191138582]
[null,null,null,1821,91.778853765564719,167129.29270709335]
[null,null,null,1822,91.768887799598758,167202.91357086893]
[null,null,null,1823,91.758921833632797,167276.51450271258]
[null,null,null,1824,91.748955867666837,167350.09550262432]
[null,null,null,1825,91.738989901700876,167423.6565706041]
[null,null,null,1826,91.729023935734915,167497.19770665196]
[null,null,null,1827,91.719057969768954,167570.71891076787]
[null,null,null,1828,91.709092003802994,167644.22018295186]
[null,null,null,1829,91.699126037837033,{"$f":"E1846*D1846","v":167717.70152320393}]
[null,null,null,1830,91.689160071871072,167791.16293152407]
[null,null,null,1831,91.679194105905111,167864.60440791227]
[null,null,null,1832,91.66922813993915,167938.02595236851]
[null,null,null,1833,{"$f":"E1849-$F$13","v":91.65926217397319},168011.42756489286]
[null,null,null,1834,91.649296208007229,168084.80924548526]
[null,null,null,1835,91.639330242041268,168158.17099414574]
[null,null,null,1836,91.629364276075307,168231.51281087426]
[null,null,null,1837,91.619398310109347,168304.83469567087]
[null,null,null,1838,91.609432344143386,168378.13664853555]
[null,null,null,1839,91.599466378177425,168451.41866946829]
[null,null,null,1840,91.589500412211464,168524.6807584691]
[null,null,null,1841,91.579534446245503,168597.92291553796]
[null,null,null,1842,91.569568480279543,168671.14514067493]
[null,null,null,1843,91.559602514313582,168744.34743387994]
[null,null,null,1844,91.549636548347621,168817.52979515301]
[null,null,null,1845,91.53967058238166,168890.69222449415]
[null,null,null,1846,91.5297046164157,168963.83472190337]
[null,null,null,1847,91.519738650449739,169036.95728738068]
[null,null,null,1848,91.509772684483778,169110.05992092603]
[null,null,null,1849,91.499806718517817,169183.14262253945]
[null,null,null,1850,91.489840752551856,169256.20539222093]
[null,null,null,1851,91.479874786585896,169329.24822997049]
[null,null,null,1852,91.469908820619935,169402.27113578812]
[null,null,null,1853,91.459942854653974,169475.2741096738]
[null,null,null,1854,91.449976888688013,169548.25715162756]
[null,null,null,1855,91.440010922722053,169621.2202616494]
[null,null,null,1856,91.430044956756092,169694.16343973932]
[null,null,null,1857,91.420078990790131,169767.08668589729]
[null,null,null,1858,91.41011302482417,169839.9900001233]
[null,null,null,1859,91.400147058858209,169912.8733824174]
[null,null,null,1860,91.390181092892249,169985.73683277957]
[null,null,null,1861,91.380215126926288,170058.58035120982]
[null,null,null,1862,91.370249160960327,170131.40393770812]
[null,null,null,1863,91.360283194994366,170204.2075922745]
[null,null,null,1864,91.350317229028406,170276.99131490896]
[null,null,null,1865,91.340351263062445,170349.75510561146]
[null,null,null,1866,91.330385297096484,170422.49896438204]
[null,null,null,1867,91.320419331130523,170495.22289122068]
[null,null,null,1868,91.310453365164562,170567.92688612739]
[null,null,null,1869,91.300487399198602,170640.61094910218]
[null,null,null,1870,91.290521433232641,170713.27508014505]
[null,null,null,1871,91.28055546726668,170785.91927925596]
[null,null,null,1872,91.270589501300719,170858.54354643496]
[null,null,null,1873,91.260623535334759,170931.147881682]
[null,null,null,1874,91.250657569368798,171003.73228499712]
[null,null,null,1875,91.240691603402837,171076.29675638032]
[null,null,null,1876,91.230725637436876,171148.84129583157]
[null,null,null,1877,91.220759671470915,171221.3659033509]
[null,null,null,1878,91.210793705504955,171293.87057893831]
[null,null,null,1879,91.200827739538994,171366.35532259376]
[null,null,null,1880,91.190861773573033,171438.8201343173]
[null,null,null,1881,91.180895807607072,171511.26501410891]
[null,null,null,1882,91.170929841641112,171583.68996196857]
[null,null,null,1883,91.160963875675151,171656.09497789631]
[null,null,null,1884,91.15099790970919,171728.4800618921]
[null,null,null,1885,91.141031943743229,171800.845213956]
[null,null,null,1886,91.131065977777268,171873.19043408794]
[null,null,null,1887,91.121100011811308,171945.51572228794]
[null,null,null,1888,91.111134045845347,172017.82107855601]
[null,null,null,1889,91.101168079879386,172090.10650289216]
[null,null,null,1890,91.091202113913425,172162.37199529639]
[null,null,null,1891,91.081236147947465,172234.61755576867]
[null,null,null,1892,91.071270181981504,172306.84318430899]
[null,null,null,1893,91.061304216015543,{"$f":"E1910*D1910","v":172379.04888091743}]
[null,null,null,1894,91.051338250049582,172451.23464559391]
[null,null,null,1895,91.041372284083621,172523.40047833847]
[null,null,null,1896,91.031406318117661,172595.54637915108]
[null,null,null,1897,{"$f":"E1913-$F$13","v":91.0214403521517},172667.67234803177]
[null,null,null,1898,91.011474386185739,172739.77838498054]
[null,null,null,1899,91.001508420219778,172811.86448999736]
[null,null,null,1900,90.991542454253818,172883.93066308225]
[null,null,null,1901,90.981576488287857,172955.97690423523]
[null,null,null,1902,90.971610522321896,173028.00321345625]
[null,null,null,1903,90.961644556355935,173100.00959074535]
[null,null,null,1904,90.951678590389974,173171.9960361025]
[null,null,null,1905,90.941712624424014,173243.96254952776]
[null,null,null,1906,90.931746658458053,173315.90913102104]
[null,null,null,1907,90.921780692492092,173387.83578058242]
[null,null,null,1908,90.911814726526131,173459.74249821185]
[null,null,null,1909,90.901848760560171,173531.62928390937]
[null,null,null,1910,90.89188279459421,173603.49613767493]
[null,null,null,1911,90.881916828628249,173675.3430595086]
[null,null,null,1912,90.871950862662288,173747.17004941028]
[null,null,null,1913,90.861984896696327,173818.97710738008]
[null,null,null,1914,90.852018930730367,173890.76423341793]
[null,null,null,1915,90.842052964764406,173962.53142752385]
[null,null,null,1916,90.832086998798445,174034.27868969782]
[null,null,null,1917,90.822121032832484,174106.00601993987]
[null,null,null,1918,90.812155066866524,174177.71341825]
[null,null,null,1919,90.802189100900563,174249.40088462818]
[null,null,null,1920,90.792223134934602,174321.06841907444]
[null,null,null,1921,90.782257168968641,174392.71602158877]
[null,null,null,1922,90.772291203002681,174464.34369217115]
[null,null,null,1923,90.76232523703672,174535.95143082162]
[null,null,null,1924,90.752359271070759,174607.53923754013]
[null,null,null,1925,90.742393305104798,174679.10711232675]
[null,null,null,1926,90.732427339138837,174750.65505518141]
[null,null,null,1927,90.722461373172877,174822.18306610413]
[null,null,null,1928,90.712495407206916,174893.69114509493]
[null,null,null,1929,90.702529441240955,174965.1792921538]
[null,null,null,1930,90.692563475274994,175036.64750728075]
[null,null,null,1931,90.682597509309034,175108.09579047575]
[null,null,null,1932,90.672631543343073,175179.5241417388]
[null,null,null,1933,90.662665577377112,175250.93256106996]
[null,null,null,1934,90.652699611411151,175322.32104846917]
[null,null,null,1935,90.64273364544519,175393.68960393645]
[null,null,null,1936,90.63276767947923,175465.03822747178]
[null,null,null,1937,90.622801713513269,175536.3669190752]
[null,null,null,1938,90.612835747547308,175607.67567874669]
[null,null,null,1939,90.602869781581347,175678.96450648623]
[null,null,null,1940,90.592903815615387,175750.23340229384]
[null,null,null,1941,90.582937849649426,175821.48236616954]
[null,null,null,1942,90.572971883683465,175892.71139811329]
[null,null,null,1943,90.563005917717504,175963.92049812511]
[null,null,null,1944,90.553039951751543,176035.10966620501]
[null,null,null,1945,90.543073985785583,176106.27890235296]
[null,null,null,1946,90.533108019819622,176177.42820656899]
[null,null,null,1947,90.523142053853661,176248.55757885307]
[null,null,null,1948,90.5131760878877,176319.66701920523]
[null,null,null,1949,90.50321012192174,176390.75652762546]
[null,null,null,1950,90.493244155955779,176461.82610411377]
[null,null,null,1951,90.483278189989818,176532.87574867014]
[null,null,null,1952,90.473312224023857,176603.90546129458]
[null,null,null,1953,90.463346258057896,176674.91524198707]
[null,null,null,1954,90.453380292091936,176745.90509074763]
[null,null,null,1955,90.443414326125975,176816.87500757628]
[null,null,null,1956,90.433448360160014,176887.82499247298]
[null,null,null,1957,90.423482394194053,{"$f":"E1974*D1974","v":176958.75504543775}]
[null,null,null,1958,90.413516428228093,177029.6651664706]
[null,null,null,1959,90.403550462262132,177100.55535557153]
[null,null,null,1960,90.393584496296171,177171.42561274051]
[null,null,null,1961,{"$f":"E1977-$F$13","v":90.38361853033021},177242.27593797754]
[null,null,null,1962,90.373652564364249,177313.10633128264]
[null,null,null,1963,90.363686598398289,177383.91679265583]
[null,null,null,1964,90.353720632432328,177454.70732209709]
[null,null,null,1965,90.343754666466367,177525.4779196064]
[null,null,null,1966,90.333788700500406,177596.2285851838]
[null,null,null,1967,90.323822734534446,177666.95931882926]
[null,null,null,1968,90.313856768568485,177737.67012054278]
[null,null,null,1969,90.303890802602524,177808.36099032438]
[null,null,null,1970,90.293924836636563,177879.03192817402]
[null,null,null,1971,90.283958870670602,177949.68293409175]
[null,null,null,1972,90.273992904704642,178020.31400807755]
[null,null,null,1973,90.264026938738681,178090.92515013143]
[null,null,null,1974,90.25406097277272,178161.51636025336]
[null,null,null,1975,90.244095006806759,178232.08763844334]
[null,null,null,1976,90.234129040840799,178302.63898470142]
[null,null,null,1977,90.224163074874838,178373.17039902756]
[null,null,null,1978,90.214197108908877,178443.68188142177]
[null,null,null,1979,90.204231142942916,178514.17343188403]
[null,null,null,1980,90.194265176976955,178584.64505041437]
[null,null,null,1981,90.184299211010995,178655.09673701279]
[null,null,null,1982,90.174333245045034,178725.52849167926]
[null,null,null,1983,90.164367279079073,178795.94031441381]
[null,null,null,1984,90.154401313113112,178866.3322052164]
[null,null,null,1985,90.144435347147152,178936.7041640871]
[null,null,null,1986,90.134469381181191,179007.05619102585]
[null,null,null,1987,90.12450341521523,179077.38828603266]
[null,null,null,1988,90.114537449249269,179147.70044910753]
[null,null,null,1989,90.104571483283308,179217.99268025049]
[null,null,null,1990,90.094605517317348,179288.26497946153]
[null,null,null,1991,90.084639551351387,179358.51734674061]
[null,null,null,1992,90.074673585385426,179428.74978208778]
[null,null,null,1993,90.064707619419465,179498.96228550299]
[null,null,null,1994,90.054741653453505,179569.15485698628]
[null,null,null,1995,90.044775687487544,179639.32749653765]
[null,null,null,1996,90.034809721521583,179709.48020415707]
[null,null,null,1997,90.024843755555622,179779.61297984459]
[null,null,null,1998,90.014877789589661,179849.72582360014]
[null,null,null,1999,90.004911823623701,179919.81873542379]
[null,null,null,2000,89.99494585765774,179989.89171531549]
[null,null,null,2001,{"$f":"$E$13","v":90},180090]
[null,null,null,2002,{"$f":"$E$13","v":90},180180]
[null,null,null,2003,90,180270]
[null,null,null,2004,90,180360]
[null,null,null,2005,90,180450]
[null,null,null,2006,90,180540]
[null,null,null,2007,90,180630]
[null,null,null,2008,90,180720]
[null,null,null,2009,90,180810]
[null,null,null,2010,90,180900]
[null,null,null,2011,90,180990]
[null,null,null,2012,90,181080]
[null,null,null,2013,90,181170]
[null,null,null,2014,90,181260]
[null,null,null,2015,90,181350]
[null,null,null,2016,90,181440]
[null,null,null,2017,90,181530]
[null,null,null,2018,90,181620]
[null,null,null,2019,90,181710]
[null,null,null,2020,90,181800]
[null,null,null,2021,90,{"$f":"E2038*D2038","v":181890}]
[null,null,null,2022,90,181980]
[null,null,null,2023,90,182070]
[null,null,null,2024,90,182160]
[null,null,null,2025,90,182250]
[null,null,null,2026,90,182340]
[null,null,null,2027,90,182430]
[null,null,null,2028,90,182520]
[null,null,null,2029,90,182610]
[null,null,null,2030,90,182700]
[null,null,null,2031,90,182790]
[null,null,null,2032,90,182880]
[null,null,null,2033,90,182970]
[null,null,null,2034,90,183060]
[null,null,null,2035,90,183150]
[null,null,null,2036,90,183240]
[null,null,null,2037,90,183330]
[null,null,null,2038,90,183420]
[null,null,null,2039,90,183510]
[null,null,null,2040,90,183600]
[null,null,null,2041,90,183690]
[null,null,null,2042,90,183780]
[null,null,null,2043,90,183870]
[null,null,null,2044,90,183960]
[null,null,null,2045,90,184050]
[null,null,null,2046,90,184140]
[null,null,null,2047,90,184230]
[null,null,null,2048,90,184320]
[null,null,null,2049,90,184410]
[null,null,null,2050,90,184500]
[null,null,null,2051,90,184590]
[null,null,null,2052,90,184680]
[null,null,null,2053,90,184770]
[null,null,null,2054,90,184860]
[null,null,null,2055,90,184950]
[null,null,null,2056,90,185040]
[null,null,null,2057,90,185130]
[null,null,null,2058,90,185220]
[null,null,null,2059,90,185310]
[null,null,null,2060,90,185400]
[null,null,null,2061,90,185490]
[null,null,null,2062,90,185580]
[null,null,null,2063,90,185670]
[null,null,null,2064,90,185760]
[null,null,null,2065,90,185850]
[null,null,null,2066,{"$f":"$E$13","v":90},185940]
[null,null,null,2067,90,186030]
[null,null,null,2068,90,186120]
[null,null,null,2069,90,186210]
[null,null,null,2070,90,186300]
[null,null,null,2071,90,186390]
[null,null,null,2072,90,186480]
[null,null,null,2073,90,186570]
[null,null,null,2074,90,186660]
[null,null,null,2075,90,186750]
[null,null,null,2076,90,186840]
[null,null,null,2077,90,186930]
[null,null,null,2078,90,187020]
[null,null,null,2079,90,187110]
[null,null,null,2080,90,187200]
[null,null,null,2081,90,187290]
[null,null,null,2082,90,187380]
[null,null,null,2083,90,187470]
[null,null,null,2084,90,187560]
[null,null,null,2085,90,{"$f":"E2102*D2102","v":187650}]
[null,null,null,2086,90,187740]
[null,null,null,2087,90,187830]
[null,null,null,2088,90,187920]
[null,null,null,2089,90,188010]
[null,null,null,2090,90,188100]
[null,null,null,2091,90,188190]
[null,null,null,2092,90,188280]
[null,null,null,2093,90,188370]
[null,null,null,2094,90,188460]
[null,null,null,2095,90,188550]
[null,null,null,2096,90,188640]
[null,null,null,2097,90,188730]
[null,null,null,2098,90,188820]
[null,null,null,2099,90,188910]
[null,null,null,2100,90,189000]
[null,null,null,2101,90,189090]
[null,null,null,2102,90,189180]
[null,null,null,2103,90,189270]
[null,null,null,2104,90,189360]
[null,null,null,2105,90,189450]
[null,null,null,2106,90,189540]
[null,null,null,2107,90,189630]
[null,null,null,2108,90,189720]
[null,null,null,2109,90,189810]
[null,null,null,2110,90,189900]
[null,null,null,2111,90,189990]
[null,null,null,2112,90,190080]
[null,null,null,2113,90,190170]
[null,null,null,2114,90,190260]
[null,null,null,2115,90,190350]
[null,null,null,2116,90,190440]
[null,null,null,2117,90,190530]
[null,null,null,2118,90,190620]
[null,null,null,2119,90,190710]
[null,null,null,2120,90,190800]
[null,null,null,2121,90,190890]
[null,null,null,2122,90,190980]
[null,null,null,2123,90,191070]
[null,null,null,2124,90,191160]
[null,null,null,2125,90,191250]
[null,null,null,2126,90,191340]
[null,null,null,2127,90,191430]
[null,null,null,2128,90,191520]
[null,null,null,2129,90,191610]
[null,null,null,2130,{"$f":"$E$13","v":90},191700]
[null,null,null,2131,90,191790]
[null,null,null,2132,90,191880]
[null,null,null,2133,90,191970]
[null,null,null,2134,90,192060]
[null,null,null,2135,90,192150]
[null,null,null,2136,90,192240]
[null,null,null,2137,90,192330]
[null,null,null,2138,90,192420]
[null,null,null,2139,90,192510]
[null,null,null,2140,90,192600]
[null,null,null,2141,90,192690]
[null,null,null,2142,90,192780]
[null,null,null,2143,90,192870]
[null,null,null,2144,90,192960]
[null,null,null,2145,90,193050]
[null,null,null,2146,90,193140]
[null,null,null,2147,90,193230]
[null,null,null,2148,90,193320]
[null,null,null,2149,90,{"$f":"E2166*D2166","v":193410}]
[null,null,null,2150,90,193500]
[null,null,null,2151,90,193590]
[null,null,null,2152,90,193680]
[null,null,null,2153,90,193770]
[null,null,null,2154,90,193860]
[null,null,null,2155,90,193950]
[null,null,null,2156,90,194040]
[null,null,null,2157,90,194130]
[null,null,null,2158,90,194220]
[null,null,null,2159,90,194310]
[null,null,null,2160,90,194400]
[null,null,null,2161,90,194490]
[null,null,null,2162,90,194580]
[null,null,null,2163,90,194670]
[null,null,null,2164,90,194760]
[null,null,null,2165,90,194850]
[null,null,null,2166,90,194940]
[null,null,null,2167,90,195030]
[null,null,null,2168,90,195120]
[null,null,null,2169,90,195210]
[null,null,null,2170,90,195300]
[null,null,null,2171,90,195390]
[null,null,null,2172,90,195480]
[null,null,null,2173,90,195570]
[null,null,null,2174,90,195660]
[null,null,null,2175,90,195750]
[null,null,null,2176,90,195840]
[null,null,null,2177,90,195930]
[null,null,null,2178,90,196020]
[null,null,null,2179,90,196110]
[null,null,null,2180,90,196200]
[null,null,null,2181,90,196290]
[null,null,null,2182,90,196380]
[null,null,null,2183,90,196470]
[null,null,null,2184,90,196560]
[null,null,null,2185,90,196650]
[null,null,null,2186,90,196740]
[null,null,null,2187,90,196830]
[null,null,null,2188,90,196920]
[null,null,null,2189,90,197010]
[null,null,null,2190,90,197100]
[null,null,null,2191,90,197190]
[null,null,null,2192,90,197280]
[null,null,null,2193,90,197370]
[null,null,null,2194,{"$f":"$E$13","v":90},197460]
[null,null,null,2195,90,197550]
[null,null,null,2196,90,197640]
[null,null,null,2197,90,197730]
[null,null,null,2198,90,197820]
[null,null,null,2199,90,197910]
[null,null,null,2200,90,198000]
[null,null,null,2201,90,198090]
[null,null,null,2202,90,198180]
[null,null,null,2203,90,198270]
[null,null,null,2204,90,198360]
[null,null,null,2205,90,198450]
[null,null,null,2206,90,198540]
[null,null,null,2207,90,198630]
[null,null,null,2208,90,198720]
[null,null,null,2209,90,198810]
[null,null,null,2210,90,198900]
[null,null,null,2211,90,198990]
[null,null,null,2212,90,199080]
[null,null,null,2213,90,{"$f":"E2230*D2230","v":199170}]
[null,null,null,2214,90,199260]
[null,null,null,2215,90,199350]
[null,null,null,2216,90,199440]
[null,null,null,2217,90,199530]
[null,null,null,2218,90,199620]
[null,null,null,2219,90,199710]
[null,null,null,2220,90,199800]
[null,null,null,2221,90,199890]
[null,null,null,2222,90,199980]
[null,null,null,2223,90,200070]
[null,null,null,2224,90,200160]
[null,null,null,2225,90,200250]
[null,null,null,2226,90,200340]
[null,null,null,2227,90,200430]
[null,null,null,2228,90,200520]
[null,null,null,2229,90,200610]
[null,null,null,2230,90,200700]
[null,null,null,2231,90,200790]
[null,null,null,2232,90,200880]
[null,null,null,2233,90,200970]
[null,null,null,2234,90,201060]
[null,null,null,2235,90,201150]
[null,null,null,2236,90,201240]
[null,null,null,2237,90,201330]
[null,null,null,2238,90,201420]
[null,null,null,2239,90,201510]
[null,null,null,2240,90,201600]
[null,null,null,2241,90,201690]
[null,null,null,2242,90,201780]
[null,null,null,2243,90,201870]
[null,null,null,2244,90,201960]
[null,null,null,2245,90,202050]
[null,null,null,2246,90,202140]
[null,null,null,2247,90,202230]
[null,null,null,2248,90,202320]
[null,null,null,2249,90,202410]
[null,null,null,2250,90,202500]
[null,null,null,2251,90,202590]
[null,null,null,2252,90,202680]
[null,null,null,2253,90,202770]
[null,null,null,2254,90,202860]
[null,null,null,2255,90,202950]
[null,null,null,2256,90,203040]
[null,null,null,2257,90,203130]
[null,null,null,2258,{"$f":"$E$13","v":90},203220]
[null,null,null,2259,90,203310]
[null,null,null,2260,90,203400]
[null,null,null,2261,90,203490]
[null,null,null,2262,90,203580]
[null,null,null,2263,90,203670]
[null,null,null,2264,90,203760]
[null,null,null,2265,90,203850]
[null,null,null,2266,90,203940]
[null,null,null,2267,90,204030]
[null,null,null,2268,90,204120]
[null,null,null,2269,90,204210]
[null,null,null,2270,90,204300]
[null,null,null,2271,90,204390]
[null,null,null,2272,90,204480]
[null,null,null,2273,90,204570]
[null,null,null,2274,90,204660]
[null,null,null,2275,90,204750]
[null,null,null,2276,90,204840]
[null,null,null,2277,90,{"$f":"E2294*D2294","v":204930}]
[null,null,null,2278,90,205020]
[null,null,null,2279,90,205110]
[null,null,null,2280,90,205200]
[null,null,null,2281,90,205290]
[null,null,null,2282,90,205380]
[null,null,null,2283,90,205470]
[null,null,null,2284,90,205560]
[null,null,null,2285,90,205650]
[null,null,null,2286,90,205740]
[null,null,null,2287,90,205830]
[null,null,null,2288,90,205920]
[null,null,null,2289,90,206010]
[null,null,null,2290,90,206100]
[null,null,null,2291,90,206190]
[null,null,null,2292,90,206280]
[null,null,null,2293,90,206370]
[null,null,null,2294,90,206460]
[null,null,null,2295,90,206550]
[null,null,null,2296,90,206640]
[null,null,null,2297,90,206730]
[null,null,null,2298,90,206820]
[null,null,null,2299,90,206910]
[null,null,null,2300,90,207000]
[null,null,null,2301,90,207090]
[null,null,null,2302,90,207180]
[null,null,null,2303,90,207270]
[null,null,null,2304,90,207360]
[null,null,null,2305,90,207450]
[null,null,null,2306,90,207540]
[null,null,null,2307,90,207630]
[null,null,null,2308,90,207720]
[null,null,null,2309,90,207810]
[null,null,null,2310,90,207900]
[null,null,null,2311,90,207990]
[null,null,null,2312,90,208080]
[null,null,null,2313,90,208170]
[null,null,null,2314,90,208260]
[null,null,null,2315,90,208350]
[null,null,null,2316,90,208440]
[null,null,null,2317,90,208530]
[null,null,null,2318,90,208620]
[null,null,null,2319,90,208710]
[null,null,null,2320,90,208800]
[null,null,null,2321,90,208890]
[null,null,null,2322,{"$f":"$E$13","v":90},208980]
[null,null,null,2323,90,209070]
[null,null,null,2324,90,209160]
[null,null,null,2325,90,209250]
[null,null,null,2326,90,209340]
[null,null,null,2327,90,209430]
[null,null,null,2328,90,209520]
[null,null,null,2329,90,209610]
[null,null,null,2330,90,209700]
[null,null,null,2331,90,209790]
[null,null,null,2332,90,209880]
[null,null,null,2333,90,209970]
[null,null,null,2334,90,210060]
[null,null,null,2335,90,210150]
[null,null,null,2336,90,210240]
[null,null,null,2337,90,210330]
[null,null,null,2338,90,210420]
[null,null,null,2339,90,210510]
[null,null,null,2340,90,210600]
[null,null,null,2341,90,{"$f":"E2358*D2358","v":210690}]
[null,null,null,2342,90,210780]
[null,null,null,2343,90,210870]
[null,null,null,2344,90,210960]
[null,null,null,2345,90,211050]
[null,null,null,2346,90,211140]
[null,null,null,2347,90,211230]
[null,null,null,2348,90,211320]
[null,null,null,2349,90,211410]
[null,null,null,2350,90,211500]
[null,null,null,2351,90,211590]
[null,null,null,2352,90,211680]
[null,null,null,2353,90,211770]
[null,null,null,2354,90,211860]
[null,null,null,2355,90,211950]
[null,null,null,2356,90,212040]
[null,null,null,2357,90,212130]
[null,null,null,2358,90,212220]
[null,null,null,2359,90,212310]
[null,null,null,2360,90,212400]
[null,null,null,2361,90,212490]
[null,null,null,2362,90,212580]
[null,null,null,2363,90,212670]
[null,null,null,2364,90,212760]
[null,null,null,2365,90,212850]
[null,null,null,2366,90,212940]
[null,null,null,2367,90,213030]
[null,null,null,2368,90,213120]
[null,null,null,2369,90,213210]
[null,null,null,2370,90,213300]
[null,null,null,2371,90,213390]
[null,null,null,2372,90,213480]
[null,null,null,2373,90,213570]
[null,null,null,2374,90,213660]
[null,null,null,2375,90,213750]
[null,null,null,2376,90,213840]
[null,null,null,2377,90,213930]
[null,null,null,2378,90,214020]
[null,null,null,2379,90,214110]
[null,null,null,2380,90,214200]
[null,null,null,2381,90,214290]
[null,null,null,2382,90,214380]
[null,null,null,2383,90,214470]
[null,null,null,2384,90,214560]
[null,null,null,2385,90,214650]
[null,null,null,2386,{"$f":"$E$13","v":90},214740]
[null,null,null,2387,90,214830]
[null,null,null,2388,90,214920]
[null,null,null,2389,90,215010]
[null,null,null,2390,90,215100]
[null,null,null,2391,90,215190]
[null,null,null,2392,90,215280]
[null,null,null,2393,90,215370]
[null,null,null,2394,90,215460]
[null,null,null,2395,90,215550]
[null,null,null,2396,90,215640]
[null,null,null,2397,90,215730]
[null,null,null,2398,90,215820]
[null,null,null,2399,90,215910]
[null,null,null,2400,90,216000]
[null,null,null,2401,90,216090]
[null,null,null,2402,90,216180]
[null,null,null,2403,90,216270]
[null,null,null,2404,90,216360]
[null,null,null,2405,90,{"$f":"E2422*D2422","v":216450}]
[null,null,null,2406,90,216540]
[null,null,null,2407,90,216630]
[null,null,null,2408,90,216720]
[null,null,null,2409,90,216810]
[null,null,null,2410,90,216900]
[null,null,null,2411,90,216990]
[null,null,null,2412,90,217080]
[null,null,null,2413,90,217170]
[null,null,null,2414,90,217260]
[null,null,null,2415,90,217350]
[null,null,null,2416,90,217440]
[null,null,null,2417,90,217530]
[null,null,null,2418,90,217620]
[null,null,null,2419,90,217710]
[null,null,null,2420,90,217800]
[null,null,null,2421,90,217890]
[null,null,null,2422,90,217980]
[null,null,null,2423,90,218070]
[null,null,null,2424,90,218160]
[null,null,null,2425,90,218250]
[null,null,null,2426,90,218340]
[null,null,null,2427,90,218430]
[null,null,null,2428,90,218520]
[null,null,null,2429,90,218610]
[null,null,null,2430,90,218700]
[null,null,null,2431,90,218790]
[null,null,null,2432,90,218880]
[null,null,null,2433,90,218970]
[null,null,null,2434,90,219060]
[null,null,null,2435,90,219150]
[null,null,null,2436,90,219240]
[null,null,null,2437,90,219330]
[null,null,null,2438,90,219420]
[null,null,null,2439,90,219510]
[null,null,null,2440,90,219600]
[null,null,null,2441,90,219690]
[null,null,null,2442,90,219780]
[null,null,null,2443,90,219870]
[null,null,null,2444,90,219960]
[null,null,null,2445,90,220050]
[null,null,null,2446,90,220140]
[null,null,null,2447,90,220230]
[null,null,null,2448,90,220320]
[null,null,null,2449,90,220410]
[null,null,null,2450,{"$f":"$E$13","v":90},220500]
[null,null,null,2451,90,220590]
[null,null,null,2452,90,220680]
[null,null,null,2453,90,220770]
[null,null,null,2454,90,220860]
[null,null,null,2455,90,220950]
[null,null,null,2456,90,221040]
[null,null,null,2457,90,221130]
[null,null,null,2458,90,221220]
[null,null,null,2459,90,221310]
[null,null,null,2460,90,221400]
[null,null,null,2461,90,221490]
[null,null,null,2462,90,221580]
[null,null,null,2463,90,221670]
[null,null,null,2464,90,221760]
[null,null,null,2465,90,221850]
[null,null,null,2466,90,221940]
[null,null,null,2467,90,222030]
[null,null,null,2468,90,222120]
[null,null,null,2469,90,{"$f":"E2486*D2486","v":222210}]
[null,null,null,2470,90,222300]
[null,null,null,2471,90,222390]
[null,null,null,2472,90,222480]
[null,null,null,2473,90,222570]
[null,null,null,2474,90,222660]
[null,null,null,2475,90,222750]
[null,null,null,2476,90,222840]
[null,null,null,2477,90,222930]
[null,null,null,2478,90,223020]
[null,null,null,2479,90,223110]
[null,null,null,2480,90,223200]
[null,null,null,2481,90,223290]
[null,null,null,2482,90,223380]
[null,null,null,2483,90,223470]
[null,null,null,2484,90,223560]
[null,null,null,2485,90,223650]
[null,null,null,2486,90,223740]
[null,null,null,2487,90,223830]
[null,null,null,2488,90,223920]
[null,null,null,2489,90,224010]
[null,null,null,2490,90,224100]
[null,null,null,2491,90,224190]
[null,null,null,2492,90,224280]
[null,null,null,2493,90,224370]
[null,null,null,2494,90,224460]
[null,null,null,2495,90,224550]
[null,null,null,2496,90,224640]
[null,null,null,2497,90,224730]
[null,null,null,2498,90,224820]
[null,null,null,2499,90,224910]
[null,null,null,2500,90,225000]
[null,null,null,2501,90,225090]
[null,null,null,2502,90,225180]
[null,null,null,2503,90,225270]
[null,null,null,2504,90,225360]
[null,null,null,2505,90,225450]
[null,null,null,2506,90,225540]
[null,null,null,2507,90,225630]
[null,null,null,2508,90,225720]
[null,null,null,2509,90,225810]
[null,null,null,2510,90,225900]
[null,null,null,2511,90,225990]
[null,null,null,2512,90,226080]
[null,null,null,2513,90,226170]
[null,null,null,2514,{"$f":"$E$13","v":90},226260]
[null,null,null,2515,90,226350]
[null,null,null,2516,90,226440]
[null,null,null,2517,90,226530]
[null,null,null,2518,90,226620]
[null,null,null,2519,90,226710]
[null,null,null,2520,90,226800]
[null,null,null,2521,90,226890]
[null,null,null,2522,90,226980]
[null,null,null,2523,90,227070]
[null,null,null,2524,90,227160]
[null,null,null,2525,90,227250]
[null,null,null,2526,90,227340]
[null,null,null,2527,90,227430]
[null,null,null,2528,90,227520]
[null,null,null,2529,90,227610]
[null,null,null,2530,90,227700]
[null,null,null,2531,90,227790]
[null,null,null,2532,90,227880]
[null,null,null,2533,90,{"$f":"E2550*D2550","v":227970}]
[null,null,null,2534,90,228060]
[null,null,null,2535,90,228150]
[null,null,null,2536,90,228240]
[null,null,null,2537,90,228330]
[null,null,null,2538,90,228420]
[null,null,null,2539,90,228510]
[null,null,null,2540,90,228600]
[null,null,null,2541,90,228690]
[null,null,null,2542,90,228780]
[null,null,null,2543,90,228870]
[null,null,null,2544,90,228960]
[null,null,null,2545,90,229050]
[null,null,null,2546,90,229140]
[null,null,null,2547,90,229230]
[null,null,null,2548,90,229320]
[null,null,null,2549,90,229410]
[null,null,null,2550,90,229500]
[null,null,null,2551,90,229590]
[null,null,null,2552,90,229680]
[null,null,null,2553,90,229770]
[null,null,null,2554,90,229860]
[null,null,null,2555,90,229950]
[null,null,null,2556,90,230040]
[null,null,null,2557,90,230130]
[null,null,null,2558,90,230220]
[null,null,null,2559,90,230310]
[null,null,null,2560,90,230400]
[null,null,null,2561,90,230490]
[null,null,null,2562,90,230580]
[null,null,null,2563,90,230670]
[null,null,null,2564,90,230760]
[null,null,null,2565,90,230850]
[null,null,null,2566,90,230940]
[null,null,null,2567,90,231030]
[null,null,null,2568,90,231120]
[null,null,null,2569,90,231210]
[null,null,null,2570,90,231300]
[null,null,null,2571,90,231390]
[null,null,null,2572,90,231480]
[null,null,null,2573,90,231570]
[null,null,null,2574,90,231660]
[null,null,null,2575,90,231750]
[null,null,null,2576,90,231840]
[null,null,null,2577,90,231930]
[null,null,null,2578,{"$f":"$E$13","v":90},232020]
[null,null,null,2579,90,232110]
[null,null,null,2580,90,232200]
[null,null,null,2581,90,232290]
[null,null,null,2582,90,232380]
[null,null,null,2583,90,232470]
[null,null,null,2584,90,232560]
[null,null,null,2585,90,232650]
[null,null,null,2586,90,232740]
[null,null,null,2587,90,232830]
[null,null,null,2588,90,232920]
[null,null,null,2589,90,233010]
[null,null,null,2590,90,233100]
[null,null,null,2591,90,233190]
[null,null,null,2592,90,233280]
[null,null,null,2593,90,233370]
[null,null,null,2594,90,233460]
[null,null,null,2595,90,233550]
[null,null,null,2596,90,233640]
[null,null,null,2597,90,{"$f":"E2614*D2614","v":233730}]
[null,null,null,2598,90,233820]
[null,null,null,2599,90,233910]
[null,null,null,2600,90,234000]
[null,null,null,2601,90,234090]
[null,null,null,2602,90,234180]
[null,null,null,2603,90,234270]
[null,null,null,2604,90,234360]
[null,null,null,2605,90,234450]
[null,null,null,2606,90,234540]
[null,null,null,2607,90,234630]
[null,null,null,2608,90,234720]
[null,null,null,2609,90,234810]
[null,null,null,2610,90,234900]
[null,null,null,2611,90,234990]
[null,null,null,2612,90,235080]
[null,null,null,2613,90,235170]
[null,null,null,2614,90,235260]
[null,null,null,2615,90,235350]
[null,null,null,2616,90,235440]
[null,null,null,2617,90,235530]
[null,null,null,2618,90,235620]
[null,null,null,2619,90,235710]
[null,null,null,2620,90,235800]
[null,null,null,2621,90,235890]
[null,null,null,2622,90,235980]
[null,null,null,2623,90,236070]
[null,null,null,2624,90,236160]
[null,null,null,2625,90,236250]
[null,null,null,2626,90,236340]
[null,null,null,2627,90,236430]
[null,null,null,2628,90,236520]
[null,null,null,2629,90,236610]
[null,null,null,2630,90,236700]
[null,null,null,2631,90,236790]
[null,null,null,2632,90,236880]
[null,null,null,2633,90,236970]
[null,null,null,2634,90,237060]
[null,null,null,2635,90,237150]
[null,null,null,2636,90,237240]
[null,null,null,2637,90,237330]
[null,null,null,2638,90,237420]
[null,null,null,2639,90,237510]
[null,null,null,2640,90,237600]
[null,null,null,2641,90,237690]
[null,null,null,2642,{"$f":"$E$13","v":90},237780]
[null,null,null,2643,90,237870]
[null,null,null,2644,90,237960]
[null,null,null,2645,90,238050]
[null,null,null,2646,90,238140]
[null,null,null,2647,90,238230]
[null,null,null,2648,90,238320]
[null,null,null,2649,90,238410]
[null,null,null,2650,90,238500]
[null,null,null,2651,90,238590]
[null,null,null,2652,90,238680]
[null,null,null,2653,90,238770]
[null,null,null,2654,90,238860]
[null,null,null,2655,90,238950]
[null,null,null,2656,90,239040]
[null,null,null,2657,90,239130]
[null,null,null,2658,90,239220]
[null,null,null,2659,90,239310]
[null,null,null,2660,90,239400]
[null,null,null,2661,90,{"$f":"E2678*D2678","v":239490}]
[null,null,null,2662,90,239580]
[null,null,null,2663,90,239670]
[null,null,null,2664,90,239760]
[null,null,null,2665,90,239850]
[null,null,null,2666,90,239940]
[null,null,null,2667,90,240030]
[null,null,null,2668,90,240120]
[null,null,null,2669,90,240210]
[null,null,null,2670,90,240300]
[null,null,null,2671,90,240390]
[null,null,null,2672,90,240480]
[null,null,null,2673,90,240570]
[null,null,null,2674,90,240660]
[null,null,null,2675,90,240750]
[null,null,null,2676,90,240840]
[null,null,null,2677,90,240930]
[null,null,null,2678,90,241020]
[null,null,null,2679,90,241110]
[null,null,null,2680,90,241200]
[null,null,null,2681,90,241290]
[null,null,null,2682,90,241380]
[null,null,null,2683,90,241470]
[null,null,null,2684,90,241560]
[null,null,null,2685,90,241650]
[null,null,null,2686,90,241740]
[null,null,null,2687,90,241830]
[null,null,null,2688,90,241920]
[null,null,null,2689,90,242010]
[null,null,null,2690,90,242100]
[null,null,null,2691,90,242190]
[null,null,null,2692,90,242280]
[null,null,null,2693,90,242370]
[null,null,null,2694,90,242460]
[null,null,null,2695,90,242550]
[null,null,null,2696,90,242640]
[null,null,null,2697,90,242730]
[null,null,null,2698,90,242820]
[null,null,null,2699,90,242910]
[null,null,null,2700,90,243000]
[null,null,null,2701,90,243090]
[null,null,null,2702,90,243180]
[null,null,null,2703,90,243270]
[null,null,null,2704,90,243360]
[null,null,null,2705,90,243450]
[null,null,null,2706,{"$f":"$E$13","v":90},243540]
[null,null,null,2707,90,243630]
[null,null,null,2708,90,243720]
[null,null,null,2709,90,243810]
[null,null,null,2710,90,243900]
[null,null,null,2711,90,243990]
[null,null,null,2712,90,244080]
[null,null,null,2713,90,244170]
[null,null,null,2714,90,244260]
[null,null,null,2715,90,244350]
[null,null,null,2716,90,244440]
[null,null,null,2717,90,244530]
[null,null,null,2718,90,244620]
[null,null,null,2719,90,244710]
[null,null,null,2720,90,244800]
[null,null,null,2721,90,244890]
[null,null,null,2722,90,244980]
[null,null,null,2723,90,245070]
[null,null,null,2724,90,245160]
[null,null,null,2725,90,{"$f":"E2742*D2742","v":245250}]
[null,null,null,2726,90,245340]
[null,null,null,2727,90,245430]
[null,null,null,2728,90,245520]
[null,null,null,2729,90,245610]
[null,null,null,2730,90,245700]
[null,null,null,2731,90,245790]
[null,null,null,2732,90,245880]
[null,null,null,2733,90,245970]
[null,null,null,2734,90,246060]
[null,null,null,2735,90,246150]
[null,null,null,2736,90,246240]
[null,null,null,2737,90,246330]
[null,null,null,2738,90,246420]
[null,null,null,2739,90,246510]
[null,null,null,2740,90,246600]
[null,null,null,2741,90,246690]
[null,null,null,2742,90,246780]
[null,null,null,2743,90,246870]
[null,null,null,2744,90,246960]
[null,null,null,2745,90,247050]
[null,null,null,2746,90,247140]
[null,null,null,2747,90,247230]
[null,null,null,2748,90,247320]
[null,null,null,2749,90,247410]
[null,null,null,2750,90,247500]
[null,null,null,2751,90,247590]
[null,null,null,2752,90,247680]
[null,null,null,2753,90,247770]
[null,null,null,2754,90,247860]
[null,null,null,2755,90,247950]
[null,null,null,2756,90,248040]
[null,null,null,2757,90,248130]
[null,null,null,2758,90,248220]
[null,null,null,2759,90,248310]
[null,null,null,2760,90,248400]
[null,null,null,2761,90,248490]
[null,null,null,2762,90,248580]
[null,null,null,2763,90,248670]
[null,null,null,2764,90,248760]
[null,null,null,2765,90,248850]
[null,null,null,2766,90,248940]
[null,null,null,2767,90,249030]
[null,null,null,2768,90,249120]
[null,null,null,2769,90,249210]
[null,null,null,2770,{"$f":"$E$13","v":90},249300]
[null,null,null,2771,90,249390]
[null,null,null,2772,90,249480]
[null,null,null,2773,90,249570]
[null,null,null,2774,90,249660]
[null,null,null,2775,90,249750]
[null,null,null,2776,90,249840]
[null,null,null,2777,90,249930]
[null,null,null,2778,90,250020]
[null,null,null,2779,90,250110]
[null,null,null,2780,90,250200]
[null,null,null,2781,90,250290]
[null,null,null,2782,90,250380]
[null,null,null,2783,90,250470]
[null,null,null,2784,90,250560]
[null,null,null,2785,90,250650]
[null,null,null,2786,90,250740]
[null,null,null,2787,90,250830]
[null,null,null,2788,90,250920]
[null,null,null,2789,90,{"$f":"E2806*D2806","v":251010}]
[null,null,null,2790,90,251100]
[null,null,null,2791,90,251190]
[null,null,null,2792,90,251280]
[null,null,null,2793,90,251370]
[null,null,null,2794,90,251460]
[null,null,null,2795,90,251550]
[null,null,null,2796,90,251640]
[null,null,null,2797,90,251730]
[null,null,null,2798,90,251820]
[null,null,null,2799,90,251910]
[null,null,null,2800,90,252000]
[null,null,null,2801,90,252090]
[null,null,null,2802,90,252180]
[null,null,null,2803,90,252270]
[null,null,null,2804,90,252360]
[null,null,null,2805,90,252450]
[null,null,null,2806,90,252540]
[null,null,null,2807,90,252630]
[null,null,null,2808,90,252720]
[null,null,null,2809,90,252810]
[null,null,null,2810,90,252900]
[null,null,null,2811,90,252990]
[null,null,null,2812,90,253080]
[null,null,null,2813,90,253170]
[null,null,null,2814,90,253260]
[null,null,null,2815,90,253350]
[null,null,null,2816,90,253440]
[null,null,null,2817,90,253530]
[null,null,null,2818,90,253620]
[null,null,null,2819,90,253710]
[null,null,null,2820,90,253800]
[null,null,null,2821,90,253890]
[null,null,null,2822,90,253980]
[null,null,null,2823,90,254070]
[null,null,null,2824,90,254160]
[null,null,null,2825,90,254250]
[null,null,null,2826,90,254340]
[null,null,null,2827,90,254430]
[null,null,null,2828,90,254520]
[null,null,null,2829,90,254610]
[null,null,null,2830,90,254700]
[null,null,null,2831,90,254790]
[null,null,null,2832,90,254880]
[null,null,null,2833,90,254970]
[null,null,null,2834,{"$f":"$E$13","v":90},255060]
[null,null,null,2835,90,255150]
[null,null,null,2836,90,255240]
[null,null,null,2837,90,255330]
[null,null,null,2838,90,255420]
[null,null,null,2839,90,255510]
[null,null,null,2840,90,255600]
[null,null,null,2841,90,255690]
[null,null,null,2842,90,255780]
[null,null,null,2843,90,255870]
[null,null,null,2844,90,255960]
[null,null,null,2845,90,256050]
[null,null,null,2846,90,256140]
[null,null,null,2847,90,256230]
[null,null,null,2848,90,256320]
[null,null,null,2849,90,256410]
[null,null,null,2850,90,256500]
[null,null,null,2851,90,256590]
[null,null,null,2852,90,256680]
[null,null,null,2853,90,{"$f":"E2870*D2870","v":256770}]
[null,null,null,2854,90,256860]
[null,null,null,2855,90,256950]
[null,null,null,2856,90,257040]
[null,null,null,2857,90,257130]
[null,null,null,2858,90,257220]
[null,null,null,2859,90,257310]
[null,null,null,2860,90,257400]
[null,null,null,2861,90,257490]
[null,null,null,2862,90,257580]
[null,null,null,2863,90,257670]
[null,null,null,2864,90,257760]
[null,null,null,2865,90,257850]
[null,null,null,2866,90,257940]
[null,null,null,2867,90,258030]
[null,null,null,2868,90,258120]
[null,null,null,2869,90,258210]
[null,null,null,2870,90,258300]
[null,null,null,2871,90,258390]
[null,null,null,2872,90,258480]
[null,null,null,2873,90,258570]
[null,null,null,2874,90,258660]
[null,null,null,2875,90,258750]
[null,null,null,2876,90,258840]
[null,null,null,2877,90,258930]
[null,null,null,2878,90,259020]
[null,null,null,2879,90,259110]
[null,null,null,2880,90,259200]
[null,null,null,2881,90,259290]
[null,null,null,2882,90,259380]
[null,null,null,2883,90,259470]
[null,null,null,2884,90,259560]
[null,null,null,2885,90,259650]
[null,null,null,2886,90,259740]
[null,null,null,2887,90,259830]
[null,null,null,2888,90,259920]
[null,null,null,2889,90,260010]
[null,null,null,2890,90,260100]
[null,null,null,2891,90,260190]
[null,null,null,2892,90,260280]
[null,null,null,2893,90,260370]
[null,null,null,2894,90,260460]
[null,null,null,2895,90,260550]
[null,null,null,2896,90,260640]
[null,null,null,2897,90,260730]
[null,null,null,2898,{"$f":"$E$13","v":90},260820]
[null,null,null,2899,90,260910]
[null,null,null,2900,90,261000]
[null,null,null,2901,90,261090]
[null,null,null,2902,90,261180]
[null,null,null,2903,90,261270]
[null,null,null,2904,90,261360]
[null,null,null,2905,90,261450]
[null,null,null,2906,90,261540]
[null,null,null,2907,90,261630]
[null,null,null,2908,90,261720]
[null,null,null,2909,90,261810]
[null,null,null,2910,90,261900]
[null,null,null,2911,90,261990]
[null,null,null,2912,90,262080]
[null,null,null,2913,90,262170]
[null,null,null,2914,90,262260]
[null,null,null,2915,90,262350]
[null,null,null,2916,90,262440]
[null,null,null,2917,90,{"$f":"E2934*D2934","v":262530}]
[null,null,null,2918,90,262620]
[null,null,null,2919,90,262710]
[null,null,null,2920,90,262800]
[null,null,null,2921,90,262890]
[null,null,null,2922,90,262980]
[null,null,null,2923,90,263070]
[null,null,null,2924,90,263160]
[null,null,null,2925,90,263250]
[null,null,null,2926,90,263340]
[null,null,null,2927,90,263430]
[null,null,null,2928,90,263520]
[null,null,null,2929,90,263610]
[null,null,null,2930,90,263700]
[null,null,null,2931,90,263790]
[null,null,null,2932,90,263880]
[null,null,null,2933,90,263970]
[null,null,null,2934,90,264060]
[null,null,null,2935,90,264150]
[null,null,null,2936,90,264240]
[null,null,null,2937,90,264330]
[null,null,null,2938,90,264420]
[null,null,null,2939,90,264510]
[null,null,null,2940,90,264600]
[null,null,null,2941,90,264690]
[null,null,null,2942,90,264780]
[null,null,null,2943,90,264870]
[null,null,null,2944,90,264960]
[null,null,null,2945,90,265050]
[null,null,null,2946,90,265140]
[null,null,null,2947,90,265230]
[null,null,null,2948,90,265320]
[null,null,null,2949,90,265410]
[null,null,null,2950,90,265500]
[null,null,null,2951,90,265590]
[null,null,null,2952,90,265680]
[null,null,null,2953,90,265770]
[null,null,null,2954,90,265860]
[null,null,null,2955,90,265950]
[null,null,null,2956,90,266040]
[null,null,null,2957,90,266130]
[null,null,null,2958,90,266220]
[null,null,null,2959,90,266310]
[null,null,null,2960,90,266400]
[null,null,null,2961,90,266490]
[null,null,null,2962,{"$f":"$E$13","v":90},266580]
[null,null,null,2963,90,266670]
[null,null,null,2964,90,266760]
[null,null,null,2965,90,266850]
[null,null,null,2966,90,266940]
[null,null,null,2967,90,267030]
[null,null,null,2968,90,267120]
[null,null,null,2969,90,267210]
[null,null,null,2970,90,267300]
[null,null,null,2971,90,267390]
[null,null,null,2972,90,267480]
[null,null,null,2973,90,267570]
[null,null,null,2974,90,267660]
[null,null,null,2975,90,267750]
[null,null,null,2976,90,267840]
[null,null,null,2977,90,267930]
[null,null,null,2978,90,268020]
[null,null,null,2979,90,268110]
[null,null,null,2980,90,268200]
[null,null,null,2981,90,{"$f":"E2998*D2998","v":268290}]
[null,null,null,2982,90,268380]
[null,null,null,2983,90,268470]
[null,null,null,2984,90,268560]
[null,null,null,2985,90,268650]
[null,null,null,2986,90,268740]
[null,null,null,2987,90,268830]
[null,null,null,2988,90,268920]
[null,null,null,2989,90,269010]
[null,null,null,2990,90,269100]
[null,null,null,2991,90,269190]
[null,null,null,2992,90,269280]
[null,null,null,2993,90,269370]
[null,null,null,2994,90,269460]
[null,null,null,2995,90,269550]
[null,null,null,2996,90,269640]
[null,null,null,2997,90,269730]
[null,null,null,2998,90,269820]
[null,null,null,2999,90,269910]
[null,null,null,3000,90,270000]
[null,null,null,3001,90,270090]
[null,null,null,3002,90,270180]
[null,null,null,3003,90,270270]
[null,null,null,3004,90,270360]
[null,null,null,3005,90,270450]
[null,null,null,3006,90,270540]
[null,null,null,3007,90,270630]
[null,null,null,3008,90,270720]
[null,null,null,3009,90,270810]
[null,null,null,3010,90,270900]
[null,null,null,3011,90,270990]
[null,null,null,3012,90,271080]
[null,null,null,3013,90,271170]
[null,null,null,3014,90,271260]
[null,null,null,3015,90,271350]
[null,null,null,3016,90,271440]
[null,null,null,3017,90,271530]
[null,null,null,3018,90,271620]
[null,null,null,3019,90,271710]
[null,null,null,3020,90,271800]
[null,null,null,3021,90,271890]
[null,null,null,3022,90,271980]
[null,null,null,3023,90,272070]
[null,null,null,3024,90,272160]
[null,null,null,3025,90,272250]
[null,null,null,3026,{"$f":"$E$13","v":90},272340]
[null,null,null,3027,90,272430]
[null,null,null,3028,90,272520]
[null,null,null,3029,90,272610]
[null,null,null,3030,90,272700]
[null,null,null,3031,90,272790]
[null,null,null,3032,90,272880]
[null,null,null,3033,90,272970]
[null,null,null,3034,90,273060]
[null,null,null,3035,90,273150]
[null,null,null,3036,90,273240]
[null,null,null,3037,90,273330]
[null,null,null,3038,90,273420]
[null,null,null,3039,90,273510]
[null,null,null,3040,90,273600]
[null,null,null,3041,90,273690]
[null,null,null,3042,90,273780]
[null,null,null,3043,90,273870]
[null,null,null,3044,90,273960]
[null,null,null,3045,90,{"$f":"E3062*D3062","v":274050}]
[null,null,null,3046,90,274140]
[null,null,null,3047,90,274230]
[null,null,null,3048,90,274320]
[null,null,null,3049,90,274410]
[null,null,null,3050,90,274500]
[null,null,null,3051,90,274590]
[null,null,null,3052,90,274680]
[null,null,null,3053,90,274770]
[null,null,null,3054,90,274860]
[null,null,null,3055,90,274950]
[null,null,null,3056,90,275040]
[null,null,null,3057,90,275130]
[null,null,null,3058,90,275220]
[null,null,null,3059,90,275310]
[null,null,null,3060,90,275400]
[null,null,null,3061,90,275490]
[null,null,null,3062,90,275580]
[null,null,null,3063,90,275670]
[null,null,null,3064,90,275760]
[null,null,null,3065,90,275850]
[null,null,null,3066,90,275940]
[null,null,null,3067,90,276030]
[null,null,null,3068,90,276120]
[null,null,null,3069,90,276210]
[null,null,null,3070,90,276300]
[null,null,null,3071,90,276390]
[null,null,null,3072,90,276480]
[null,null,null,3073,90,276570]
[null,null,null,3074,90,276660]
[null,null,null,3075,90,276750]
[null,null,null,3076,90,276840]
[null,null,null,3077,90,276930]
[null,null,null,3078,90,277020]
[null,null,null,3079,90,277110]
[null,null,null,3080,90,277200]
[null,null,null,3081,90,277290]
[null,null,null,3082,90,277380]
[null,null,null,3083,90,277470]
[null,null,null,3084,90,277560]
[null,null,null,3085,90,277650]
[null,null,null,3086,90,277740]
[null,null,null,3087,90,277830]
[null,null,null,3088,90,277920]
[null,null,null,3089,90,278010]
[null,null,null,3090,{"$f":"$E$13","v":90},278100]
[null,null,null,3091,90,278190]
[null,null,null,3092,90,278280]
[null,null,null,3093,90,278370]
[null,null,null,3094,90,278460]
[null,null,null,3095,90,278550]
[null,null,null,3096,90,278640]
[null,null,null,3097,90,278730]
[null,null,null,3098,90,278820]
[null,null,null,3099,90,278910]
[null,null,null,3100,90,279000]
[null,null,null,3101,90,279090]
[null,null,null,3102,90,279180]
[null,null,null,3103,90,279270]
[null,null,null,3104,90,279360]
[null,null,null,3105,90,279450]
[null,null,null,3106,90,279540]
[null,null,null,3107,90,279630]
[null,null,null,3108,90,279720]
[null,null,null,3109,90,{"$f":"E3126*D3126","v":279810}]
[null,null,null,3110,90,279900]
[null,null,null,3111,90,279990]
[null,null,null,3112,90,280080]
[null,null,null,3113,90,280170]
[null,null,null,3114,90,280260]
[null,null,null,3115,90,280350]
[null,null,null,3116,90,280440]
[null,null,null,3117,90,280530]
[null,null,null,3118,90,280620]
[null,null,null,3119,90,280710]
[null,null,null,3120,90,280800]
[null,null,null,3121,90,280890]
[null,null,null,3122,90,280980]
[null,null,null,3123,90,281070]
[null,null,null,3124,90,281160]
[null,null,null,3125,90,281250]
[null,null,null,3126,90,281340]
[null,null,null,3127,90,281430]
[null,null,null,3128,90,281520]
[null,null,null,3129,90,281610]
[null,null,null,3130,90,281700]
[null,null,null,3131,90,281790]
[null,null,null,3132,90,281880]
[null,null,null,3133,90,281970]
[null,null,null,3134,90,282060]
[null,null,null,3135,90,282150]
[null,null,null,3136,90,282240]
[null,null,null,3137,90,282330]
[null,null,null,3138,90,282420]
[null,null,null,3139,90,282510]
[null,null,null,3140,90,282600]
[null,null,null,3141,90,282690]
[null,null,null,3142,90,282780]
[null,null,null,3143,90,282870]
[null,null,null,3144,90,282960]
[null,null,null,3145,90,283050]
[null,null,null,3146,90,283140]
[null,null,null,3147,90,283230]
[null,null,null,3148,90,283320]
[null,null,null,3149,90,283410]
[null,null,null,3150,90,283500]
[null,null,null,3151,90,283590]
[null,null,null,3152,90,283680]
[null,null,null,3153,90,283770]
[null,null,null,3154,{"$f":"$E$13","v":90},283860]
[null,null,null,3155,90,283950]
[null,null,null,3156,90,284040]
[null,null,null,3157,90,284130]
[null,null,null,3158,90,284220]
[null,null,null,3159,90,284310]
[null,null,null,3160,90,284400]
[null,null,null,3161,90,284490]
[null,null,null,3162,90,284580]
[null,null,null,3163,90,284670]
[null,null,null,3164,90,284760]
[null,null,null,3165,90,284850]
[null,null,null,3166,90,284940]
[null,null,null,3167,90,285030]
[null,null,null,3168,90,285120]
[null,null,null,3169,90,285210]
[null,null,null,3170,90,285300]
[null,null,null,3171,90,285390]
[null,null,null,3172,90,285480]
[null,null,null,3173,90,{"$f":"E3190*D3190","v":285570}]
[null,null,null,3174,90,285660]
[null,null,null,3175,90,285750]
[null,null,null,3176,90,285840]
[null,null,null,3177,90,285930]
[null,null,null,3178,90,286020]
[null,null,null,3179,90,286110]
[null,null,null,3180,90,286200]
[null,null,null,3181,90,286290]
[null,null,null,3182,90,286380]
[null,null,null,3183,90,286470]
[null,null,null,3184,90,286560]
[null,null,null,3185,90,286650]
[null,null,null,3186,90,286740]
[null,null,null,3187,90,286830]
[null,null,null,3188,90,286920]
[null,null,null,3189,90,287010]
[null,null,null,3190,90,287100]
[null,null,null,3191,90,287190]
[null,null,null,3192,90,287280]
[null,null,null,3193,90,287370]
[null,null,null,3194,90,287460]
[null,null,null,3195,90,287550]
[null,null,null,3196,90,287640]
[null,null,null,3197,90,287730]
[null,null,null,3198,90,287820]
[null,null,null,3199,90,287910]
[null,null,null,3200,90,288000]
[null,null,null,3201,90,288090]
[null,null,null,3202,90,288180]
[null,null,null,3203,90,288270]
[null,null,null,3204,90,288360]
[null,null,null,3205,90,288450]
[null,null,null,3206,90,288540]
[null,null,null,3207,90,288630]
[null,null,null,3208,90,288720]
[null,null,null,3209,90,288810]
[null,null,null,3210,90,288900]
[null,null,null,3211,90,288990]
[null,null,null,3212,90,289080]
[null,null,null,3213,90,289170]
[null,null,null,3214,90,289260]
[null,null,null,3215,90,289350]
[null,null,null,3216,90,289440]
[null,null,null,3217,90,289530]
[null,null,null,3218,{"$f":"$E$13","v":90},289620]
[null,null,null,3219,90,289710]
[null,null,null,3220,90,289800]
[null,null,null,3221,90,289890]
[null,null,null,3222,90,289980]
[null,null,null,3223,90,290070]
[null,null,null,3224,90,290160]
[null,null,null,3225,90,290250]
[null,null,null,3226,90,290340]
[null,null,null,3227,90,290430]
[null,null,null,3228,90,290520]
[null,null,null,3229,90,290610]
[null,null,null,3230,90,290700]
[null,null,null,3231,90,290790]
[null,null,null,3232,90,290880]
[null,null,null,3233,90,290970]
[null,null,null,3234,90,291060]
[null,null,null,3235,90,291150]
[null,null,null,3236,90,291240]
[null,null,null,3237,90,{"$f":"E3254*D3254","v":291330}]
[null,null,null,3238,90,291420]
[null,null,null,3239,90,291510]
[null,null,null,3240,90,291600]
[null,null,null,3241,90,291690]
[null,null,null,3242,90,291780]
[null,null,null,3243,90,291870]
[null,null,null,3244,90,291960]
[null,null,null,3245,90,292050]
[null,null,null,3246,90,292140]
[null,null,null,3247,90,292230]
[null,null,null,3248,90,292320]
[null,null,null,3249,90,292410]
[null,null,null,3250,90,292500]
[null,null,null,3251,90,292590]
[null,null,null,3252,90,292680]
[null,null,null,3253,90,292770]
[null,null,null,3254,90,292860]
[null,null,null,3255,90,292950]
[null,null,null,3256,90,293040]
[null,null,null,3257,90,293130]
[null,null,null,3258,90,293220]
[null,null,null,3259,90,293310]
[null,null,null,3260,90,293400]
[null,null,null,3261,90,293490]
[null,null,null,3262,90,293580]
[null,null,null,3263,90,293670]
[null,null,null,3264,90,293760]
[null,null,null,3265,90,293850]
[null,null,null,3266,90,293940]
[null,null,null,3267,90,294030]
[null,null,null,3268,90,294120]
[null,null,null,3269,90,294210]
[null,null,null,3270,90,294300]
[null,null,null,3271,90,294390]
[null,null,null,3272,90,294480]
[null,null,null,3273,90,294570]
[null,null,null,3274,90,294660]
[null,null,null,3275,90,294750]
[null,null,null,3276,90,294840]
[null,null,null,3277,90,294930]
[null,null,null,3278,90,295020]
[null,null,null,3279,90,295110]
[null,null,null,3280,90,295200]
[null,null,null,3281,90,295290]
[null,null,null,3282,{"$f":"$E$13","v":90},295380]
[null,null,null,3283,90,295470]
[null,null,null,3284,90,295560]
[null,null,null,3285,90,295650]
[null,null,null,3286,90,295740]
[null,null,null,3287,90,295830]
[null,null,null,3288,90,295920]
[null,null,null,3289,90,296010]
[null,null,null,3290,90,296100]
[null,null,null,3291,90,296190]
[null,null,null,3292,90,296280]
[null,null,null,3293,90,296370]
[null,null,null,3294,90,296460]
[null,null,null,3295,90,296550]
[null,null,null,3296,90,296640]
[null,null,null,3297,90,296730]
[null,null,null,3298,90,296820]
[null,null,null,3299,90,296910]
[null,null,null,3300,90,297000]
[null,null,null,3301,90,{"$f":"E3318*D3318","v":297090}]
[null,null,null,3302,90,297180]
[null,null,null,3303,90,297270]
[null,null,null,3304,90,297360]
[null,null,null,3305,90,297450]
[null,null,null,3306,90,297540]
[null,null,null,3307,90,297630]
[null,null,null,3308,90,297720]
[null,null,null,3309,90,297810]
[null,null,null,3310,90,297900]
[null,null,null,3311,90,297990]
[null,null,null,3312,90,298080]
[null,null,null,3313,90,298170]
[null,null,null,3314,90,298260]
[null,null,null,3315,90,298350]
[null,null,null,3316,90,298440]
[null,null,null,3317,90,298530]
[null,null,null,3318,90,298620]
[null,null,null,3319,90,298710]
[null,null,null,3320,90,298800]
[null,null,null,3321,90,298890]
[null,null,null,3322,90,298980]
[null,null,null,3323,90,299070]
[null,null,null,3324,90,299160]
[null,null,null,3325,90,299250]
[null,null,null,3326,90,299340]
[null,null,null,3327,90,299430]
[null,null,null,3328,90,299520]
[null,null,null,3329,90,299610]
[null,null,null,3330,90,299700]
[null,null,null,3331,90,299790]
[null,null,null,3332,90,299880]
[null,null,null,3333,90,299970]
[null,null,null,3334,90,300060]
[null,null,null,3335,90,300150]
[null,null,null,3336,90,300240]
[null,null,null,3337,90,300330]
[null,null,null,3338,90,300420]
[null,null,null,3339,90,300510]
[null,null,null,3340,90,300600]
[null,null,null,3341,90,300690]
[null,null,null,3342,90,300780]
[null,null,null,3343,90,300870]
[null,null,null,3344,90,300960]
[null,null,null,3345,90,301050]
[null,null,null,3346,{"$f":"$E$13","v":90},301140]
[null,null,null,3347,90,301230]
[null,null,null,3348,90,301320]
[null,null,null,3349,90,301410]
[null,null,null,3350,90,301500]
[null,null,null,3351,90,301590]
[null,null,null,3352,90,301680]
[null,null,null,3353,90,301770]
[null,null,null,3354,90,301860]
[null,null,null,3355,90,301950]
[null,null,null,3356,90,302040]
[null,null,null,3357,90,302130]
[null,null,null,3358,90,302220]
[null,null,null,3359,90,302310]
[null,null,null,3360,90,302400]
[null,null,null,3361,90,302490]
[null,null,null,3362,90,302580]
[null,null,null,3363,90,302670]
[null,null,null,3364,90,302760]
[null,null,null,3365,90,{"$f":"E3382*D3382","v":302850}]
[null,null,null,3366,90,302940]
[null,null,null,3367,90,303030]
[null,null,null,3368,90,303120]
[null,null,null,3369,90,303210]
[null,null,null,3370,90,303300]
[null,null,null,3371,90,303390]
[null,null,null,3372,90,303480]
[null,null,null,3373,90,303570]
[null,null,null,3374,90,303660]
[null,null,null,3375,90,303750]
[null,null,null,3376,90,303840]
[null,null,null,3377,90,303930]
[null,null,null,3378,90,304020]
[null,null,null,3379,90,304110]
[null,null,null,3380,90,304200]
[null,null,null,3381,90,304290]
[null,null,null,3382,90,304380]
[null,null,null,3383,90,304470]
[null,null,null,3384,90,304560]
[null,null,null,3385,90,304650]
[null,null,null,3386,90,304740]
[null,null,null,3387,90,304830]
[null,null,null,3388,90,304920]
[null,null,null,3389,90,305010]
[null,null,null,3390,90,305100]
[null,null,null,3391,90,305190]
[null,null,null,3392,90,305280]
[null,null,null,3393,90,305370]
[null,null,null,3394,90,305460]
[null,null,null,3395,90,305550]
[null,null,null,3396,90,305640]
[null,null,null,3397,90,305730]
[null,null,null,3398,90,305820]
[null,null,null,3399,90,305910]
[null,null,null,3400,90,306000]
[null,null,null,3401,90,306090]
[null,null,null,3402,90,306180]
[null,null,null,3403,90,306270]
[null,null,null,3404,90,306360]
[null,null,null,3405,90,306450]
[null,null,null,3406,90,306540]
[null,null,null,3407,90,306630]
[null,null,null,3408,90,306720]
[null,null,null,3409,90,306810]
[null,null,null,3410,{"$f":"$E$13","v":90},306900]
[null,null,null,3411,90,306990]
[null,null,null,3412,90,307080]
[null,null,null,3413,90,307170]
[null,null,null,3414,90,307260]
[null,null,null,3415,90,307350]
[null,null,null,3416,90,307440]
[null,null,null,3417,90,307530]
[null,null,null,3418,90,307620]
[null,null,null,3419,90,307710]
[null,null,null,3420,90,307800]
[null,null,null,3421,90,307890]
[null,null,null,3422,90,307980]
[null,null,null,3423,90,308070]
[null,null,null,3424,90,308160]
[null,null,null,3425,90,308250]
[null,null,null,3426,90,308340]
[null,null,null,3427,90,308430]
[null,null,null,3428,90,308520]
[null,null,null,3429,90,{"$f":"E3446*D3446","v":308610}]
[null,null,null,3430,90,308700]
[null,null,null,3431,90,308790]
[null,null,null,3432,90,308880]
[null,null,null,3433,90,308970]
[null,null,null,3434,90,309060]
[null,null,null,3435,90,309150]
[null,null,null,3436,90,309240]
[null,null,null,3437,90,309330]
[null,null,null,3438,90,309420]
[null,null,null,3439,90,309510]
[null,null,null,3440,90,309600]
[null,null,null,3441,90,309690]
[null,null,null,3442,90,309780]
[null,null,null,3443,90,309870]
[null,null,null,3444,90,309960]
[null,null,null,3445,90,310050]
[null,null,null,3446,90,310140]
[null,null,null,3447,90,310230]
[null,null,null,3448,90,310320]
[null,null,null,3449,90,310410]
[null,null,null,3450,90,310500]
[null,null,null,3451,90,310590]
[null,null,null,3452,90,310680]
[null,null,null,3453,90,310770]
[null,null,null,3454,90,310860]
[null,null,null,3455,90,310950]
[null,null,null,3456,90,311040]
[null,null,null,3457,90,311130]
[null,null,null,3458,90,311220]
[null,null,null,3459,90,311310]
[null,null,null,3460,90,311400]
[null,null,null,3461,90,311490]
[null,null,null,3462,90,311580]
[null,null,null,3463,90,311670]
[null,null,null,3464,90,311760]
[null,null,null,3465,90,311850]
[null,null,null,3466,90,311940]
[null,null,null,3467,90,312030]
[null,null,null,3468,90,312120]
[null,null,null,3469,90,312210]
[null,null,null,3470,90,312300]
[null,null,null,3471,90,312390]
[null,null,null,3472,90,312480]
[null,null,null,3473,90,312570]
[null,null,null,3474,{"$f":"$E$13","v":90},312660]
[null,null,null,3475,90,312750]
[null,null,null,3476,90,312840]
[null,null,null,3477,90,312930]
[null,null,null,3478,90,313020]
[null,null,null,3479,90,313110]
[null,null,null,3480,90,313200]
[null,null,null,3481,90,313290]
[null,null,null,3482,90,313380]
[null,null,null,3483,90,313470]
[null,null,null,3484,90,313560]
[null,null,null,3485,90,313650]
[null,null,null,3486,90,313740]
[null,null,null,3487,90,313830]
[null,null,null,3488,90,313920]
[null,null,null,3489,90,314010]
[null,null,null,3490,90,314100]
[null,null,null,3491,90,314190]
[null,null,null,3492,90,314280]
[null,null,null,3493,90,{"$f":"E3510*D3510","v":314370}]
[null,null,null,3494,90,314460]
[null,null,null,3495,90,314550]
[null,null,null,3496,90,314640]
[null,null,null,3497,90,314730]
[null,null,null,3498,90,314820]
[null,null,null,3499,90,314910]
[null,null,null,3500,90,315000]
[null,null,null,3501,90,315090]
[null,null,null,3502,90,315180]
[null,null,null,3503,90,315270]
[null,null,null,3504,90,315360]
[null,null,null,3505,90,315450]
[null,null,null,3506,90,315540]
[null,null,null,3507,90,315630]
[null,null,null,3508,90,315720]
[null,null,null,3509,90,315810]
[null,null,null,3510,90,315900]
[null,null,null,3511,90,315990]
[null,null,null,3512,90,316080]
[null,null,null,3513,90,316170]
[null,null,null,3514,90,316260]
[null,null,null,3515,90,316350]
[null,null,null,3516,90,316440]
[null,null,null,3517,90,316530]
[null,null,null,3518,90,316620]
[null,null,null,3519,90,316710]
[null,null,null,3520,90,316800]
[null,null,null,3521,90,316890]
[null,null,null,3522,90,316980]
[null,null,null,3523,90,317070]
[null,null,null,3524,90,317160]
[null,null,null,3525,90,317250]
[null,null,null,3526,90,317340]
[null,null,null,3527,90,317430]
[null,null,null,3528,90,317520]
[null,null,null,3529,90,317610]
[null,null,null,3530,90,317700]
[null,null,null,3531,90,317790]
[null,null,null,3532,90,317880]
[null,null,null,3533,90,317970]
[null,null,null,3534,90,318060]
[null,null,null,3535,90,318150]
[null,null,null,3536,90,318240]
[null,null,null,3537,90,318330]
[null,null,null,3538,{"$f":"$E$13","v":90},318420]
[null,null,null,3539,90,318510]
[null,null,null,3540,90,318600]
[null,null,null,3541,90,318690]
[null,null,null,3542,90,318780]
[null,null,null,3543,90,318870]
[null,null,null,3544,90,318960]
[null,null,null,3545,90,319050]
[null,null,null,3546,90,319140]
[null,null,null,3547,90,319230]
[null,null,null,3548,90,319320]
[null,null,null,3549,90,319410]
[null,null,null,3550,90,319500]
[null,null,null,3551,90,319590]
[null,null,null,3552,90,319680]
[null,null,null,3553,90,319770]
[null,null,null,3554,90,319860]
[null,null,null,3555,90,319950]
[null,null,null,3556,90,320040]
[null,null,null,3557,90,{"$f":"E3574*D3574","v":320130}]
[null,null,null,3558,90,320220]
[null,null,null,3559,90,320310]
[null,null,null,3560,90,320400]
[null,null,null,3561,90,320490]
[null,null,null,3562,90,320580]
[null,null,null,3563,90,320670]
[null,null,null,3564,90,320760]
[null,null,null,3565,90,320850]
[null,null,null,3566,90,320940]
[null,null,null,3567,90,321030]
[null,null,null,3568,90,321120]
[null,null,null,3569,90,321210]
[null,null,null,3570,90,321300]
[null,null,null,3571,90,321390]
[null,null,null,3572,90,321480]
[null,null,null,3573,90,321570]
[null,null,null,3574,90,321660]
[null,null,null,3575,90,321750]
[null,null,null,3576,90,321840]
[null,null,null,3577,90,321930]
[null,null,null,3578,90,322020]
[null,null,null,3579,90,322110]
[null,null,null,3580,90,322200]
[null,null,null,3581,90,322290]
[null,null,null,3582,90,322380]
[null,null,null,3583,90,322470]
[null,null,null,3584,90,322560]
[null,null,null,3585,90,322650]
[null,null,null,3586,90,322740]
[null,null,null,3587,90,322830]
[null,null,null,3588,90,322920]
[null,null,null,3589,90,323010]
[null,null,null,3590,90,323100]
[null,null,null,3591,90,323190]
[null,null,null,3592,90,323280]
[null,null,null,3593,90,323370]
[null,null,null,3594,90,323460]
[null,null,null,3595,90,323550]
[null,null,null,3596,90,323640]
[null,null,null,3597,90,323730]
[null,null,null,3598,90,323820]
[null,null,null,3599,90,323910]
[null,null,null,3600,90,324000]
[null,null,null,3601,90,324090]
[null,null,null,3602,{"$f":"$E$13","v":90},324180]
[null,null,null,3603,90,324270]
[null,null,null,3604,90,324360]
[null,null,null,3605,90,324450]
[null,null,null,3606,90,324540]
[null,null,null,3607,90,324630]
[null,null,null,3608,90,324720]
[null,null,null,3609,90,324810]
[null,null,null,3610,90,324900]
[null,null,null,3611,90,324990]
[null,null,null,3612,90,325080]
[null,null,null,3613,90,325170]
[null,null,null,3614,90,325260]
[null,null,null,3615,90,325350]
[null,null,null,3616,90,325440]
[null,null,null,3617,90,325530]
[null,null,null,3618,90,325620]
[null,null,null,3619,90,325710]
[null,null,null,3620,90,325800]
[null,null,null,3621,90,{"$f":"E3638*D3638","v":325890}]
[null,null,null,3622,90,325980]
[null,null,null,3623,90,326070]
[null,null,null,3624,90,326160]
[null,null,null,3625,90,326250]
[null,null,null,3626,90,326340]
[null,null,null,3627,90,326430]
[null,null,null,3628,90,326520]
[null,null,null,3629,90,326610]
[null,null,null,3630,90,326700]
[null,null,null,3631,90,326790]
[null,null,null,3632,90,326880]
[null,null,null,3633,90,326970]
[null,null,null,3634,90,327060]
[null,null,null,3635,90,327150]
[null,null,null,3636,90,327240]
[null,null,null,3637,90,327330]
[null,null,null,3638,90,327420]
[null,null,null,3639,90,327510]
[null,null,null,3640,90,327600]
[null,null,null,3641,90,327690]
[null,null,null,3642,90,327780]
[null,null,null,3643,90,327870]
[null,null,null,3644,90,327960]
[null,null,null,3645,90,328050]
[null,null,null,3646,90,328140]
[null,null,null,3647,90,328230]
[null,null,null,3648,90,328320]
[null,null,null,3649,90,328410]
[null,null,null,3650,90,328500]
[null,null,null,3651,90,328590]
[null,null,null,3652,90,328680]
[null,null,null,3653,90,328770]
[null,null,null,3654,90,328860]
[null,null,null,3655,90,328950]
[null,null,null,3656,90,329040]
[null,null,null,3657,90,329130]
[null,null,null,3658,90,329220]
[null,null,null,3659,90,329310]
[null,null,null,3660,90,329400]
[null,null,null,3661,90,329490]
[null,null,null,3662,90,329580]
[null,null,null,3663,90,329670]
[null,null,null,3664,90,329760]
[null,null,null,3665,90,329850]
[null,null,null,3666,{"$f":"$E$13","v":90},329940]
[null,null,null,3667,90,330030]
[null,null,null,3668,90,330120]
[null,null,null,3669,90,330210]
[null,null,null,3670,90,330300]
[null,null,null,3671,90,330390]
[null,null,null,3672,90,330480]
[null,null,null,3673,90,330570]
[null,null,null,3674,90,330660]
[null,null,null,3675,90,330750]
[null,null,null,3676,90,330840]
[null,null,null,3677,90,330930]
[null,null,null,3678,90,331020]
[null,null,null,3679,90,331110]
[null,null,null,3680,90,331200]
[null,null,null,3681,90,331290]
[null,null,null,3682,90,331380]
[null,null,null,3683,90,331470]
[null,null,null,3684,90,331560]
[null,null,null,3685,90,{"$f":"E3702*D3702","v":331650}]
[null,null,null,3686,90,331740]
[null,null,null,3687,90,331830]
[null,null,null,3688,90,331920]
[null,null,null,3689,90,332010]
[null,null,null,3690,90,332100]
[null,null,null,3691,90,332190]
[null,null,null,3692,90,332280]
[null,null,null,3693,90,332370]
[null,null,null,3694,90,332460]
[null,null,null,3695,90,332550]
[null,null,null,3696,90,332640]
[null,null,null,3697,90,332730]
[null,null,null,3698,90,332820]
[null,null,null,3699,90,332910]
[null,null,null,3700,90,333000]
[null,null,null,3701,90,333090]
[null,null,null,3702,90,333180]
[null,null,null,3703,90,333270]
[null,null,null,3704,90,333360]
[null,null,null,3705,90,333450]
[null,null,null,3706,90,333540]
[null,null,null,3707,90,333630]
[null,null,null,3708,90,333720]
[null,null,null,3709,90,333810]
[null,null,null,3710,90,333900]
[null,null,null,3711,90,333990]
[null,null,null,3712,90,334080]
[null,null,null,3713,90,334170]
[null,null,null,3714,90,334260]
[null,null,null,3715,90,334350]
[null,null,null,3716,90,334440]
[null,null,null,3717,90,334530]
[null,null,null,3718,90,334620]
[null,null,null,3719,90,334710]
[null,null,null,3720,90,334800]
[null,null,null,3721,90,334890]
[null,null,null,3722,90,334980]
[null,null,null,3723,90,335070]
[null,null,null,3724,90,335160]
[null,null,null,3725,90,335250]
[null,null,null,3726,90,335340]
[null,null,null,3727,90,335430]
[null,null,null,3728,90,335520]
[null,null,null,3729,90,335610]
[null,null,null,3730,{"$f":"$E$13","v":90},335700]
[null,null,null,3731,90,335790]
[null,null,null,3732,90,335880]
[null,null,null,3733,90,335970]
[null,null,null,3734,90,336060]
[null,null,null,3735,90,336150]
[null,null,null,3736,90,336240]
[null,null,null,3737,90,336330]
[null,null,null,3738,90,336420]
[null,null,null,3739,90,336510]
[null,null,null,3740,90,336600]
[null,null,null,3741,90,336690]
[null,null,null,3742,90,336780]
[null,null,null,3743,90,336870]
[null,null,null,3744,90,336960]
[null,null,null,3745,90,337050]
[null,null,null,3746,90,337140]
[null,null,null,3747,90,337230]
[null,null,null,3748,90,337320]
[null,null,null,3749,90,{"$f":"E3766*D3766","v":337410}]
[null,null,null,3750,90,337500]
[null,null,null,3751,90,337590]
[null,null,null,3752,90,337680]
[null,null,null,3753,90,337770]
[null,null,null,3754,90,337860]
[null,null,null,3755,90,337950]
[null,null,null,3756,90,338040]
[null,null,null,3757,90,338130]
[null,null,null,3758,90,338220]
[null,null,null,3759,90,338310]
[null,null,null,3760,90,338400]
[null,null,null,3761,90,338490]
[null,null,null,3762,90,338580]
[null,null,null,3763,90,338670]
[null,null,null,3764,90,338760]
[null,null,null,3765,90,338850]
[null,null,null,3766,90,338940]
[null,null,null,3767,90,339030]
[null,null,null,3768,90,339120]
[null,null,null,3769,90,339210]
[null,null,null,3770,90,339300]
[null,null,null,3771,90,339390]
[null,null,null,3772,90,339480]
[null,null,null,3773,90,339570]
[null,null,null,3774,90,339660]
[null,null,null,3775,90,339750]
[null,null,null,3776,90,339840]
[null,null,null,3777,90,339930]
[null,null,null,3778,90,340020]
[null,null,null,3779,90,340110]
[null,null,null,3780,90,340200]
[null,null,null,3781,90,340290]
[null,null,null,3782,90,340380]
[null,null,null,3783,90,340470]
[null,null,null,3784,90,340560]
[null,null,null,3785,90,340650]
[null,null,null,3786,90,340740]
[null,null,null,3787,90,340830]
[null,null,null,3788,90,340920]
[null,null,null,3789,90,341010]
[null,null,null,3790,90,341100]
[null,null,null,3791,90,341190]
[null,null,null,3792,90,341280]
[null,null,null,3793,90,341370]
[null,null,null,3794,{"$f":"$E$13","v":90},341460]
[null,null,null,3795,90,341550]
[null,null,null,3796,90,341640]
[null,null,null,3797,90,341730]
[null,null,null,3798,90,341820]
[null,null,null,3799,90,341910]
[null,null,null,3800,90,342000]
[null,null,null,3801,90,342090]
[null,null,null,3802,90,342180]
[null,null,null,3803,90,342270]
[null,null,null,3804,90,342360]
[null,null,null,3805,90,342450]
[null,null,null,3806,90,342540]
[null,null,null,3807,90,342630]
[null,null,null,3808,90,342720]
[null,null,null,3809,90,342810]
[null,null,null,3810,90,342900]
[null,null,null,3811,90,342990]
[null,null,null,3812,90,343080]
[null,null,null,3813,90,{"$f":"E3830*D3830","v":343170}]
[null,null,null,3814,90,343260]
[null,null,null,3815,90,343350]
[null,null,null,3816,90,343440]
[null,null,null,3817,90,343530]
[null,null,null,3818,90,343620]
[null,null,null,3819,90,343710]
[null,null,null,3820,90,343800]
[null,null,null,3821,90,343890]
[null,null,null,3822,90,343980]
[null,null,null,3823,90,344070]
[null,null,null,3824,90,344160]
[null,null,null,3825,90,344250]
[null,null,null,3826,90,344340]
[null,null,null,3827,90,344430]
[null,null,null,3828,90,344520]
[null,null,null,3829,90,344610]
[null,null,null,3830,90,344700]
[null,null,null,3831,90,344790]
[null,null,null,3832,90,344880]
[null,null,null,3833,90,344970]
[null,null,null,3834,90,345060]
[null,null,null,3835,90,345150]
[null,null,null,3836,90,345240]
[null,null,null,3837,90,345330]
[null,null,null,3838,90,345420]
[null,null,null,3839,90,345510]
[null,null,null,3840,90,345600]
[null,null,null,3841,90,345690]
[null,null,null,3842,90,345780]
[null,null,null,3843,90,345870]
[null,null,null,3844,90,345960]
[null,null,null,3845,90,346050]
[null,null,null,3846,90,346140]
[null,null,null,3847,90,346230]
[null,null,null,3848,90,346320]
[null,null,null,3849,90,346410]
[null,null,null,3850,90,346500]
[null,null,null,3851,90,346590]
[null,null,null,3852,90,346680]
[null,null,null,3853,90,346770]
[null,null,null,3854,90,346860]
[null,null,null,3855,90,346950]
[null,null,null,3856,90,347040]
[null,null,null,3857,90,347130]
[null,null,null,3858,{"$f":"$E$13","v":90},347220]
[null,null,null,3859,90,347310]
[null,null,null,3860,90,347400]
[null,null,null,3861,90,347490]
[null,null,null,3862,90,347580]
[null,null,null,3863,90,347670]
[null,null,null,3864,90,347760]
[null,null,null,3865,90,347850]
[null,null,null,3866,90,347940]
[null,null,null,3867,90,348030]
[null,null,null,3868,90,348120]
[null,null,null,3869,90,348210]
[null,null,null,3870,90,348300]
[null,null,null,3871,90,348390]
[null,null,null,3872,90,348480]
[null,null,null,3873,90,348570]
[null,null,null,3874,90,348660]
[null,null,null,3875,90,348750]
[null,null,null,3876,90,348840]
[null,null,null,3877,90,{"$f":"E3894*D3894","v":348930}]
[null,null,null,3878,90,349020]
[null,null,null,3879,90,349110]
[null,null,null,3880,90,349200]
[null,null,null,3881,90,349290]
[null,null,null,3882,90,349380]
[null,null,null,3883,90,349470]
[null,null,null,3884,90,349560]
[null,null,null,3885,90,349650]
[null,null,null,3886,90,349740]
[null,null,null,3887,90,349830]
[null,null,null,3888,90,349920]
[null,null,null,3889,90,350010]
[null,null,null,3890,90,350100]
[null,null,null,3891,90,350190]
[null,null,null,3892,90,350280]
[null,null,null,3893,90,350370]
[null,null,null,3894,90,350460]
[null,null,null,3895,90,350550]
[null,null,null,3896,90,350640]
[null,null,null,3897,90,350730]
[null,null,null,3898,90,350820]
[null,null,null,3899,90,350910]
[null,null,null,3900,90,351000]
[null,null,null,3901,90,351090]
[null,null,null,3902,90,351180]
[null,null,null,3903,90,351270]
[null,null,null,3904,90,351360]
[null,null,null,3905,90,351450]
[null,null,null,3906,90,351540]
[null,null,null,3907,90,351630]
[null,null,null,3908,90,351720]
[null,null,null,3909,90,351810]
[null,null,null,3910,90,351900]
[null,null,null,3911,90,351990]
[null,null,null,3912,90,352080]
[null,null,null,3913,90,352170]
[null,null,null,3914,90,352260]
[null,null,null,3915,90,352350]
[null,null,null,3916,90,352440]
[null,null,null,3917,90,352530]
[null,null,null,3918,90,352620]
[null,null,null,3919,90,352710]
[null,null,null,3920,90,352800]
[null,null,null,3921,90,352890]
[null,null,null,3922,{"$f":"$E$13","v":90},352980]
[null,null,null,3923,90,353070]
[null,null,null,3924,90,353160]
[null,null,null,3925,90,353250]
[null,null,null,3926,90,353340]
[null,null,null,3927,90,353430]
[null,null,null,3928,90,353520]
[null,null,null,3929,90,353610]
[null,null,null,3930,90,353700]
[null,null,null,3931,90,353790]
[null,null,null,3932,90,353880]
[null,null,null,3933,90,353970]
[null,null,null,3934,90,354060]
[null,null,null,3935,90,354150]
[null,null,null,3936,90,354240]
[null,null,null,3937,90,354330]
[null,null,null,3938,90,354420]
[null,null,null,3939,90,354510]
[null,null,null,3940,90,354600]
[null,null,null,3941,90,{"$f":"E3958*D3958","v":354690}]
[null,null,null,3942,90,354780]
[null,null,null,3943,90,354870]
[null,null,null,3944,90,354960]
[null,null,null,3945,90,355050]
[null,null,null,3946,90,355140]
[null,null,null,3947,90,355230]
[null,null,null,3948,90,355320]
[null,null,null,3949,90,355410]
[null,null,null,3950,90,355500]
[null,null,null,3951,90,355590]
[null,null,null,3952,90,355680]
[null,null,null,3953,90,355770]
[null,null,null,3954,90,355860]
[null,null,null,3955,90,355950]
[null,null,null,3956,90,356040]
[null,null,null,3957,90,356130]
[null,null,null,3958,90,356220]
[null,null,null,3959,90,356310]
[null,null,null,3960,90,356400]
[null,null,null,3961,90,356490]
[null,null,null,3962,90,356580]
[null,null,null,3963,90,356670]
[null,null,null,3964,90,356760]
[null,null,null,3965,90,356850]
[null,null,null,3966,90,356940]
[null,null,null,3967,90,357030]
[null,null,null,3968,90,357120]
[null,null,null,3969,90,357210]
[null,null,null,3970,90,357300]
[null,null,null,3971,90,357390]
[null,null,null,3972,90,357480]
[null,null,null,3973,90,357570]
[null,null,null,3974,90,357660]
[null,null,null,3975,90,357750]
[null,null,null,3976,90,357840]
[null,null,null,3977,90,357930]
[null,null,null,3978,90,358020]
[null,null,null,3979,90,358110]
[null,null,null,3980,90,358200]
[null,null,null,3981,90,358290]
[null,null,null,3982,90,358380]
[null,null,null,3983,90,358470]
[null,null,null,3984,90,358560]
[null,null,null,3985,90,358650]
[null,null,null,3986,{"$f":"$E$13","v":90},358740]
[null,null,null,3987,90,358830]
[null,null,null,3988,90,358920]
[null,null,null,3989,90,359010]
[null,null,null,3990,90,359100]
[null,null,null,3991,90,359190]
[null,null,null,3992,90,359280]
[null,null,null,3993,90,359370]
[null,null,null,3994,90,359460]
[null,null,null,3995,90,359550]
[null,null,null,3996,90,359640]
[null,null,null,3997,90,359730]
[null,null,null,3998,90,359820]
[null,null,null,3999,90,359910]
[null,null,null,4000,90,360000]
[null,null,null,4001,90,360090]
[null,null,null,4002,90,360180]
[null,null,null,4003,90,360270]
[null,null,null,4004,90,360360]
[null,null,null,4005,90,{"$f":"E4022*D4022","v":360450}]
[null,null,null,4006,90,360540]
[null,null,null,4007,90,360630]
[null,null,null,4008,90,360720]
[null,null,null,4009,90,360810]
[null,null,null,4010,90,360900]
[null,null,null,4011,90,360990]
[null,null,null,4012,90,361080]
[null,null,null,4013,90,361170]
[null,null,null,4014,90,361260]
[null,null,null,4015,90,361350]
[null,null,null,4016,90,361440]
[null,null,null,4017,90,361530]
[null,null,null,4018,90,361620]
[null,null,null,4019,90,361710]
[null,null,null,4020,90,361800]
[null,null,null,4021,90,361890]
[null,null,null,4022,90,361980]
[null,null,null,4023,90,362070]
[null,null,null,4024,90,362160]
[null,null,null,4025,90,362250]
[null,null,null,4026,90,362340]
[null,null,null,4027,90,362430]
[null,null,null,4028,90,362520]
[null,null,null,4029,90,362610]
[null,null,null,4030,90,362700]
[null,null,null,4031,90,362790]
[null,null,null,4032,90,362880]
[null,null,null,4033,90,362970]
[null,null,null,4034,90,363060]
[null,null,null,4035,90,363150]
[null,null,null,4036,90,363240]
[null,null,null,4037,90,363330]
[null,null,null,4038,90,363420]
[null,null,null,4039,90,363510]
[null,null,null,4040,90,363600]
[null,null,null,4041,90,363690]
[null,null,null,4042,90,363780]
[null,null,null,4043,90,363870]
[null,null,null,4044,90,363960]
[null,null,null,4045,90,364050]
[null,null,null,4046,90,364140]
[null,null,null,4047,90,364230]
[null,null,null,4048,90,364320]
[null,null,null,4049,90,364410]
[null,null,null,4050,{"$f":"$E$13","v":90},364500]
[null,null,null,4051,90,364590]
[null,null,null,4052,90,364680]
[null,null,null,4053,90,364770]
[null,null,null,4054,90,364860]
[null,null,null,4055,90,364950]
[null,null,null,4056,90,365040]
[null,null,null,4057,90,365130]
[null,null,null,4058,90,365220]
[null,null,null,4059,90,365310]
[null,null,null,4060,90,365400]
[null,null,null,4061,90,365490]
[null,null,null,4062,90,365580]
[null,null,null,4063,90,365670]
[null,null,null,4064,90,365760]
[null,null,null,4065,90,365850]
[null,null,null,4066,90,365940]
[null,null,null,4067,90,366030]
[null,null,null,4068,90,366120]
[null,null,null,4069,90,{"$f":"E4086*D4086","v":366210}]
[null,null,null,4070,90,366300]
[null,null,null,4071,90,366390]
[null,null,null,4072,90,366480]
[null,null,null,4073,90,366570]
[null,null,null,4074,90,366660]
[null,null,null,4075,90,366750]
[null,null,null,4076,90,366840]
[null,null,null,4077,90,366930]
[null,null,null,4078,90,367020]
[null,null,null,4079,90,367110]
[null,null,null,4080,90,367200]
[null,null,null,4081,90,367290]
[null,null,null,4082,90,367380]
[null,null,null,4083,90,367470]
[null,null,null,4084,90,367560]
[null,null,null,4085,90,367650]
[null,null,null,4086,90,367740]
[null,null,null,4087,90,367830]
[null,null,null,4088,90,367920]
[null,null,null,4089,90,368010]
[null,null,null,4090,90,368100]
[null,null,null,4091,90,368190]
[null,null,null,4092,90,368280]
[null,null,null,4093,90,368370]
[null,null,null,4094,90,368460]
[null,null,null,4095,90,368550]
[null,null,null,4096,90,368640]
[null,null,null,4097,90,368730]
[null,null,null,4098,90,368820]
[null,null,null,4099,90,368910]
[null,null,null,4100,90,369000]
[null,null,null,4101,90,369090]
[null,null,null,4102,90,369180]
[null,null,null,4103,90,369270]
[null,null,null,4104,90,369360]
[null,null,null,4105,90,369450]
[null,null,null,4106,90,369540]
[null,null,null,4107,90,369630]
[null,null,null,4108,90,369720]
[null,null,null,4109,90,369810]
[null,null,null,4110,90,369900]
[null,null,null,4111,90,369990]
[null,null,null,4112,90,370080]
[null,null,null,4113,90,370170]
[null,null,null,4114,{"$f":"$E$13","v":90},370260]
[null,null,null,4115,90,370350]
[null,null,null,4116,90,370440]
[null,null,null,4117,90,370530]
[null,null,null,4118,90,370620]
[null,null,null,4119,90,370710]
[null,null,null,4120,90,370800]
[null,null,null,4121,90,370890]
[null,null,null,4122,90,370980]
[null,null,null,4123,90,371070]
[null,null,null,4124,90,371160]
[null,null,null,4125,90,371250]
[null,null,null,4126,90,371340]
[null,null,null,4127,90,371430]
[null,null,null,4128,90,371520]
[null,null,null,4129,90,371610]
[null,null,null,4130,90,371700]
[null,null,null,4131,90,371790]
[null,null,null,4132,90,371880]
[null,null,null,4133,90,{"$f":"E4150*D4150","v":371970}]
[null,null,null,4134,90,372060]
[null,null,null,4135,90,372150]
[null,null,null,4136,90,372240]
[null,null,null,4137,90,372330]
[null,null,null,4138,90,372420]
[null,null,null,4139,90,372510]
[null,null,null,4140,90,372600]
[null,null,null,4141,90,372690]
[null,null,null,4142,90,372780]
[null,null,null,4143,90,372870]
[null,null,null,4144,90,372960]
[null,null,null,4145,90,373050]
[null,null,null,4146,90,373140]
[null,null,null,4147,90,373230]
[null,null,null,4148,90,373320]
[null,null,null,4149,90,373410]
[null,null,null,4150,90,373500]
[null,null,null,4151,90,373590]
[null,null,null,4152,90,373680]
[null,null,null,4153,90,373770]
[null,null,null,4154,90,373860]
[null,null,null,4155,90,373950]
[null,null,null,4156,90,374040]
[null,null,null,4157,90,374130]
[null,null,null,4158,90,374220]
[null,null,null,4159,90,374310]
[null,null,null,4160,90,374400]
[null,null,null,4161,90,374490]
[null,null,null,4162,90,374580]
[null,null,null,4163,90,374670]
[null,null,null,4164,90,374760]
[null,null,null,4165,90,374850]
[null,null,null,4166,90,374940]
[null,null,null,4167,90,375030]
[null,null,null,4168,90,375120]
[null,null,null,4169,90,375210]
[null,null,null,4170,90,375300]
[null,null,null,4171,90,375390]
[null,null,null,4172,90,375480]
[null,null,null,4173,90,375570]
[null,null,null,4174,90,375660]
[null,null,null,4175,90,375750]
[null,null,null,4176,90,375840]
[null,null,null,4177,90,375930]
[null,null,null,4178,{"$f":"$E$13","v":90},376020]
[null,null,null,4179,90,376110]
[null,null,null,4180,90,376200]
[null,null,null,4181,90,376290]
[null,null,null,4182,90,376380]
[null,null,null,4183,90,376470]
[null,null,null,4184,90,376560]
[null,null,null,4185,90,376650]
[null,null,null,4186,90,376740]
[null,null,null,4187,90,376830]
[null,null,null,4188,90,376920]
[null,null,null,4189,90,377010]
[null,null,null,4190,90,377100]
[null,null,null,4191,90,377190]
[null,null,null,4192,90,377280]
[null,null,null,4193,90,377370]
[null,null,null,4194,90,377460]
[null,null,null,4195,90,377550]
[null,null,null,4196,90,377640]
[null,null,null,4197,90,{"$f":"E4214*D4214","v":377730}]
[null,null,null,4198,90,377820]
[null,null,null,4199,90,377910]
[null,null,null,4200,90,378000]
[null,null,null,4201,90,378090]
[null,null,null,4202,90,378180]
[null,null,null,4203,90,378270]
[null,null,null,4204,90,378360]
[null,null,null,4205,90,378450]
[null,null,null,4206,90,378540]
[null,null,null,4207,90,378630]
[null,null,null,4208,90,378720]
[null,null,null,4209,90,378810]
[null,null,null,4210,90,378900]
[null,null,null,4211,90,378990]
[null,null,null,4212,90,379080]
[null,null,null,4213,90,379170]
[null,null,null,4214,90,379260]
[null,null,null,4215,90,379350]
[null,null,null,4216,90,379440]
[null,null,null,4217,90,379530]
[null,null,null,4218,90,379620]
[null,null,null,4219,90,379710]
[null,null,null,4220,90,379800]
[null,null,null,4221,90,379890]
[null,null,null,4222,90,379980]
[null,null,null,4223,90,380070]
[null,null,null,4224,90,380160]
[null,null,null,4225,90,380250]
[null,null,null,4226,90,380340]
[null,null,null,4227,90,380430]
[null,null,null,4228,90,380520]
[null,null,null,4229,90,380610]
[null,null,null,4230,90,380700]
[null,null,null,4231,90,380790]
[null,null,null,4232,90,380880]
[null,null,null,4233,90,380970]
[null,null,null,4234,90,381060]
[null,null,null,4235,90,381150]
[null,null,null,4236,90,381240]
[null,null,null,4237,90,381330]
[null,null,null,4238,90,381420]
[null,null,null,4239,90,381510]
[null,null,null,4240,90,381600]
[null,null,null,4241,90,381690]
[null,null,null,4242,{"$f":"$E$13","v":90},381780]
[null,null,null,4243,90,381870]
[null,null,null,4244,90,381960]
[null,null,null,4245,90,382050]
[null,null,null,4246,90,382140]
[null,null,null,4247,90,382230]
[null,null,null,4248,90,382320]
[null,null,null,4249,90,382410]
[null,null,null,4250,90,382500]
[null,null,null,4251,90,382590]
[null,null,null,4252,90,382680]
[null,null,null,4253,90,382770]
[null,null,null,4254,90,382860]
[null,null,null,4255,90,382950]
[null,null,null,4256,90,383040]
[null,null,null,4257,90,383130]
[null,null,null,4258,90,383220]
[null,null,null,4259,90,383310]
[null,null,null,4260,90,383400]
[null,null,null,4261,90,{"$f":"E4278*D4278","v":383490}]
[null,null,null,4262,90,383580]
[null,null,null,4263,90,383670]
[null,null,null,4264,90,383760]
[null,null,null,4265,90,383850]
[null,null,null,4266,90,383940]
[null,null,null,4267,90,384030]
[null,null,null,4268,90,384120]
[null,null,null,4269,90,384210]
[null,null,null,4270,90,384300]
[null,null,null,4271,90,384390]
[null,null,null,4272,90,384480]
[null,null,null,4273,90,384570]
[null,null,null,4274,90,384660]
[null,null,null,4275,90,384750]
[null,null,null,4276,90,384840]
[null,null,null,4277,90,384930]
[null,null,null,4278,90,385020]
[null,null,null,4279,90,385110]
[null,null,null,4280,90,385200]
[null,null,null,4281,90,385290]
[null,null,null,4282,90,385380]
[null,null,null,4283,90,385470]
[null,null,null,4284,90,385560]
[null,null,null,4285,90,385650]
[null,null,null,4286,90,385740]
[null,null,null,4287,90,385830]
[null,null,null,4288,90,385920]
[null,null,null,4289,90,386010]
[null,null,null,4290,90,386100]
[null,null,null,4291,90,386190]
[null,null,null,4292,90,386280]
[null,null,null,4293,90,386370]
[null,null,null,4294,90,386460]
[null,null,null,4295,90,386550]
[null,null,null,4296,90,386640]
[null,null,null,4297,90,386730]
[null,null,null,4298,90,386820]
[null,null,null,4299,90,386910]
[null,null,null,4300,90,387000]
[null,null,null,4301,90,387090]
[null,null,null,4302,90,387180]
[null,null,null,4303,90,387270]
[null,null,null,4304,90,387360]
[null,null,null,4305,90,387450]
[null,null,null,4306,{"$f":"$E$13","v":90},387540]
[null,null,null,4307,90,387630]
[null,null,null,4308,90,387720]
[null,null,null,4309,90,387810]
[null,null,null,4310,90,387900]
[null,null,null,4311,90,387990]
[null,null,null,4312,90,388080]
[null,null,null,4313,90,388170]
[null,null,null,4314,90,388260]
[null,null,null,4315,90,388350]
[null,null,null,4316,90,388440]
[null,null,null,4317,90,388530]
[null,null,null,4318,90,388620]
[null,null,null,4319,90,388710]
[null,null,null,4320,90,388800]
[null,null,null,4321,90,388890]
[null,null,null,4322,90,388980]
[null,null,null,4323,90,389070]
[null,null,null,4324,90,389160]
[null,null,null,4325,90,{"$f":"E4342*D4342","v":389250}]
[null,null,null,4326,90,389340]
[null,null,null,4327,90,389430]
[null,null,null,4328,90,389520]
[null,null,null,4329,90,389610]
[null,null,null,4330,90,389700]
[null,null,null,4331,90,389790]
[null,null,null,4332,90,389880]
[null,null,null,4333,90,389970]
[null,null,null,4334,90,390060]
[null,null,null,4335,90,390150]
[null,null,null,4336,90,390240]
[null,null,null,4337,90,390330]
[null,null,null,4338,90,390420]
[null,null,null,4339,90,390510]
[null,null,null,4340,90,390600]
[null,null,null,4341,90,390690]
[null,null,null,4342,90,390780]
[null,null,null,4343,90,390870]
[null,null,null,4344,90,390960]
[null,null,null,4345,90,391050]
[null,null,null,4346,90,391140]
[null,null,null,4347,90,391230]
[null,null,null,4348,90,391320]
[null,null,null,4349,90,391410]
[null,null,null,4350,90,391500]
[null,null,null,4351,90,391590]
[null,null,null,4352,90,391680]
[null,null,null,4353,90,391770]
[null,null,null,4354,90,391860]
[null,null,null,4355,90,391950]
[null,null,null,4356,90,392040]
[null,null,null,4357,90,392130]
[null,null,null,4358,90,392220]
[null,null,null,4359,90,392310]
[null,null,null,4360,90,392400]
[null,null,null,4361,90,392490]
[null,null,null,4362,90,392580]
[null,null,null,4363,90,392670]
[null,null,null,4364,90,392760]
[null,null,null,4365,90,392850]
[null,null,null,4366,90,392940]
[null,null,null,4367,90,393030]
[null,null,null,4368,90,393120]
[null,null,null,4369,90,393210]
[null,null,null,4370,{"$f":"$E$13","v":90},393300]
[null,null,null,4371,90,393390]
[null,null,null,4372,90,393480]
[null,null,null,4373,90,393570]
[null,null,null,4374,90,393660]
[null,null,null,4375,90,393750]
[null,null,null,4376,90,393840]
[null,null,null,4377,90,393930]
[null,null,null,4378,90,394020]
[null,null,null,4379,90,394110]
[null,null,null,4380,90,394200]
[null,null,null,4381,90,394290]
[null,null,null,4382,90,394380]
[null,null,null,4383,90,394470]
[null,null,null,4384,90,394560]
[null,null,null,4385,90,394650]
[null,null,null,4386,90,394740]
[null,null,null,4387,90,394830]
[null,null,null,4388,90,394920]
[null,null,null,4389,90,{"$f":"E4406*D4406","v":395010}]
[null,null,null,4390,90,395100]
[null,null,null,4391,90,395190]
[null,null,null,4392,90,395280]
[null,null,null,4393,90,395370]
[null,null,null,4394,90,395460]
[null,null,null,4395,90,395550]
[null,null,null,4396,90,395640]
[null,null,null,4397,90,395730]
[null,null,null,4398,90,395820]
[null,null,null,4399,90,395910]
[null,null,null,4400,90,396000]
[null,null,null,4401,90,396090]
[null,null,null,4402,90,396180]
[null,null,null,4403,90,396270]
[null,null,null,4404,90,396360]
[null,null,null,4405,90,396450]
[null,null,null,4406,90,396540]
[null,null,null,4407,90,396630]
[null,null,null,4408,90,396720]
[null,null,null,4409,90,396810]
[null,null,null,4410,90,396900]
[null,null,null,4411,90,396990]
[null,null,null,4412,90,397080]
[null,null,null,4413,90,397170]
[null,null,null,4414,90,397260]
[null,null,null,4415,90,397350]
[null,null,null,4416,90,397440]
[null,null,null,4417,90,397530]
[null,null,null,4418,90,397620]
[null,null,null,4419,90,397710]
[null,null,null,4420,90,397800]
[null,null,null,4421,90,397890]
[null,null,null,4422,90,397980]
[null,null,null,4423,90,398070]
[null,null,null,4424,90,398160]
[null,null,null,4425,90,398250]
[null,null,null,4426,90,398340]
[null,null,null,4427,90,398430]
[null,null,null,4428,90,398520]
[null,null,null,4429,90,398610]
[null,null,null,4430,90,398700]
[null,null,null,4431,90,398790]
[null,null,null,4432,90,398880]
[null,null,null,4433,90,398970]
[null,null,null,4434,{"$f":"$E$13","v":90},399060]
[null,null,null,4435,90,399150]
[null,null,null,4436,90,399240]
[null,null,null,4437,90,399330]
[null,null,null,4438,90,399420]
[null,null,null,4439,90,399510]
[null,null,null,4440,90,399600]
[null,null,null,4441,90,399690]
[null,null,null,4442,90,399780]
[null,null,null,4443,90,399870]
[null,null,null,4444,90,399960]
[null,null,null,4445,90,400050]
[null,null,null,4446,90,400140]
[null,null,null,4447,90,400230]
[null,null,null,4448,90,400320]
[null,null,null,4449,90,400410]
[null,null,null,4450,90,400500]
[null,null,null,4451,90,400590]
[null,null,null,4452,90,400680]
[null,null,null,4453,90,{"$f":"E4470*D4470","v":400770}]
[null,null,null,4454,90,400860]
[null,null,null,4455,90,400950]
[null,null,null,4456,90,401040]
[null,null,null,4457,90,401130]
[null,null,null,4458,90,401220]
[null,null,null,4459,90,401310]
[null,null,null,4460,90,401400]
[null,null,null,4461,90,401490]
[null,null,null,4462,90,401580]
[null,null,null,4463,90,401670]
[null,null,null,4464,90,401760]
[null,null,null,4465,90,401850]
[null,null,null,4466,90,401940]
[null,null,null,4467,90,402030]
[null,null,null,4468,90,402120]
[null,null,null,4469,90,402210]
[null,null,null,4470,90,402300]
[null,null,null,4471,90,402390]
[null,null,null,4472,90,402480]
[null,null,null,4473,90,402570]
[null,null,null,4474,90,402660]
[null,null,null,4475,90,402750]
[null,null,null,4476,90,402840]
[null,null,null,4477,90,402930]
[null,null,null,4478,90,403020]
[null,null,null,4479,90,403110]
[null,null,null,4480,90,403200]
[null,null,null,4481,90,403290]
[null,null,null,4482,90,403380]
[null,null,null,4483,90,403470]
[null,null,null,4484,90,403560]
[null,null,null,4485,90,403650]
[null,null,null,4486,90,403740]
[null,null,null,4487,90,403830]
[null,null,null,4488,90,403920]
[null,null,null,4489,90,404010]
[null,null,null,4490,90,404100]
[null,null,null,4491,90,404190]
[null,null,null,4492,90,404280]
[null,null,null,4493,90,404370]
[null,null,null,4494,90,404460]
[null,null,null,4495,90,404550]
[null,null,null,4496,90,404640]
[null,null,null,4497,90,404730]
[null,null,null,4498,{"$f":"$E$13","v":90},404820]
[null,null,null,4499,90,404910]
[null,null,null,4500,90,405000]
[null,null,null,4501,90,405090]
[null,null,null,4502,90,405180]
[null,null,null,4503,90,405270]
[null,null,null,4504,90,405360]
[null,null,null,4505,90,405450]
[null,null,null,4506,90,405540]
[null,null,null,4507,90,405630]
[null,null,null,4508,90,405720]
[null,null,null,4509,90,405810]
[null,null,null,4510,90,405900]
[null,null,null,4511,90,405990]
[null,null,null,4512,90,406080]
[null,null,null,4513,90,406170]
[null,null,null,4514,90,406260]
[null,null,null,4515,90,406350]
[null,null,null,4516,90,406440]
[null,null,null,4517,90,{"$f":"E4534*D4534","v":406530}]
[null,null,null,4518,90,406620]
[null,null,null,4519,90,406710]
[null,null,null,4520,90,406800]
[null,null,null,4521,90,406890]
[null,null,null,4522,90,406980]
[null,null,null,4523,90,407070]
[null,null,null,4524,90,407160]
[null,null,null,4525,90,407250]
[null,null,null,4526,90,407340]
[null,null,null,4527,90,407430]
[null,null,null,4528,90,407520]
[null,null,null,4529,90,407610]
[null,null,null,4530,90,407700]
[null,null,null,4531,90,407790]
[null,null,null,4532,90,407880]
[null,null,null,4533,90,407970]
[null,null,null,4534,90,408060]
[null,null,null,4535,90,408150]
[null,null,null,4536,90,408240]
[null,null,null,4537,90,408330]
[null,null,null,4538,90,408420]
[null,null,null,4539,90,408510]
[null,null,null,4540,90,408600]
[null,null,null,4541,90,408690]
[null,null,null,4542,90,408780]
[null,null,null,4543,90,408870]
[null,null,null,4544,90,408960]
[null,null,null,4545,90,409050]
[null,null,null,4546,90,409140]
[null,null,null,4547,90,409230]
[null,null,null,4548,90,409320]
[null,null,null,4549,90,409410]
[null,null,null,4550,90,409500]
[null,null,null,4551,90,409590]
[null,null,null,4552,90,409680]
[null,null,null,4553,90,409770]
[null,null,null,4554,90,409860]
[null,null,null,4555,90,409950]
[null,null,null,4556,90,410040]
[null,null,null,4557,90,410130]
[null,null,null,4558,90,410220]
[null,null,null,4559,90,410310]
[null,null,null,4560,90,410400]
[null,null,null,4561,90,410490]
[null,null,null,4562,{"$f":"$E$13","v":90},410580]
[null,null,null,4563,90,410670]
[null,null,null,4564,90,410760]
[null,null,null,4565,90,410850]
[null,null,null,4566,90,410940]
[null,null,null,4567,90,411030]
[null,null,null,4568,90,411120]
[null,null,null,4569,90,411210]
[null,null,null,4570,90,411300]
[null,null,null,4571,90,411390]
[null,null,null,4572,90,411480]
[null,null,null,4573,90,411570]
[null,null,null,4574,90,411660]
[null,null,null,4575,90,411750]
[null,null,null,4576,90,411840]
[null,null,null,4577,90,411930]
[null,null,null,4578,90,412020]
[null,null,null,4579,90,412110]
[null,null,null,4580,90,412200]
[null,null,null,4581,90,{"$f":"E4598*D4598","v":412290}]
[null,null,null,4582,90,412380]
[null,null,null,4583,90,412470]
[null,null,null,4584,90,412560]
[null,null,null,4585,90,412650]
[null,null,null,4586,90,412740]
[null,null,null,4587,90,412830]
[null,null,null,4588,90,412920]
[null,null,null,4589,90,413010]
[null,null,null,4590,90,413100]
[null,null,null,4591,90,413190]
[null,null,null,4592,90,413280]
[null,null,null,4593,90,413370]
[null,null,null,4594,90,413460]
[null,null,null,4595,90,413550]
[null,null,null,4596,90,413640]
[null,null,null,4597,90,413730]
[null,null,null,4598,90,413820]
[null,null,null,4599,90,413910]
[null,null,null,4600,90,414000]
[null,null,null,4601,90,414090]
[null,null,null,4602,90,414180]
[null,null,null,4603,90,414270]
[null,null,null,4604,90,414360]
[null,null,null,4605,90,414450]
[null,null,null,4606,90,414540]
[null,null,null,4607,90,414630]
[null,null,null,4608,90,414720]
[null,null,null,4609,90,414810]
[null,null,null,4610,90,414900]
[null,null,null,4611,90,414990]
[null,null,null,4612,90,415080]
[null,null,null,4613,90,415170]
[null,null,null,4614,90,415260]
[null,null,null,4615,90,415350]
[null,null,null,4616,90,415440]
[null,null,null,4617,90,415530]
[null,null,null,4618,90,415620]
[null,null,null,4619,90,415710]
[null,null,null,4620,90,415800]
[null,null,null,4621,90,415890]
[null,null,null,4622,90,415980]
[null,null,null,4623,90,416070]
[null,null,null,4624,90,416160]
[null,null,null,4625,90,416250]
[null,null,null,4626,{"$f":"$E$13","v":90},416340]
[null,null,null,4627,90,416430]
[null,null,null,4628,90,416520]
[null,null,null,4629,90,416610]
[null,null,null,4630,90,416700]
[null,null,null,4631,90,416790]
[null,null,null,4632,90,416880]
[null,null,null,4633,90,416970]
[null,null,null,4634,90,417060]
[null,null,null,4635,90,417150]
[null,null,null,4636,90,417240]
[null,null,null,4637,90,417330]
[null,null,null,4638,90,417420]
[null,null,null,4639,90,417510]
[null,null,null,4640,90,417600]
[null,null,null,4641,90,417690]
[null,null,null,4642,90,417780]
[null,null,null,4643,90,417870]
[null,null,null,4644,90,417960]
[null,null,null,4645,90,{"$f":"E4662*D4662","v":418050}]
[null,null,null,4646,90,418140]
[null,null,null,4647,90,418230]
[null,null,null,4648,90,418320]
[null,null,null,4649,90,418410]
[null,null,null,4650,90,418500]
[null,null,null,4651,90,418590]
[null,null,null,4652,90,418680]
[null,null,null,4653,90,418770]
[null,null,null,4654,90,418860]
[null,null,null,4655,90,418950]
[null,null,null,4656,90,419040]
[null,null,null,4657,90,419130]
[null,null,null,4658,90,419220]
[null,null,null,4659,90,419310]
[null,null,null,4660,90,419400]
[null,null,null,4661,90,419490]
[null,null,null,4662,90,419580]
[null,null,null,4663,90,419670]
[null,null,null,4664,90,419760]
[null,null,null,4665,90,419850]
[null,null,null,4666,90,419940]
[null,null,null,4667,90,420030]
[null,null,null,4668,90,420120]
[null,null,null,4669,90,420210]
[null,null,null,4670,90,420300]
[null,null,null,4671,90,420390]
[null,null,null,4672,90,420480]
[null,null,null,4673,90,420570]
[null,null,null,4674,90,420660]
[null,null,null,4675,90,420750]
[null,null,null,4676,90,420840]
[null,null,null,4677,90,420930]
[null,null,null,4678,90,421020]
[null,null,null,4679,90,421110]
[null,null,null,4680,90,421200]
[null,null,null,4681,90,421290]
[null,null,null,4682,90,421380]
[null,null,null,4683,90,421470]
[null,null,null,4684,90,421560]
[null,null,null,4685,90,421650]
[null,null,null,4686,90,421740]
[null,null,null,4687,90,421830]
[null,null,null,4688,90,421920]
[null,null,null,4689,90,422010]
[null,null,null,4690,{"$f":"$E$13","v":90},422100]
[null,null,null,4691,90,422190]
[null,null,null,4692,90,422280]
[null,null,null,4693,90,422370]
[null,null,null,4694,90,422460]
[null,null,null,4695,90,422550]
[null,null,null,4696,90,422640]
[null,null,null,4697,90,422730]
[null,null,null,4698,90,422820]
[null,null,null,4699,90,422910]
[null,null,null,4700,90,423000]
[null,null,null,4701,90,423090]
[null,null,null,4702,90,423180]
[null,null,null,4703,90,423270]
[null,null,null,4704,90,423360]
[null,null,null,4705,90,423450]
[null,null,null,4706,90,423540]
[null,null,null,4707,90,423630]
[null,null,null,4708,90,423720]
[null,null,null,4709,90,{"$f":"E4726*D4726","v":423810}]
[null,null,null,4710,90,423900]
[null,null,null,4711,90,423990]
[null,null,null,4712,90,424080]
[null,null,null,4713,90,424170]
[null,null,null,4714,90,424260]
[null,null,null,4715,90,424350]
[null,null,null,4716,90,424440]
[null,null,null,4717,90,424530]
[null,null,null,4718,90,424620]
[null,null,null,4719,90,424710]
[null,null,null,4720,90,424800]
[null,null,null,4721,90,424890]
[null,null,null,4722,90,424980]
[null,null,null,4723,90,425070]
[null,null,null,4724,90,425160]
[null,null,null,4725,90,425250]
[null,null,null,4726,90,425340]
[null,null,null,4727,90,425430]
[null,null,null,4728,90,425520]
[null,null,null,4729,90,425610]
[null,null,null,4730,90,425700]
[null,null,null,4731,90,425790]
[null,null,null,4732,90,425880]
[null,null,null,4733,90,425970]
[null,null,null,4734,90,426060]
[null,null,null,4735,90,426150]
[null,null,null,4736,90,426240]
[null,null,null,4737,90,426330]
[null,null,null,4738,90,426420]
[null,null,null,4739,90,426510]
[null,null,null,4740,90,426600]
[null,null,null,4741,90,426690]
[null,null,null,4742,90,426780]
[null,null,null,4743,90,426870]
[null,null,null,4744,90,426960]
[null,null,null,4745,90,427050]
[null,null,null,4746,90,427140]
[null,null,null,4747,90,427230]
[null,null,null,4748,90,427320]
[null,null,null,4749,90,427410]
[null,null,null,4750,90,427500]
[null,null,null,4751,90,427590]
[null,null,null,4752,90,427680]
[null,null,null,4753,90,427770]
[null,null,null,4754,{"$f":"$E$13","v":90},427860]
[null,null,null,4755,90,427950]
[null,null,null,4756,90,428040]
[null,null,null,4757,90,428130]
[null,null,null,4758,90,428220]
[null,null,null,4759,90,428310]
[null,null,null,4760,90,428400]
[null,null,null,4761,90,428490]
[null,null,null,4762,90,428580]
[null,null,null,4763,90,428670]
[null,null,null,4764,90,428760]
[null,null,null,4765,90,428850]
[null,null,null,4766,90,428940]
[null,null,null,4767,90,429030]
[null,null,null,4768,90,429120]
[null,null,null,4769,90,429210]
[null,null,null,4770,90,429300]
[null,null,null,4771,90,429390]
[null,null,null,4772,90,429480]
[null,null,null,4773,90,{"$f":"E4790*D4790","v":429570}]
[null,null,null,4774,90,429660]
[null,null,null,4775,90,429750]
[null,null,null,4776,90,429840]
[null,null,null,4777,90,429930]
[null,null,null,4778,90,430020]
[null,null,null,4779,90,430110]
[null,null,null,4780,90,430200]
[null,null,null,4781,90,430290]
[null,null,null,4782,90,430380]
[null,null,null,4783,90,430470]
[null,null,null,4784,90,430560]
[null,null,null,4785,90,430650]
[null,null,null,4786,90,430740]
[null,null,null,4787,90,430830]
[null,null,null,4788,90,430920]
[null,null,null,4789,90,431010]
[null,null,null,4790,90,431100]
[null,null,null,4791,90,431190]
[null,null,null,4792,90,431280]
[null,null,null,4793,90,431370]
[null,null,null,4794,90,431460]
[null,null,null,4795,90,431550]
[null,null,null,4796,90,431640]
[null,null,null,4797,90,431730]
[null,null,null,4798,90,431820]
[null,null,null,4799,90,431910]
[null,null,null,4800,90,432000]
[null,null,null,4801,90,432090]
[null,null,null,4802,90,432180]
[null,null,null,4803,90,432270]
[null,null,null,4804,90,432360]
[null,null,null,4805,90,432450]
[null,null,null,4806,90,432540]
[null,null,null,4807,90,432630]
[null,null,null,4808,90,432720]
[null,null,null,4809,90,432810]
[null,null,null,4810,90,432900]
[null,null,null,4811,90,432990]
[null,null,null,4812,90,433080]
[null,null,null,4813,90,433170]
[null,null,null,4814,90,433260]
[null,null,null,4815,90,433350]
[null,null,null,4816,90,433440]
[null,null,null,4817,90,433530]
[null,null,null,4818,{"$f":"$E$13","v":90},433620]
[null,null,null,4819,90,433710]
[null,null,null,4820,90,433800]
[null,null,null,4821,90,433890]
[null,null,null,4822,90,433980]
[null,null,null,4823,90,434070]
[null,null,null,4824,90,434160]
[null,null,null,4825,90,434250]
[null,null,null,4826,90,434340]
[null,null,null,4827,90,434430]
[null,null,null,4828,90,434520]
[null,null,null,4829,90,434610]
[null,null,null,4830,90,434700]
[null,null,null,4831,90,434790]
[null,null,null,4832,90,434880]
[null,null,null,4833,90,434970]
[null,null,null,4834,90,435060]
[null,null,null,4835,90,435150]
[null,null,null,4836,90,435240]
[null,null,null,4837,90,{"$f":"E4854*D4854","v":435330}]
[null,null,null,4838,90,435420]
[null,null,null,4839,90,435510]
[null,null,null,4840,90,435600]
[null,null,null,4841,90,435690]
[null,null,null,4842,90,435780]
[null,null,null,4843,90,435870]
[null,null,null,4844,90,435960]
[null,null,null,4845,90,436050]
[null,null,null,4846,90,436140]
[null,null,null,4847,90,436230]
[null,null,null,4848,90,436320]
[null,null,null,4849,90,436410]
[null,null,null,4850,90,436500]
[null,null,null,4851,90,436590]
[null,null,null,4852,90,436680]
[null,null,null,4853,90,436770]
[null,null,null,4854,90,436860]
[null,null,null,4855,90,436950]
[null,null,null,4856,90,437040]
[null,null,null,4857,90,437130]
[null,null,null,4858,90,437220]
[null,null,null,4859,90,437310]
[null,null,null,4860,90,437400]
[null,null,null,4861,90,437490]
[null,null,null,4862,90,437580]
[null,null,null,4863,90,437670]
[null,null,null,4864,90,437760]
[null,null,null,4865,90,437850]
[null,null,null,4866,90,437940]
[null,null,null,4867,90,438030]
[null,null,null,4868,90,438120]
[null,null,null,4869,90,438210]
[null,null,null,4870,90,438300]
[null,null,null,4871,90,438390]
[null,null,null,4872,90,438480]
[null,null,null,4873,90,438570]
[null,null,null,4874,90,438660]
[null,null,null,4875,90,438750]
[null,null,null,4876,90,438840]
[null,null,null,4877,90,438930]
[null,null,null,4878,90,439020]
[null,null,null,4879,90,439110]
[null,null,null,4880,90,439200]
[null,null,null,4881,90,439290]
[null,null,null,4882,{"$f":"$E$13","v":90},439380]
[null,null,null,4883,90,439470]
[null,null,null,4884,90,439560]
[null,null,null,4885,90,439650]
[null,null,null,4886,90,439740]
[null,null,null,4887,90,439830]
[null,null,null,4888,90,439920]
[null,null,null,4889,90,440010]
[null,null,null,4890,90,440100]
[null,null,null,4891,90,440190]
[null,null,null,4892,90,440280]
[null,null,null,4893,90,440370]
[null,null,null,4894,90,440460]
[null,null,null,4895,90,440550]
[null,null,null,4896,90,440640]
[null,null,null,4897,90,440730]
[null,null,null,4898,90,440820]
[null,null,null,4899,90,440910]
[null,null,null,4900,90,441000]
[null,null,null,4901,90,{"$f":"E4918*D4918","v":441090}]
[null,null,null,4902,90,441180]
[null,null,null,4903,90,441270]
[null,null,null,4904,90,441360]
[null,null,null,4905,90,441450]
[null,null,null,4906,90,441540]
[null,null,null,4907,90,441630]
[null,null,null,4908,90,441720]
[null,null,null,4909,90,441810]
[null,null,null,4910,90,441900]
[null,null,null,4911,90,441990]
[null,null,null,4912,90,442080]
[null,null,null,4913,90,442170]
[null,null,null,4914,90,442260]
[null,null,null,4915,90,442350]
[null,null,null,4916,90,442440]
[null,null,null,4917,90,442530]
[null,null,null,4918,90,442620]
[null,null,null,4919,90,442710]
[null,null,null,4920,90,442800]
[null,null,null,4921,90,442890]
[null,null,null,4922,90,442980]
[null,null,null,4923,90,443070]
[null,null,null,4924,90,443160]
[null,null,null,4925,90,443250]
[null,null,null,4926,90,443340]
[null,null,null,4927,90,443430]
[null,null,null,4928,90,443520]
[null,null,null,4929,90,443610]
[null,null,null,4930,90,443700]
[null,null,null,4931,90,443790]
[null,null,null,4932,90,443880]
[null,null,null,4933,90,443970]
[null,null,null,4934,90,444060]
[null,null,null,4935,90,444150]
[null,null,null,4936,90,444240]
[null,null,null,4937,90,444330]
[null,null,null,4938,90,444420]
[null,null,null,4939,90,444510]
[null,null,null,4940,90,444600]
[null,null,null,4941,90,444690]
[null,null,null,4942,90,444780]
[null,null,null,4943,90,444870]
[null,null,null,4944,90,444960]
[null,null,null,4945,90,445050]
[null,null,null,4946,{"$f":"$E$13","v":90},445140]
[null,null,null,4947,90,445230]
[null,null,null,4948,90,445320]
[null,null,null,4949,90,445410]
[null,null,null,4950,90,445500]
[null,null,null,4951,90,445590]
[null,null,null,4952,90,445680]
[null,null,null,4953,90,445770]
[null,null,null,4954,90,445860]
[null,null,null,4955,90,445950]
[null,null,null,4956,90,446040]
[null,null,null,4957,90,446130]
[null,null,null,4958,90,446220]
[null,null,null,4959,90,446310]
[null,null,null,4960,90,446400]
[null,null,null,4961,90,446490]
[null,null,null,4962,90,446580]
[null,null,null,4963,90,446670]
[null,null,null,4964,90,446760]
[null,null,null,4965,90,{"$f":"E4982*D4982","v":446850}]
[null,null,null,4966,90,446940]
[null,null,null,4967,90,447030]
[null,null,null,4968,90,447120]
[null,null,null,4969,90,447210]
[null,null,null,4970,90,447300]
[null,null,null,4971,90,447390]
[null,null,null,4972,90,447480]
[null,null,null,4973,90,447570]
[null,null,null,4974,90,447660]
[null,null,null,4975,90,447750]
[null,null,null,4976,90,447840]
[null,null,null,4977,90,447930]
[null,null,null,4978,90,448020]
[null,null,null,4979,90,448110]
[null,null,null,4980,90,448200]
[null,null,null,4981,90,448290]
[null,null,null,4982,90,448380]
[null,null,null,4983,90,448470]
[null,null,null,4984,90,448560]
[null,null,null,4985,90,448650]
[null,null,null,4986,90,448740]
[null,null,null,4987,90,448830]
[null,null,null,4988,90,448920]
[null,null,null,4989,90,449010]
[null,null,null,4990,90,449100]
[null,null,null,4991,90,449190]
[null,null,null,4992,90,449280]
[null,null,null,4993,90,449370]
[null,null,null,4994,90,449460]
[null,null,null,4995,90,449550]
[null,null,null,4996,90,449640]
[null,null,null,4997,90,449730]
[null,null,null,4998,90,449820]
[null,null,null,4999,90,449910]
[null,null,null,5000,90,450000]
[]
[null,null,null,null,{"$f":"AVERAGE(E117:E5017)","v":97.803005360020947}]

{"sheet":"Equipment Rent - Purchase","index":9,"n_rows":171,"n_cols":23,"rows_kept":171,"cut":false,"hidden":false,"merged":[[127,0,127,8],[129,0,129,8],[92,0,92,8],[93,0,93,8],[97,0,97,8],[98,0,98,8],[99,0,99,8],[125,0,125,7],[126,0,126,7],[94,0,94,8],[95,0,95,8],[96,0,96,8],[120,0,120,8],[132,0,132,8],[133,0,133,8],[134,0,134,8],[135,0,135,8],[130,0,130,8],[131,0,131,8],[136,0,136,8],[170,0,170,8],[142,0,142,8],[168,0,168,7],[169,0,169,7],[137,0,137,8],[138,0,138,8],[139,0,139,8],[140,0,140,8],[141,0,141,8],[163,0,163,8],[91,0,91,8],[82,0,82,7],[83,0,83,7],[86,0,86,8],[87,0,87,8],[84,0,84,8],[56,0,56,8],[88,0,88,8],[90,0,90,8],[89,0,89,8],[77,0,77,8],[51,0,51,8],[52,0,52,8],[53,0,53,8],[54,0,54,8],[55,0,55,8],[50,0,50,8],[34,0,34,8],[43,0,43,8],[44,0,44,8],[45,0,45,8],[46,0,46,8],[47,0,47,8],[48,0,48,8],[49,0,49,8],[41,0,41,8],[0,0,0,8],[1,0,1,8],[2,0,2,8],[40,0,40,7],[39,0,39,7],[3,0,3,8],[11,0,11,8],[13,0,13,8],[5,0,5,8],[6,0,6,8],[7,0,7,8],[8,0,8,8],[10,0,10,8],[4,0,4,8],[9,0,9,8],[12,0,12,8]]}
["PART 5.C"]
["EQUIPMENT RENTAL/PURCHASE SUPPLEMENTARY SHEET"]
["Check Event:"]
["1.    This form should include all charges for outside rentals, contractor-owned rental equipment, and purchased equipment."]
["2.    Treatment Units – Must provide a completed Treatment System Tracking Form (Part 7) & Purchase Agreement Form(Part 8)."]
["3.    Claims for rental of vehicles are not reimbursable."]
["4.    Do not address the RAC markup on this page.  Indicate the markup on the Miscellaneous Supplementary Sheet."]
["5.    (No. of Units) X (Rental Rate) X (Hours Used At Site) = Total"]
["6.   Weekly rate goes into effect when equipment is used at a site for more than three days in a week (Monday – Sunday) .  Daily "]
["      rates are based on an 8-hour day.  Equipment rental costs for more or less than an 8-hour day must be prorated."]
["7.   Equipment charges for work activities included in unit pricing should not be included on this form."]
["8.   Rental rates for contractor owned equipment are addressed in Appendix B, Table 2 of the Cost Control Guidance Document."]
["9.   The rating of the following equipment must be provided:  air compressor – cfm, backhoe – bucket size, dump truck – yard "]
["      capacity, trackhoe – horsepower, vacuum truck - horsepower."]
["ITEM\nDESCRIPTION","EQUIPMENT\nRATING \n(See note 9)","RAC\nINVOICE\nNO.","OUTSIDE\nINVOICE\nNO.","DATES\nEQUIPMENT \nUSED","RENTAL \nRATES","UNITS","TIME USED ","TOTAL",null,null,null,"Total",null,"Sheet total"]
[null,null,null,null,null,{"$f":"(IF(A16>0,INDEX($U$17:$W$62,MATCH(A16&\" \"&B16,$T$17:$T$62,0),MATCH(G16,$U$16:$W$16,0)),\"\"))","v":""},null,null,{"$f":"ROUND((SUM(F16)*H16),2)","v":0},null,"Emergency/Initial Work   ",false,{"$f":"IF(L16=TRUE,$I$40,\"\")","v":""},"Emergency/Initial Work   ",{"$f":"SUM(M16,M59,M102,M145)","v":0},null,null,null,null,"Equipment","Hr","Day","Wky"]
[null,null,null,null,null,"",null,null,{"$f":"ROUND((SUM(F17)*H17),2)","v":0},null,"Investigation Work      ",false,{"$f":"IF(L17=TRUE,$I$40,\"\")","v":""},"Investigation Work      ",{"$f":"SUM(M17,M60,M103,M146)","v":0},"Air Compressor","100 cfm - 249 cfm","250 cfm - 375 cfm",null,"Air Compressor 100 cfm - 249 cfm",6.25,50,150]
[null,null,null,null,null,"",null,null,0,null,"Monitoring/Interim Work    ",false,"","Monitoring/Interim Work    ",{"$f":"SUM(M18,M61,M104,M147)","v":0},"BackHoe","Up to 36\" Bucket","36\"&above Bucket",null,"Air Compressor 250 cfm - 375 cfm",9.3800000000000008,75,225]
[null,null,null,null,null,"",null,null,0,null,"Corrective Action Plan Work",false,"","Corrective Action Plan Work",{"$f":"SUM(M19,M62,M105,M148)","v":0},"Bobcat Skid Steer Loader",null,null,null,"BackHoe Up to 36\" Bucket",34.369999999999997,275,225]
[null,null,null,null,null,"",null,null,0,null,null,null,null,null,null,"Bobcat Front Endloader w/ Breaker",null,null,null,"BackHoe 36\"&above Bucket",44.17,353,1060.1300000000001]
[null,null,null,null,null,"",null,null,0,null,"Emergency/Initial Work   ",{"$f":"IF(L16=TRUE,1,\"\")","v":""},null,null,null,"Bulldozer",null,null,null,{"$f":"P19&\" \"&Q19","v":"Bobcat Skid Steer Loader "},22.5,180,540]
[null,null,null,null,null,"",null,null,0,null,"Investigation Work      ",{"$f":"IF(L17=TRUE,2,\"\")","v":""},null,null,null,"Combustible Gas Indicator",null,null,null,"Bobcat Front Endloader w/ Breaker ",22.5,180,540]
[null,null,null,null,null,"",null,null,0,null,"Monitoring/Interim Work    ",{"$f":"IF(L18=TRUE,3,\"\")","v":""},null,null,null,"Compactor",null,null,null,"Bulldozer ",81,655,1965]
[null,null,null,null,null,"",null,null,0,null,"Corrective Action Plan Work",{"$f":"IF(L19=TRUE,4,\"\")","v":""},null,null,null,"Concrete Core Drill",null,null,null,"Combustible Gas Indicator ",3.75,30,90]
[null,null,null,null,null,"",null,null,0,null,null,null,null,null,null,"Crane Truck",null,null,null,"Compactor ",28.13,225,675]
[null,null,null,null,null,"",null,null,0,null,null,null,null,null,null,"Data Logger",null,null,null,"Concrete Core Drill ",6.75,54,162]
[null,null,null,null,null,"",null,null,0,null,null,null,null,null,null,"Digital Manometer",null,null,null,"Crane Truck ",45,360,1080]
[null,null,null,null,null,"",null,null,0,null,null,null,null,null,null,"Dissolved Oxygen Meter",null,null,null,"Data Logger ",18.75,150,450]
[null,null,null,null,null,"",null,null,0,null,null,null,null,null,null,"Dump Truck","7-10 yards","11-20 yards","over 20 yards","Digital Manometer ",1.88,15,45]
[null,null,null,null,null,"",null,null,0,null,null,null,null,null,null,"Electric Generator",null,null,null,"Dissolved Oxygen Meter ",3.13,25,75]
[null,null,null,null,null,"",null,null,0,null,null,null,null,null,null,"Excavators",null,null,null,"Dump Truck 7-10 yards",30]
[null,null,null,null,null,null,null,null,0,null,null,null,null,null,null,"Explosimeter*",null,null,null,"Dump Truck 11-20 yards",40]
[null,null,null,null,null,{"$f":"(IF(A33>0,INDEX($U$17:$W$62,MATCH(A33&\" \"&B33,$T$17:$T$62,0),MATCH(G33,$U$16:$W$16,0)),\"\"))","v":""},null,null,0,null,null,null,null,null,null,"Gas Detector*",null,null,null,"Dump Truck over 20 yards",50]
[null,null,null,null,null,{"$f":"(IF(A34>0,INDEX($U$17:$W$62,MATCH(A34&\" \"&B34,$T$17:$T$62,0),MATCH(G34,$U$16:$W$16,0)),\"\"))","v":""},null,null,0,null,null,null,null,null,null,"Gooseneck Trailer",null,null,null,{"$f":"P30&\" \"&Q30","v":"Electric Generator "},6.25,50,150]
["USE SPACE BELOW FOR EQUIPMENT NOT LISTED ABOVE",null,null,null,null,null,null,null,null,null,null,null,null,null,null,"Hydrocarbon Analyser FID",null,null,null,"Excavators ",75,600,1800]
[null,null,null,null,null,null,null,null,{"$f":"ROUND((SUM(F36)*H36),2)","v":0},null,null,null,null,null,null,"Hydrocarbon Analyser PID",null,null,null,"Explosimeter* ",3.75,30,90]
[null,null,null,null,null,null,null,null,0,null,null,null,null,null,null,"Hydrocarbon Analyser HNU",null,null,null,"Gas Detector* ",3.13,25,75]
[null,null,null,null,null,null,null,null,0,null,null,null,null,null,null,"Hydrocarbon Analyser OVA",null,null,null,"Gooseneck Trailer ",12.5,100,300]
[null,null,null,null,null,null,null,null,0,null,{"$f":"IF(L16=TRUE,$O$16,IF(L17=TRUE,$O$17,IF(L18=TRUE,$O$18,IF(L19=TRUE,$O$19,0))))","v":0},null,null,null,null,"Hydrocarbon Analyser TVA",null,null,null,"Hydrocarbon Analyser FID ",9.3800000000000008,75,225]
["SUBTOTAL OF THIS PAGE",null,null,null,null,null,null,null,{"$f":"SUM(I16:I39)","v":0},null,null,null,null,null,null,"Jackhammer",null,null,null,"Hydrocarbon Analyser PID ",9.3800000000000008,75,225]
["TOTAL EQUIPMENT COSTS",null,null,null,null,null,null,null,{"$f":"SUM(I40)","v":0},null,{"$f":"IF(I41>0,1,0)","v":0},null,null,null,null,"Lowboy Trailer (includes Truck)",null,null,null,"Hydrocarbon Analyser HNU ",9.3800000000000008,75,225]
["Page          of           (Equipment Rental/Purchase Supplementary Sheet)",null,null,null,null,null,null,null,null,null,null,null,null,null,null,"Oil/Water Interface Probe*",null,null,null,"Hydrocarbon Analyser OVA ",9.3800000000000008,75,225]
[null,null,null,null,null,null,null,null,null,null,null,null,null,null,null,"pH Conductivity Meter*",null,null,null,"Hydrocarbon Analyser TVA ",9.3800000000000008,75,225]
["PART 5.C",null,null,null,null,null,null,null,null,null,null,null,null,null,null,"Portable Gas Chromatography",null,null,null,"Jackhammer ",3.75,30,90]
["EQUIPMENT RENTAL/PURCHASE SUPPLEMENTARY SHEET",null,null,null,null,null,null,null,null,null,null,null,null,null,null,"Pumps",null,null,null,"Lowboy Trailer (includes Truck) ",22.5,180,540]
["Check Event:",null,null,null,null,null,null,null,null,null,null,null,null,null,null,"Soil/Water holding container",null,null,null,"Oil/Water Interface Probe* ",4.38,35,105]
["1.    This form should include all charges for outside rentals, contractor-owned rental equipment, and purchased equipment.",null,null,null,null,null,null,null,null,null,null,null,null,null,null,"Temperature Probe*",null,null,null,"pH Conductivity Meter* ",3.13,25,75]
["2.    Treatment Units – Must provide a completed Treatment System Tracking Form (Part 7) & Purchase Agreement Form(Part 8).",null,null,null,null,null,null,null,null,null,null,null,null,null,null,"Thermal Anemometer*",null,null,null,"Portable Gas Chromatography ",18.75,150,450]
["3.    Claims for rental of vehicles are not reimbursable.",null,null,null,null,null,null,null,null,null,null,null,null,null,null,"Tiller (hand)",null,null,null,"Pumps ",3.75,30,90]
["4.    Do not address the RAC markup on this page.  Indicate the markup on the Miscellaneous Supplementary Sheet.",null,null,null,null,null,null,null,null,null,null,null,null,null,null,"Tiller (Rotary w/ Slip Clutch)",null,null,null,{"$f":"P47&\" \"&Q46","v":"Temperature Probe* "},1.88,15,45]
["5.    (No. of Units) X (Rental Rate) X (Hours Used At Site) = Total",null,null,null,null,null,null,null,null,null,null,null,null,null,null,"Trackhoe","0-200HP","over 200HP",null,{"$f":"P48&\" \"&Q47","v":"Thermal Anemometer* "},1.88,15,45]
["6.   Weekly rate goes into effect when equipment is used at a site for more than three days in a week (Monday – Sunday) .  Daily ",null,null,null,null,null,null,null,null,null,null,null,null,null,null,"Tractor With Trailer",null,null,null,{"$f":"P49&\" \"&Q48","v":"Tiller (hand) "},3.13,25,75]
["      rates are based on an 8-hour day.  Equipment rental costs for more or less than an 8-hour day must be prorated.",null,null,null,null,null,null,null,null,null,null,null,null,null,null,"Transducer",null,null,null,{"$f":"P50&\" \"&Q49","v":"Tiller (Rotary w/ Slip Clutch) "},9.3800000000000008,75,225]
["7.   Equipment charges for work activities included in unit pricing should not be included on this form.",null,null,null,null,null,null,null,null,null,null,null,null,null,null,"Vacuum Truck","0-39HP","40-150HP","over 150HP","Trackhoe 0-200HP",63.75,510,1530]
["8.   Rental rates for contractor owned equipment are addressed in Appendix B, Table 2 of the Cost Control Guidance Document.",null,null,null,null,null,null,null,null,null,null,null,null,null,null,"Water Level Indicator*",null,null,null,"Trackhoe over 200HP",127.5,1020,3060]
["9.   The rating of the following equipment must be provided:  air Compressor – cfm, backhoe – bucket size, dump truck – yard ",null,null,null,null,null,null,null,null,null,null,null,null,null,null,null,null,null,null,{"$f":"P52&\" \"&#REF!","v":{"$error":"#REF!"}},31.88,255,765]
["      capacity, trackhoe – horsepower, vacuum truck - horsepower.",null,null,null,null,null,null,null,null,null,null,null,null,null,null,null,null,null,null,{"$f":"P53&\" \"&Q52","v":"Transducer "},25,200,600]
["ITEM\nDESCRIPTION","EQUIPMENT\nRATING \n(See note 9)","RAC\nINVOICE\nNO.","OUTSIDE\nINVOICE\nNO.","DATES\nEQUIPMENT \nUSED","RENTAL \nRATES","UNITS","TIME USED ","TOTAL",null,null,null,"Total",null,null,null,null,null,null,{"$f":"P46&\" \"&Q53","v":"Soil/Water holding container "},8.1300000000000008,65,280]
[null,null,null,null,null,{"$f":"(IF(A59>0,INDEX($U$17:$W$62,MATCH(A59&\" \"&B59,$T$17:$T$62,0),MATCH(G59,$U$16:$W$16,0)),\"\"))","v":""},null,null,{"$f":"ROUND((SUM(F59)*H59),2)","v":0},null,"Emergency/Initial Work   ",false,{"$f":"IF(L59=TRUE,$I$83,\"\")","v":""},null,null,null,null,null,null,"Vacumm Truck 0-39HP",85,680,2040]
[null,null,null,null,null,"",null,null,0,null,"Investigation Work      ",false,{"$f":"IF(L60=TRUE,$I$83,\"\")","v":""},null,null,null,null,null,null,"Vacumm Truck 40-150HP",110,880,2640]
[null,null,null,null,null,"",null,null,0,null,"Monitoring/Interim Work    ",false,"",null,null,null,null,null,null,"Vacumm Truck over 150HP",153.75,1230,3690]
[null,null,null,null,null,"",null,null,0,null,"Corrective Action Plan Work",false,"",null,null,null,null,null,null,{"$f":"P55&\" \"&Q55","v":"Water Level Indicator* "},1.88,15,45]
[null,null,null,null,null,"",null,null,0,null,null,null,null,null,null,null,null,null,null,{"$f":"P56&\" \"&Q56","v":" "}]
[null,null,null,null,null,"",null,null,0,null,"Emergency/Initial Work   ",{"$f":"IF(L59=TRUE,1,\"\")","v":""},null,null,null,null,null,null,null,{"$f":"P57&\" \"&Q57","v":" "}]
[null,null,null,null,null,"",null,null,0,null,"Investigation Work      ",{"$f":"IF(L60=TRUE,2,\"\")","v":""}]
[null,null,null,null,null,"",null,null,0,null,"Monitoring/Interim Work    ",{"$f":"IF(L61=TRUE,3,\"\")","v":""}]
[null,null,null,null,null,"",null,null,0,null,"Corrective Action Plan Work",{"$f":"IF(L62=TRUE,4,\"\")","v":""}]
[null,null,null,null,null,"",null,null,0]
[null,null,null,null,null,"",null,null,0]
[null,null,null,null,null,"",null,null,0]
[null,null,null,null,null,"",null,null,0]
[null,null,null,null,null,"",null,null,0]
[null,null,null,null,null,"",null,null,0]
[null,null,null,null,null,"",null,null,0]
[null,null,null,null,null,"",null,null,0]
[null,null,null,null,null,"",null,null,0]
[null,null,null,null,null,"",null,null,0]
["USE SPACE BELOW FOR EQUIPMENT NOT LISTED ABOVE"]
[null,null,null,null,null,null,null,null,{"$f":"ROUND((SUM(F79)*H79),2)","v":0}]
[null,null,null,null,null,null,null,null,0]
[null,null,null,null,null,null,null,null,0]
[null,null,null,null,null,null,null,null,0,null,{"$f":"IF(L59=TRUE,$O$16,IF(L60=TRUE,$O$17,IF(L61=TRUE,$O$18,IF(L62=TRUE,$O$19,0))))","v":0}]
["SUBTOTAL OF THIS PAGE",null,null,null,null,null,null,null,{"$f":"SUM(I59:I82)","v":0}]
["TOTAL EQUIPMENT COSTS",null,null,null,null,null,null,null,{"$f":"SUM(I83)","v":0},null,{"$f":"IF(I84>0,1,0)","v":0}]
["Page          of           (Equipment Rental/Purchase Supplementary Sheet)"]
[]
["PART 5.C"]
["EQUIPMENT RENTAL/PURCHASE SUPPLEMENTARY SHEET"]
["Check Event:"]
["1.    This form should include all charges for outside rentals, contractor-owned rental equipment, and purchased equipment."]
["2.    Treatment Units – Must provide a completed Treatment System Tracking Form (Part 7) & Purchase Agreement Form(Part 8)."]
["3.    Claims for rental of vehicles are not reimbursable."]
["4.    Do not address the RAC markup on this page.  Indicate the markup on the Miscellaneous Supplementary Sheet."]
["5.    (No. of Units) X (Rental Rate) X (Hours Used At Site) = Total"]
["6.   Weekly rate goes into effect when equipment is used at a site for more than three days in a week (Monday – Sunday) .  Daily "]
["      rates are based on an 8-hour day.  Equipment rental costs for more or less than an 8-hour day must be prorated."]
["7.   Equipment charges for work activities included in unit pricing should not be included on this form."]
["8.   Rental rates for contractor owned equipment are addressed in Appendix B, Table 2 of the Cost Control Guidance Document."]
["9.   The rating of the following equipment must be provided:  air Compressor – cfm, backhoe – bucket size, dump truck – yard "]
["      capacity, trackhoe – horsepower, vacuum truck - horsepower."]
["ITEM\nDESCRIPTION","EQUIPMENT\nRATING \n(See note 9)","RAC\nINVOICE\nNO.","OUTSIDE\nINVOICE\nNO.","DATES\nEQUIPMENT \nUSED","RENTAL \nRATES","UNITS","TIME USED ","TOTAL",null,null,null,"Total"]
[null,null,null,null,null,{"$f":"(IF(A102>0,INDEX($U$17:$W$62,MATCH(A102&\" \"&B102,$T$17:$T$62,0),MATCH(G102,$U$16:$W$16,0)),\"\"))","v":""},null,null,{"$f":"ROUND((SUM(F102)*H102),2)","v":0},null,"Emergency/Initial Work   ",false,{"$f":"IF(L102=TRUE,$I$126,\"\")","v":""}]
[null,null,null,null,null,"",null,null,0,null,"Investigation Work      ",false,{"$f":"IF(L103=TRUE,$I$126,\"\")","v":""}]
[null,null,null,null,null,"",null,null,0,null,"Monitoring/Interim Work    ",false,""]
[null,null,null,null,null,"",null,null,0,null,"Corrective Action Plan Work",false,""]
[null,null,null,null,null,"",null,null,0]
[null,null,null,null,null,"",null,null,0,null,"Emergency/Initial Work   ",{"$f":"IF(L102=TRUE,1,\"\")","v":""}]
[null,null,null,null,null,"",null,null,0,null,"Investigation Work      ",{"$f":"IF(L103=TRUE,2,\"\")","v":""}]
[null,null,null,null,null,"",null,null,0,null,"Monitoring/Interim Work    ",{"$f":"IF(L104=TRUE,3,\"\")","v":""}]
[null,null,null,null,null,"",null,null,0,null,"Corrective Action Plan Work",{"$f":"IF(L105=TRUE,4,\"\")","v":""}]
[null,null,null,null,null,"",null,null,0]
[null,null,null,null,null,"",null,null,0]
[null,null,null,null,null,"",null,null,0]
[null,null,null,null,null,"",null,null,0]
[null,null,null,null,null,"",null,null,0]
[null,null,null,null,null,"",null,null,0]
[null,null,null,null,null,"",null,null,0]
[null,null,null,null,null,"",null,null,0]
[null,null,null,null,null,"",null,null,0]
[null,null,null,null,null,"",null,null,0]
["USE SPACE BELOW FOR EQUIPMENT NOT LISTED ABOVE"]
[null,null,null,null,null,null,null,null,{"$f":"ROUND((SUM(F122)*H122),2)","v":0}]
[null,null,null,null,null,null,null,null,0]
[null,null,null,null,null,null,null,null,0]
[null,null,null,null,null,null,null,null,0,null,{"$f":"IF(L102=TRUE,$O$16,IF(L103=TRUE,$O$17,IF(L104=TRUE,$O$18,IF(L105=TRUE,$O$19,0))))","v":0}]
["SUBTOTAL OF THIS PAGE",null,null,null,null,null,null,null,{"$f":"SUM(I102:I125)","v":0}]
["TOTAL EQUIPMENT COSTS",null,null,null,null,null,null,null,{"$f":"SUM(I126)","v":0},null,{"$f":"IF(I127>0,1,0)","v":0}]
["Page          of           (Equipment Rental/Purchase Supplementary Sheet)"]
[]
["PART 5.C"]
["EQUIPMENT RENTAL/PURCHASE SUPPLEMENTARY SHEET"]
["Check Event:"]
["1.    This form should include all charges for outside rentals, contractor-owned rental equipment, and purchased equipment."]
["2.    Treatment Units – Must provide a completed Treatment System Tracking Form (Part 7) & Purchase Agreement Form(Part 8)."]
["3.    Claims for rental of vehicles are not reimbursable."]
["4.    Do not address the RAC markup on this page.  Indicate the markup on the Miscellaneous Supplementary Sheet."]
["5.    (No. of Units) X (Rental Rate) X (Hours Used At Site) = Total"]
["6.   Weekly rate goes into effect when equipment is used at a site for more than three days in a week (Monday – Sunday) .  Daily "]
["      rates are based on an 8-hour day.  Equipment rental costs for more or less than an 8-hour day must be prorated."]
["7.   Equipment charges for work activities included in unit pricing should not be included on this form."]
["8.   Rental rates for contractor owned equipment are addressed in Appendix B, Table 2 of the Cost Control Guidance Document."]
["9.   The rating of the following equipment must be provided:  air Compressor – cfm, backhoe – bucket size, dump truck – yard "]
["      capacity, trackhoe – horsepower, vacuum truck - horsepower."]
["ITEM\nDESCRIPTION","EQUIPMENT\nRATING \n(See note 9)","RAC\nINVOICE\nNO.","OUTSIDE\nINVOICE\nNO.","DATES\nEQUIPMENT \nUSED","RENTAL \nRATES","UNITS","TIME USED ","TOTAL",null,null,null,"Total"]
[null,null,null,null,null,{"$f":"(IF(A145>0,INDEX($U$17:$W$62,MATCH(A145&\" \"&B145,$T$17:$T$62,0),MATCH(G145,$U$16:$W$16,0)),\"\"))","v":""},null,null,{"$f":"ROUND((SUM(F145)*H145),2)","v":0},null,"Emergency/Initial Work   ",false,{"$f":"IF(L145=TRUE,$I$169,\"\")","v":""}]
[null,null,null,null,null,"",null,null,0,null,"Investigation Work      ",false,{"$f":"IF(L146=TRUE,$I$169,\"\")","v":""}]
[null,null,null,null,null,"",null,null,0,null,"Monitoring/Interim Work    ",false,""]
[null,null,null,null,null,"",null,null,0,null,"Corrective Action Plan Work",false,""]
[null,null,null,null,null,"",null,null,0]
[null,null,null,null,null,"",null,null,0,null,"Emergency/Initial Work   ",{"$f":"IF(L145=TRUE,1,\"\")","v":""}]
[null,null,null,null,null,"",null,null,0,null,"Investigation Work      ",{"$f":"IF(L146=TRUE,2,\"\")","v":""}]
[null,null,null,null,null,"",null,null,0,null,"Monitoring/Interim Work    ",{"$f":"IF(L147=TRUE,3,\"\")","v":""}]
[null,null,null,null,null,"",null,null,0,null,"Corrective Action Plan Work",{"$f":"IF(L148=TRUE,4,\"\")","v":""}]
[null,null,null,null,null,"",null,null,0]
[null,null,null,null,null,"",null,null,0]
[null,null,null,null,null,"",null,null,0]
[null,null,null,null,null,"",null,null,0]
[null,null,null,null,null,"",null,null,0]
[null,null,null,null,null,"",null,null,0]
[null,null,null,null,null,"",null,null,0]
[null,null,null,null,null,"",null,null,0]
[null,null,null,null,null,"",null,null,0]
[null,null,null,null,null,"",null,null,0]
["USE SPACE BELOW FOR EQUIPMENT NOT LISTED ABOVE"]
[null,null,null,null,null,null,null,null,{"$f":"ROUND((SUM(F165)*H165),2)","v":0}]
[null,null,null,null,null,null,null,null,0]
[null,null,null,null,null,null,null,null,0]
[null,null,null,null,null,null,null,null,0,null,{"$f":"IF(L145=TRUE,$O$16,IF(L146=TRUE,$O$17,IF(L147=TRUE,$O$18,IF(L148=TRUE,$O$19,0))))","v":0}]
["SUBTOTAL OF THIS PAGE",null,null,null,null,null,null,null,{"$f":"SUM(I145:I168)","v":0}]
["TOTAL EQUIPMENT COSTS",null,null,null,null,null,null,null,{"$f":"SUM(I169)","v":0},null,{"$f":"IF(I170>0,1,0)","v":0}]
["Page          of           (Equipment Rental/Purchase Supplementary Sheet)"]

{"sheet":"Hotel & Food","index":10,"n_rows":223,"n_cols":13,"rows_kept":223,"cut":false,"hidden":false,"merged":[[222,0,222,3],[196,0,196,6],[197,0,197,6],[198,0,198,1],[198,2,198,6],[199,0,199,1],[199,2,199,6],[191,0,191,6],[192,0,192,6],[193,0,193,6],[194,0,194,6],[195,0,195,6],[203,0,203,6],[204,0,204,6],[205,0,205,6],[206,0,206,6],[221,0,221,5],[200,0,200,1],[200,2,200,6],[201,0,201,1],[201,2,201,6],[202,0,202,1],[202,2,202,6],[186,0,186,6],[187,0,187,6],[188,0,188,6],[189,0,189,6],[190,0,190,6],[180,0,180,6],[181,0,181,6],[182,0,182,6],[183,0,183,6],[184,0,184,6],[177,0,177,3],[153,0,153,1],[153,2,153,6],[154,0,154,1],[154,2,154,6],[155,0,155,1],[155,2,155,6],[148,0,148,6],[149,0,149,6],[150,0,150,6],[151,0,151,6],[152,0,152,6],[159,0,159,6],[160,0,160,6],[161,0,161,6],[176,0,176,5],[156,0,156,1],[156,2,156,6],[157,0,157,1],[157,2,157,6],[158,0,158,6],[143,0,143,6],[144,0,144,6],[145,0,145,6],[146,0,146,6],[147,0,147,6],[137,0,137,6],[138,0,138,6],[139,0,139,6],[141,0,141,6],[142,0,142,6],[116,0,116,6],[131,0,131,5],[135,0,135,6],[136,0,136,6],[112,0,112,1],[112,2,112,6],[113,0,113,6],[114,0,114,6],[115,0,115,6],[132,0,132,3],[109,0,109,1],[109,2,109,6],[110,0,110,1],[110,2,110,6],[111,0,111,1],[111,2,111,6],[105,0,105,6],[106,0,106,6],[107,0,107,6],[108,0,108,1],[108,2,108,6],[100,0,100,6],[101,0,101,6],[102,0,102,6],[103,0,103,6],[104,0,104,6],[94,0,94,6],[96,0,96,6],[97,0,97,6],[98,0,98,6],[99,0,99,6],[90,0,90,6],[91,0,91,6],[92,0,92,6],[93,0,93,6],[68,0,68,6],[69,0,69,6],[70,0,70,6],[71,0,71,6],[86,0,86,5],[87,0,87,3],[65,0,65,1],[65,2,65,6],[66,0,66,1],[66,2,66,6],[67,0,67,1],[67,2,67,6],[61,0,61,6],[62,0,62,6],[63,0,63,1],[63,2,63,6],[64,0,64,1],[64,2,64,6],[56,0,56,6],[57,0,57,6],[58,0,58,6],[59,0,59,6],[60,0,60,6],[51,0,51,6],[52,0,52,6],[53,0,53,6],[54,0,54,6],[55,0,55,6],[45,0,45,6],[46,0,46,6],[47,0,47,6],[48,0,48,6],[49,0,49,6],[23,0,23,6],[25,0,25,6],[24,0,24,6],[26,0,26,6],[41,0,41,5],[42,0,42,3],[22,0,22,1],[20,2,20,6],[21,2,21,6],[22,2,22,6],[18,0,18,1],[19,0,19,1],[18,2,18,6],[19,2,19,6],[4,0,4,6],[8,0,8,6],[10,0,10,6],[11,0,11,6],[13,0,13,6],[14,0,14,6],[15,0,15,6],[6,0,6,6],[20,0,20,1],[17,0,17,6],[0,0,0,6],[1,0,1,6],[2,0,2,6],[16,0,16,6],[7,0,7,6],[9,0,9,6],[12,0,12,6],[3,0,3,6],[21,0,21,1]]}
["PART 5.D (1)"]
["TRAVEL SUPPLEMENTARY SHEET"]
["Check Event:"]
[]
["LODGING/MEALS"]
[]
["1.    Overnight stay is allowed for any continuous site work such as multiple site visits, treatment system installation, drilling/P&A "]
["       wells, geoprobe work, over-excavation, soil treatment or multiple vacuum events of at least 6 hour."]
["2.   Prior approval from the Trust Fund Management should be obtained for overnight stay for work other than that "]
["      specifically identified in #1, above."]
["3.   Meals are only reimbursable when overnight stay is required."]
["4.   Claims for hotel charges must be accompanied by legible receipts indicating names of persons staying in a room.  Do not "]
["      provide charge card receipts.  Names can not be added after the receipt is generated."]
["5.   No RAC markup allowed"]
["6.   Single site visits:  (Hotel Charges) + (Meal Charges) = Total"]
["7.   Multiple site visits:  [(Hotel Charges) + (Meal Charges)] ÷ (No. Of Sites Visited) = Total"]
["8.   Airfares, toll charges, and taxi charges are not reimbursable."]
["9.  Travel charge for work activities addressed in unit pricing should not be addressed on this form."]
["RATES",null,"4/1/2012 MAXIMUM RATES"]
["Meals - Statewide",null,"$30/day "]
["Meals - New Orleans",null,"$35/day"]
["Hotel - Statewide",null,"$100/night"]
["Hotel - New Orleans",null,"$150/night"]
["Required Information- Check below the reason charges for overnight stay or meals are being requested:"]
[]
[]
["                                                                                                                                                                                              ."]
["LAST\nNAME OF\nPERSON","RAC\nINVOICE\nNO.","DATE(S)\nTRAVELED","HOTEL\nCHARGES","MEAL\nCHARGES","NO. OF\nSITES\nVISITED","TOTAL",null,null,null,"total",null,"Sheet total"]
[null,null,null,null,null,null,{"$f":"ROUND(IF(F29=0,SUM(D29+E29),((D29+E29)/F29)),2)","v":0},null,"Emergency/Initial Work   ",false,{"$f":"IF(J29=TRUE,$G$42,\"\")","v":""},"Emergency/Initial Work   ",{"$f":"SUM(K29,K74,K119,K164,K209)","v":0}]
[null,null,null,null,null,null,{"$f":"ROUND(IF(F30=0,SUM(D30+E30),((D30+E30)/F30)),2)","v":0},null,"Investigation Work      ",false,{"$f":"IF(J30=TRUE,$G$42,\"\")","v":""},"Investigation Work      ",{"$f":"SUM(K30,K75,K120,K165,K210)","v":0}]
[null,null,null,null,null,null,0,null,"Monitoring/Interim Work        ",false,"","Monitoring/Interim Work        ",{"$f":"SUM(K31,K76,K121,K166,K211)","v":0}]
[null,null,null,null,null,null,0,null,"Corrective Action Plan Work",false,"","Corrective Action Plan Work",{"$f":"SUM(K32,K77,K122,K167,K212)","v":0}]
[null,null,null,null,null,null,0,null,"Report Preparation ",false,"","Report Preparation ",{"$f":"SUM(K33,K78,K123,K168,K213)","v":0}]
[null,null,null,null,null,null,0,null,"Emergency/Initial Work   ",{"$f":"IF(J29=TRUE,1,\"\")","v":""}]
[null,null,null,null,null,null,0,null,"Investigation Work      ",{"$f":"IF(J30=TRUE,2,\"\")","v":""}]
[null,null,null,null,null,null,0,null,"Monitoring/Interim Work        ",{"$f":"IF(J31=TRUE,3,\"\")","v":""}]
[null,null,null,null,null,null,0,null,"Corrective Action Plan Work",{"$f":"IF(J32=TRUE,4,\"\")","v":""}]
[null,null,null,null,null,null,0,null,"Report Preparation ",{"$f":"IF(J33=TRUE,5,\"\")","v":""}]
[null,null,null,null,null,null,0]
[null,null,null,null,null,null,0]
[null,null,null,null,null,null,0,null,{"$f":"IF(J29=TRUE,$M$29,IF(J30=TRUE,$M$30,IF(J31=TRUE,$M$31,IF(J32=TRUE,$M$32,IF(J33=TRUE,$M$33,0)))))","v":0}]
["SUBTOTAL OF THIS PAGE",null,null,null,null,null,{"$f":"SUM(G29:G41)","v":0},null,{"$f":"SUM(I41)","v":0},{"$f":"IF(I42>1,1,0)","v":0}]
["Page              of               (Travel Supplementary Sheet)"]
[]
[]
["PART 5.D (1)"]
["TRAVEL SUPPLEMENTARY SHEET"]
["Check Event:"]
[]
["LODGING/MEALS"]
[]
["1.    Overnight stay is allowed for any continuous site work such as multiple site visits, treatment system installation, drilling/P&A "]
["       wells, geoprobe work, over-excavation, soil treatment or at least 6 hour vacuum events."]
["2.   Prior approval from the Trust Fund Management should be obtained for overnight stay for work other than that "]
["      specifically identified in #1, above."]
["3.   Meals are only reimbursable when overnight stay is required."]
["4.   Claims for hotel charges must be accompanied by legible receipts indicating names of persons staying in a room.  Do not "]
["      provide charge card receipts.  Names can not be added after the receipt is generated."]
["5.   No RAC markup allowed"]
["6.   Single site visits:  (Hotel Charges) + (Meal Charges) = Total"]
["7.   Multiple site visits:  [(Hotel Charges) + (Meal Charges)] ÷ (No. Of Sites Visited) = Total"]
["8.   Airfares, toll charges, and taxi charges are not reimbursable."]
["9.  Travel charge for work activities addressed in unit pricing should not be addressed on this form."]
["RATES",null,"4/1/2012 MAXIMUM RATES"]
["Meals - Statewide",null,"$30/day "]
["Meals - New Orleans",null,"$35/day"]
["Hotel - Statewide",null,"$100/night"]
["Hotel - New Orleans",null,"$150/night"]
["Required Information- Check below the reason charges for overnight stay or meals are being requested:"]
[]
[]
["                                                                                                                                                                                              ."]
["LAST\nNAME OF\nPERSON","RAC\nINVOICE\nNO.","DATE(S)\nTRAVELED","HOTEL\nCHARGES","TOTAL\nMEAL\nCHARGES","NO. OF\nSITES\nVISITED","TOTAL",null,null,null,"total"]
[null,null,null,null,null,null,{"$f":"ROUND(IF(F74=0,SUM(D74+E74),((D74+E74)/F74)),2)","v":0},null,"Emergency/Initial Work   ",false,{"$f":"IF(J74=TRUE,$G$87,\"\")","v":""}]
[null,null,null,null,null,null,0,null,"Investigation Work      ",false,{"$f":"IF(J75=TRUE,$G$87,\"\")","v":""}]
[null,null,null,null,null,null,0,null,"Monitoring/Interim Work        ",false,""]
[null,null,null,null,null,null,0,null,"Corrective Action Plan Work",false,""]
[null,null,null,null,null,null,0,null,"Report Preparation ",false,""]
[null,null,null,null,null,null,0,null,"Emergency/Initial Work   ",{"$f":"IF(J74=TRUE,1,\"\")","v":""}]
[null,null,null,null,null,null,0,null,"Investigation Work      ",{"$f":"IF(J75=TRUE,2,\"\")","v":""}]
[null,null,null,null,null,null,0,null,"Monitoring/Interim Work        ",{"$f":"IF(J76=TRUE,3,\"\")","v":""}]
[null,null,null,null,null,null,0,null,"Corrective Action Plan Work",{"$f":"IF(J77=TRUE,4,\"\")","v":""}]
[null,null,null,null,null,null,0,null,"Report Preparation ",{"$f":"IF(J78=TRUE,5,\"\")","v":""}]
[null,null,null,null,null,null,0]
[null,null,null,null,null,null,0]
[null,null,null,null,null,null,0,null,{"$f":"IF(J74=TRUE,$M$29,IF(J75=TRUE,$M$30,IF(J76=TRUE,$M$31,IF(J77=TRUE,$M$32,IF(J78=TRUE,$M$33,0)))))","v":0}]
["SUBTOTAL OF THIS PAGE",null,null,null,null,null,{"$f":"SUM(G74:G86)","v":0},null,{"$f":"SUM(I86)","v":0},{"$f":"IF(I87>1,1,0)","v":0}]
["Page              of               (Travel Supplementary Sheet)"]
[]
[]
["PART 5.D (1)"]
["TRAVEL SUPPLEMENTARY SHEET"]
["Check Event:"]
[]
["LODGING/MEALS"]
[]
["1.    Overnight stay is allowed for any continuous site work such as multiple site visits, treatment system installation, drilling/P&A "]
["       wells, geoprobe work, over-excavation, soil treatment or at least 6 hour vacuum events."]
["2.   Prior approval from the Trust Fund Management should be obtained for overnight stay for work other than that "]
["      specifically identified in #1, above."]
["3.   Meals are only reimbursable when overnight stay is required."]
["4.   Claims for hotel charges must be accompanied by legible receipts indicating names of persons staying in a room.  Do not "]
["      provide charge card receipts.  Names can not be added after the receipt is generated."]
["5.   No RAC markup allowed"]
["6.   Single site visits:  (Hotel Charges) + (Meal Charges) = Total"]
["7.   Multiple site visits:  [(Hotel Charges) + (Meal Charges)] ÷ (No. Of Sites Visited) = Total"]
["8.   Airfares, toll charges, and taxi charges are not reimbursable."]
["9.  Travel charge for work activities addressed in unit pricing should not be addressed on this form."]
["RATES",null,"4/1/2012 MAXIMUM RATES"]
["Meals - Statewide",null,"$30/day "]
["Meals - New Orleans",null,"$35/day"]
["Hotel - Statewide",null,"$100/night"]
["Hotel - New Orleans",null,"$150/night"]
["Required Information- Check below the reason charges for overnight stay or meals are being requested:"]
[]
[]
["                                                                                                                                                                                              ."]
["LAST\nNAME OF\nPERSON","RAC\nINVOICE\nNO.","DATE(S)\nTRAVELED","HOTEL\nCHARGES","TOTAL\nMEAL\nCHARGES","NO. OF\nSITES\nVISITED","TOTAL",null,null,null,"total"]
[null,null,null,null,null,null,{"$f":"ROUND(IF(F119=0,SUM(D119+E119),((D119+E119)/F119)),2)","v":0},null,"Emergency/Initial Work   ",false,{"$f":"IF(J119=TRUE,$G$132,\"\")","v":""}]
[null,null,null,null,null,null,0,null,"Investigation Work      ",false,{"$f":"IF(J120=TRUE,$G$132,\"\")","v":""}]
[null,null,null,null,null,null,0,null,"Monitoring/Interim Work        ",false,""]
[null,null,null,null,null,null,0,null,"Corrective Action Plan Work",false,""]
[null,null,null,null,null,null,0,null,"Report Preparation ",false,""]
[null,null,null,null,null,null,0,null,"Emergency/Initial Work   ",{"$f":"IF(J119=TRUE,1,\"\")","v":""}]
[null,null,null,null,null,null,0,null,"Investigation Work      ",{"$f":"IF(J120=TRUE,2,\"\")","v":""}]
[null,null,null,null,null,null,0,null,"Monitoring/Interim Work        ",{"$f":"IF(J121=TRUE,3,\"\")","v":""}]
[null,null,null,null,null,null,0,null,"Corrective Action Plan Work",{"$f":"IF(J122=TRUE,4,\"\")","v":""}]
[null,null,null,null,null,null,0,null,"Report Preparation ",{"$f":"IF(J123=TRUE,5,\"\")","v":""}]
[null,null,null,null,null,null,0]
[null,null,null,null,null,null,0]
[null,null,null,null,null,null,0,null,{"$f":"IF(J119=TRUE,$M$29,IF(J120=TRUE,$M$30,IF(J121=TRUE,$M$31,IF(J122=TRUE,$M$32,IF(J123=TRUE,$M$33,0)))))","v":0}]
["SUBTOTAL OF THIS PAGE",null,null,null,null,null,{"$f":"SUM(G119:G131)","v":0},null,{"$f":"SUM(I131)","v":0},{"$f":"IF(I132>1,1,0)","v":0}]
["Page              of               (Travel Supplementary Sheet)"]
[]
[]
["PART 5.D (1)"]
["TRAVEL SUPPLEMENTARY SHEET"]
["Check Event:"]
[]
["LODGING/MEALS"]
[]
["1.    Overnight stay is allowed for any continuous site work such as multiple site visits, treatment system installation, drilling/P&A "]
["       wells, geoprobe work, over-excavation, soil treatment or at least 6 hour vacuum events."]
["2.   Prior approval from the Trust Fund Management should be obtained for overnight stay for work other than that "]
["      specifically identified in #1, above."]
["3.   Meals are only reimbursable when overnight stay is required."]
["4.   Claims for hotel charges must be accompanied by legible receipts indicating names of persons staying in a room.  Do not "]
["      provide charge card receipts.  Names can not be added after the receipt is generated."]
["5.   No RAC markup allowed"]
["6.   Single site visits:  (Hotel Charges) + (Meal Charges) = Total"]
["7.   Multiple site visits:  [(Hotel Charges) + (Meal Charges)] ÷ (No. Of Sites Visited) = Total"]
["8.   Airfares, toll charges, and taxi charges are not reimbursable."]
["9.  Travel charge for work activities addressed in unit pricing should not be addressed on this form."]
["RATES",null,"4/1/2012 MAXIMUM RATES"]
["Meals - Statewide",null,"$30/day "]
["Meals - New Orleans",null,"$35/day"]
["Hotel - Statewide",null,"$100/night"]
["Hotel - New Orleans",null,"$150/night"]
["Required Information- Check below the reason charges for overnight stay or meals are being requested:"]
[]
[]
["                                                                                                                                                                                              ."]
["LAST\nNAME OF\nPERSON","RAC\nINVOICE\nNO.","DATE(S)\nTRAVELED","HOTEL\nCHARGES","TOTAL\nMEAL\nCHARGES","NO. OF\nSITES\nVISITED","TOTAL",null,null,null,"total"]
[null,null,null,null,null,null,{"$f":"ROUND(IF(F164=0,SUM(D164+E164),((D164+E164)/F164)),2)","v":0},null,"Emergency/Initial Work   ",false,{"$f":"IF(J164=TRUE,$G$177,\"\")","v":""}]
[null,null,null,null,null,null,0,null,"Investigation Work      ",false,{"$f":"IF(J165=TRUE,$G$177,\"\")","v":""}]
[null,null,null,null,null,null,0,null,"Monitoring/Interim Work        ",false,""]
[null,null,null,null,null,null,0,null,"Corrective Action Plan Work",false,""]
[null,null,null,null,null,null,0,null,"Report Preparation ",false,""]
[null,null,null,null,null,null,0,null,"Emergency/Initial Work   ",{"$f":"IF(J164=TRUE,1,\"\")","v":""}]
[null,null,null,null,null,null,0,null,"Investigation Work      ",{"$f":"IF(J165=TRUE,2,\"\")","v":""}]
[null,null,null,null,null,null,0,null,"Monitoring/Interim Work        ",{"$f":"IF(J166=TRUE,3,\"\")","v":""}]
[null,null,null,null,null,null,0,null,"Corrective Action Plan Work",{"$f":"IF(J167=TRUE,4,\"\")","v":""}]
[null,null,null,null,null,null,0,null,"Report Preparation ",{"$f":"IF(J168=TRUE,5,\"\")","v":""}]
[null,null,null,null,null,null,0]
[null,null,null,null,null,null,0]
[null,null,null,null,null,null,0,null,{"$f":"IF(J164=TRUE,$M$29,IF(J165=TRUE,$M$30,IF(J166=TRUE,$M$31,IF(J167=TRUE,$M$32,IF(J168=TRUE,$M$33,0)))))","v":0}]
["SUBTOTAL OF THIS PAGE",null,null,null,null,null,{"$f":"SUM(G164:G176)","v":0},null,{"$f":"SUM(I176)","v":0},{"$f":"IF(I177>1,1,0)","v":0}]
["Page              of               (Travel Supplementary Sheet)"]
[]
[]
["PART 5.D (1)"]
["TRAVEL SUPPLEMENTARY SHEET"]
["Check Event:"]
[]
["LODGING/MEALS"]
[]
["1.    Overnight stay is allowed for any continuous site work such as multiple site visits, treatment system installation, drilling/P&A "]
["       wells, geoprobe work, over-excavation, soil treatment or at least 6 hour vacuum events."]
["2.   Prior approval from the Trust Fund Management should be obtained for overnight stay for work other than that "]
["      specifically identified in #1, above."]
["3.   Meals are only reimbursable when overnight stay is required."]
["4.   Claims for hotel charges must be accompanied by legible receipts indicating names of persons staying in a room.  Do not "]
["      provide charge card receipts.  Names can not be added after the receipt is generated."]
["5.   No RAC markup allowed"]
["6.   Single site visits:  (Hotel Charges) + (Meal Charges) = Total"]
["7.   Multiple site visits:  [(Hotel Charges) + (Meal Charges)] ÷ (No. Of Sites Visited) = Total"]
["8.   Airfares, toll charges, and taxi charges are not reimbursable."]
["9.  Travel charge for work activities addressed in unit pricing should not be addressed on this form."]
["RATES",null,"4/1/2012 MAXIMUM RATES"]
["Meals - Statewide",null,"$30/day "]
["Meals - New Orleans",null,"$35/day"]
["Hotel - Statewide",null,"$100/night"]
["Hotel - New Orleans",null,"$150/night"]
["Required Information- Check below the reason charges for overnight stay or meals are being requested:"]
[]
[]
["                                                                                                                                                                                              ."]
["LAST\nNAME OF\nPERSON","RAC\nINVOICE\nNO.","DATE(S)\nTRAVELED","HOTEL\nCHARGES","TOTAL\nMEAL\nCHARGES","NO. OF\nSITES\nVISITED","TOTAL",null,null,null,"total"]
[null,null,null,null,null,null,{"$f":"ROUND(IF(F209=0,SUM(D209+E209),((D209+E209)/F209)),2)","v":0},null,"Emergency/Initial Work   ",false,{"$f":"IF(J209=TRUE,$G$222,\"\")","v":""}]
[null,null,null,null,null,null,0,null,"Investigation Work      ",false,{"$f":"IF(J210=TRUE,$G$222,\"\")","v":""}]
[null,null,null,null,null,null,0,null,"Monitoring/Interim Work        ",false,""]
[null,null,null,null,null,null,0,null,"Corrective Action Plan Work",false,""]
[null,null,null,null,null,null,0,null,"Report Preparation ",false,""]
[null,null,null,null,null,null,0,null,"Emergency/Initial Work   ",{"$f":"IF(J209=TRUE,1,\"\")","v":""}]
[null,null,null,null,null,null,0,null,"Investigation Work      ",{"$f":"IF(J210=TRUE,2,\"\")","v":""}]
[null,null,null,null,null,null,0,null,"Monitoring/Interim Work        ",{"$f":"IF(J211=TRUE,3,\"\")","v":""}]
[null,null,null,null,null,null,0,null,"Corrective Action Plan Work",{"$f":"IF(J212=TRUE,4,\"\")","v":""}]
[null,null,null,null,null,null,0,null,"Report Preparation ",{"$f":"IF(J213=TRUE,5,\"\")","v":""}]
[null,null,null,null,null,null,0]
[null,null,null,null,null,null,0]
[null,null,null,null,null,null,0,null,{"$f":"IF(J209=TRUE,$M$29,IF(J210=TRUE,$M$30,IF(J211=TRUE,$M$31,IF(J212=TRUE,$M$32,IF(J213=TRUE,$M$33,0)))))","v":0}]
["SUBTOTAL OF THIS PAGE",null,null,null,null,null,{"$f":"SUM(G209:G221)","v":0},null,{"$f":"SUM(I221)","v":0},{"$f":"IF(I222>1,1,0)","v":0}]
["Page              of               (Travel Supplementary Sheet)"]

{"sheet":"Travel","index":11,"n_rows":209,"n_cols":15,"rows_kept":209,"cut":false,"hidden":false,"merged":[[174,0,174,8],[40,0,40,5],[206,0,206,7],[207,0,207,7],[82,0,82,5],[124,0,124,5],[166,0,166,5],[172,0,172,8],[173,0,173,8],[175,0,175,8],[176,0,176,8],[177,0,177,8],[168,0,168,8],[169,0,169,8],[170,0,170,8],[171,0,171,8],[81,0,81,7],[123,0,123,7],[165,0,165,7],[164,0,164,7],[136,0,136,8],[137,0,137,8],[138,0,138,8],[139,0,140,0],[208,0,208,5],[178,0,178,8],[179,0,179,8],[180,0,180,8],[181,0,182,0],[181,1,182,1],[181,2,182,2],[181,3,182,3],[181,4,182,4],[181,5,181,6],[181,7,182,7],[181,8,182,8],[139,1,140,1],[139,2,140,2],[139,3,140,3],[139,4,140,4],[139,5,139,6],[139,7,140,7],[139,8,140,8],[130,0,130,8],[131,0,131,8],[133,0,133,8],[134,0,134,8],[135,0,135,8],[126,0,126,8],[127,0,127,8],[128,0,128,8],[129,0,129,8],[132,0,132,8],[122,0,122,7],[94,0,94,8],[95,0,95,8],[96,0,96,8],[97,0,98,0],[97,1,98,1],[97,2,98,2],[97,3,98,3],[97,4,98,4],[97,5,97,6],[97,7,98,7],[97,8,98,8],[88,0,88,8],[89,0,89,8],[91,0,91,8],[92,0,92,8],[93,0,93,8],[84,0,84,8],[85,0,85,8],[86,0,86,8],[87,0,87,8],[90,0,90,8],[80,0,80,7],[53,0,53,8],[54,0,54,8],[55,0,56,0],[55,1,56,1],[55,2,56,2],[55,3,56,3],[55,4,56,4],[55,5,55,6],[55,7,56,7],[55,8,56,8],[47,0,47,8],[49,0,49,8],[50,0,50,8],[51,0,51,8],[52,0,52,8],[42,0,42,8],[43,0,43,8],[44,0,44,8],[45,0,45,8],[46,0,46,8],[48,0,48,8],[0,0,0,8],[1,0,1,8],[2,0,2,8],[6,0,6,8],[4,0,4,8],[5,0,5,8],[3,0,3,8],[8,0,8,8],[9,0,9,8],[7,0,7,8],[38,0,38,7],[39,0,39,7],[13,8,14,8],[10,0,10,8],[11,0,11,8],[12,0,12,8],[13,4,14,4],[13,3,14,3],[13,2,14,2],[13,1,14,1],[13,0,14,0],[13,5,13,6],[13,7,14,7]]}
["PART 5.D (2)"]
["TRAVEL SUPPLEMENTARY SHEET",null,null,null,null,null,null,null,null,null,null,"Hotal Total","Milage 2 total","Travel total"]
["Check Event:",null,null,null,null,null,null,null,null,null,"Emergency/Initial Work   ",{"$f":"'Hotel & Food'!M29","v":0},{"$f":"O16","v":0},{"$f":"SUM(L3:M3)","v":0}]
[null,null,null,null,null,null,null,null,null,null,"Investigation Work      ",{"$f":"'Hotel & Food'!M30","v":0},{"$f":"O17","v":0},{"$f":"SUM(L4:M4)","v":0}]
["UNIT PRICE TRAVEL",null,null,null,null,null,null,null,null,null,"Monitoring/Interim Work        ",{"$f":"'Hotel & Food'!M31","v":0},{"$f":"O18","v":0},0]
["(The unit price addresses costs associated with vehicle mileage and employees’ travel time)",null,null,null,null,null,null,null,null,null,"Corrective Action Plan Work",{"$f":"'Hotel & Food'!M32","v":0},{"$f":"O19","v":0},0]
["1. When multiple sites are visited in a single day, the total mileage shall be divided by the number of sites visited. ",null,null,null,null,null,null,null,null,null,"Report Preparation ",{"$f":"'Hotel & Food'!M33","v":0},{"$f":"O20","v":0},0]
["     Total Mileage should be rounded UP to a whole number and adjusted mileage should be rounded to two (2) decimal places. "]
["2. Activity Performed Codes:"]
["        1 - Groundwater Sampling, Free Product Recovery (Handbailing of Wells), Gauging, Treatment Unit Operation & Maintenance, "]
["             Discharge Sampling, Drilling/Plugging and Abandonment; "]
["        2 - Excavation, System Installation, Major Renovation, Major Repair, Site Investigation, Soil Confirmation Sampling;  "]
["        3 - Non-Unit Price Activity (Charged Time/Materials)     "]
["ACTIVITY PERFORMED","DATE\nSort By Oldest to Newest","DESTINATION\nShow Beginning,\nInterim, Ending Areas\nTraveled\n(Ex.:BR, Rayne,\nLafayette, BR.)","RAC\nINVOICE\nNO.\n","TOTAL MILEAGE","Complete these\ncolumns only when\nmultiple site visits\noccurred",null,"RATE","TOTAL"]
[null,null,null,null,null,"NO. OF\nSITES\nVISITED","ADJUSTED\nMILEAGE",null,null,null,null,null,"total",null,"sheet total"]
[null,null,null,null,null,null,{"$f":"IF(F16=0,\"\",ROUND(E16/F16,2))","v":""},1.95,{"$f":"ROUND(IF(F16=0,E16*H16,G16*H16),2)","v":0},null,"Emergency/Initial Work   ",false,{"$f":"IF(L16=TRUE,$I$39,\"\")","v":""},"Emergency/Initial Work   ",{"$f":"SUM(M16,M58,M100,M142,M184)","v":0}]
[null,null,null,null,null,null,{"$f":"IF(F17=0,\"\",ROUND(E17/F17,2))","v":""},1.95,{"$f":"ROUND(IF(F17=0,E17*H17,G17*H17),2)","v":0},null,"Investigation Work      ",false,{"$f":"IF(L17=TRUE,$I$39,\"\")","v":""},"Investigation Work      ",{"$f":"SUM(M17,M59,M101,M143,M185)","v":0}]
[null,null,null,null,null,null,"",1.95,0,null,"Monitoring/Interim Work        ",false,"","Monitoring/Interim Work        ",{"$f":"SUM(M18,M60,M102,M144,M186)","v":0}]
[null,null,null,null,null,null,"",1.95,0,null,"Corrective Action Plan Work",false,"","Corrective Action Plan Work",{"$f":"SUM(M19,M61,M103,M145,M187)","v":0}]
[null,null,null,null,null,null,"",1.95,0,null,"Report Preparation ",false,"","Report Preparation ",{"$f":"SUM(M20,M62,M104,M146,M188)","v":0}]
[null,null,null,null,null,null,"",1.95,0,null,"Emergency/Initial Work   ",{"$f":"IF(L16=TRUE,1,\"\")","v":""}]
[null,null,null,null,null,null,"",1.95,0,null,"Investigation Work      ",{"$f":"IF(L17=TRUE,2,\"\")","v":""}]
[null,null,null,null,null,null,"",1.95,0,null,"Monitoring/Interim Work        ",{"$f":"IF(L18=TRUE,3,\"\")","v":""}]
[null,null,null,null,null,null,"",1.95,0,null,"Corrective Action Plan Work",{"$f":"IF(L19=TRUE,4,\"\")","v":""}]
[null,null,null,null,null,null,"",1.95,0,null,"Report Preparation ",{"$f":"IF(L20=TRUE,5,\"\")","v":""}]
[null,null,null,null,null,null,"",1.95,0]
[null,null,null,null,null,null,"",1.95,0]
[null,null,null,null,null,null,"",1.95,0]
[null,null,null,null,null,null,"",1.95,0]
[null,null,null,null,null,null,"",1.95,0]
[null,null,null,null,null,null,"",1.95,0]
[null,null,null,null,null,null,"",1.95,0]
[null,null,null,null,null,null,"",1.95,0]
[null,null,null,null,null,null,"",1.95,0]
[null,null,null,null,null,null,"",1.95,0]
[null,null,null,null,null,null,"",1.95,0]
[null,null,null,null,null,null,"",1.95,0]
[null,null,null,null,null,null,"",1.95,0,null,{"$f":"IF(L16=TRUE,$N$3,IF(L17=TRUE,$N$4,IF(L18=TRUE,$N$5,IF(L19=TRUE,$N$6,IF(L20=TRUE,$N$7,0)))))","v":0}]
["SUBTOTAL OF THIS PAGE",null,null,null,null,null,null,null,{"$f":"SUM(I16:I38)","v":0}]
["TOTAL TRAVEL",null,null,null,null,null,null,null,{"$f":"SUM(K38)","v":0},null,{"$f":"IF(I40>0,1,0)","v":0}]
["Page              of               (Travel Supplementary Sheet)"]
[]
["PART 5.D (2)"]
["TRAVEL SUPPLEMENTARY SHEET"]
["Check Event:"]
[]
["UNIT PRICE TRAVEL"]
["(The unit price addresses costs associated with vehicle mileage and employees’ travel time)"]
["1. When multiple sites are visited in a single day, the total mileage shall be divided by the number of sites visited. "]
["     Total Mileage should be rounded UP to a whole number and adjusted mileage should be rounded to two (2) decimal places. "]
["2. Activity Performed Codes:"]
["        1 - Groundwater Sampling, Free Product Recovery (Handbailing of Wells), Gauging, Treatment Unit Operation & Maintenance, "]
["             Discharge Sampling, Drilling/Plugging and Abandonment; "]
["        2 - Excavation, System Installation, Major Renovation, Major Repair, Site Investigation, Soil Confirmation Sampling;  "]
["        3 - Non-Unit Price Activity (Charged Time/Materials)     "]
["ACTIVITY PERFORMED","DATE\nSort By Oldest to Newest","DESTINATION\nShow Beginning,\nInterim, Ending Areas\nTraveled\n(Ex.:BR, Rayne,\nLafayette, BR.)","RAC\nINVOICE\nNO.\n","TOTAL MILEAGE","Complete these\ncolumns only when\nmultiple site visits\noccurred",null,"RATE","TOTAL"]
[null,null,null,null,null,"NO. OF\nSITES\nVISITED","ADJUSTED\nMILEAGE",null,null,null,null,null,"total"]
[null,null,null,null,null,null,{"$f":"IF(F58=0,\"\",ROUND(E58/F58,2))","v":""},1.95,{"$f":"ROUND(IF(F58=0,E58*H58,G58*H58),2)","v":0},null,"Emergency/Initial Work   ",false,{"$f":"IF(L58=TRUE,$I$81,\"\")","v":""}]
[null,null,null,null,null,null,"",1.95,0,null,"Investigation Work      ",false,{"$f":"IF(L59=TRUE,$I$81,\"\")","v":""}]
[null,null,null,null,null,null,"",1.95,0,null,"Monitoring/Interim Work        ",false,""]
[null,null,null,null,null,null,"",1.95,0,null,"Corrective Action Plan Work",false,""]
[null,null,null,null,null,null,"",1.95,0,null,"Report Preparation ",false,""]
[null,null,null,null,null,null,"",1.95,0,null,"Emergency/Initial Work   ",{"$f":"IF(L58=TRUE,1,\"\")","v":""}]
[null,null,null,null,null,null,"",1.95,0,null,"Investigation Work      ",{"$f":"IF(L59=TRUE,2,\"\")","v":""}]
[null,null,null,null,null,null,"",1.95,0,null,"Monitoring/Interim Work        ",{"$f":"IF(L60=TRUE,3,\"\")","v":""}]
[null,null,null,null,null,null,"",1.95,0,null,"Corrective Action Plan Work",{"$f":"IF(L61=TRUE,4,\"\")","v":""}]
[null,null,null,null,null,null,"",1.95,0,null,"Report Preparation ",{"$f":"IF(L62=TRUE,5,\"\")","v":""}]
[null,null,null,null,null,null,"",1.95,0]
[null,null,null,null,null,null,"",1.95,0]
[null,null,null,null,null,null,"",1.95,0]
[null,null,null,null,null,null,"",1.95,0]
[null,null,null,null,null,null,"",1.95,0]
[null,null,null,null,null,null,"",1.95,0]
[null,null,null,null,null,null,"",1.95,0]
[null,null,null,null,null,null,"",1.95,0]
[null,null,null,null,null,null,"",1.95,0]
[null,null,null,null,null,null,"",1.95,0]
[null,null,null,null,null,null,"",1.95,0]
[null,null,null,null,null,null,"",1.95,0]
[null,null,null,null,null,null,"",1.95,0,null,{"$f":"IF(L58=TRUE,$N$3,IF(L59=TRUE,$N$4,IF(L60=TRUE,$N$5,IF(L61=TRUE,$N$6,IF(L62=TRUE,$N$7,0)))))","v":0}]
["SUBTOTAL OF THIS PAGE",null,null,null,null,null,null,null,{"$f":"SUM(I58:I80)","v":0}]
["TOTAL TRAVEL",null,null,null,null,null,null,null,{"$f":"SUM(K80)","v":0},null,{"$f":"IF(I82>0,1,0)","v":0}]
["Page              of               (Travel Supplementary Sheet)"]
[]
["PART 5.D (2)"]
["TRAVEL SUPPLEMENTARY SHEET"]
["Check Event:"]
[]
["UNIT PRICE TRAVEL"]
["(The unit price addresses costs associated with vehicle mileage and employees’ travel time)"]
["1. When multiple sites are visited in a single day, the total mileage shall be divided by the number of sites visited. "]
["     Total Mileage should be rounded UP to a whole number and adjusted mileage should be rounded to two (2) decimal places. "]
["2. Activity Performed Codes:"]
["        1 - Groundwater Sampling, Free Product Recovery (Handbailing of Wells), Gauging, Treatment Unit Operation & Maintenance, "]
["             Discharge Sampling, Drilling/Plugging and Abandonment; "]
["        2 - Excavation, System Installation, Major Renovation, Major Repair, Site Investigation, Soil Confirmation Sampling;  "]
["        3 - Non-Unit Price Activity (Charged Time/Materials)     "]
["ACTIVITY PERFORMED","DATE\nSort By Oldest to Newest","DESTINATION\nShow Beginning,\nInterim, Ending Areas\nTraveled\n(Ex.:BR, Rayne,\nLafayette, BR.)","RAC\nINVOICE\nNO.\n","TOTAL MILEAGE","Complete these\ncolumns only when\nmultiple site visits\noccurred",null,"RATE","TOTAL"]
[null,null,null,null,null,"NO. OF\nSITES\nVISITED","ADJUSTED\nMILEAGE",null,null,null,null,null,"total"]
[null,null,null,null,null,null,{"$f":"IF(F100=0,\"\",ROUND(E100/F100,2))","v":""},1.95,{"$f":"ROUND(IF(F100=0,E100*H100,G100*H100),2)","v":0},null,"Emergency/Initial Work   ",false,{"$f":"IF(L100=TRUE,$I$123,\"\")","v":""}]
[null,null,null,null,null,null,"",1.95,0,null,"Investigation Work      ",false,{"$f":"IF(L101=TRUE,$I$123,\"\")","v":""}]
[null,null,null,null,null,null,"",1.95,0,null,"Monitoring/Interim Work        ",false,""]
[null,null,null,null,null,null,"",1.95,0,null,"Corrective Action Plan Work",false,""]
[null,null,null,null,null,null,"",1.95,0,null,"Report Preparation ",false,""]
[null,null,null,null,null,null,"",1.95,0,null,"Emergency/Initial Work   ",{"$f":"IF(L100=TRUE,1,\"\")","v":""}]
[null,null,null,null,null,null,"",1.95,0,null,"Investigation Work      ",{"$f":"IF(L101=TRUE,2,\"\")","v":""}]
[null,null,null,null,null,null,"",1.95,0,null,"Monitoring/Interim Work        ",{"$f":"IF(L102=TRUE,3,\"\")","v":""}]
[null,null,null,null,null,null,"",1.95,0,null,"Corrective Action Plan Work",{"$f":"IF(L103=TRUE,4,\"\")","v":""}]
[null,null,null,null,null,null,"",1.95,0,null,"Report Preparation ",{"$f":"IF(L104=TRUE,5,\"\")","v":""}]
[null,null,null,null,null,null,"",1.95,0]
[null,null,null,null,null,null,"",1.95,0]
[null,null,null,null,null,null,"",1.95,0]
[null,null,null,null,null,null,"",1.95,0]
[null,null,null,null,null,null,"",1.95,0]
[null,null,null,null,null,null,"",1.95,0]
[null,null,null,null,null,null,"",1.95,0]
[null,null,null,null,null,null,"",1.95,0]
[null,null,null,null,null,null,"",1.95,0]
[null,null,null,null,null,null,"",1.95,0]
[null,null,null,null,null,null,"",1.95,0]
[null,null,null,null,null,null,"",1.95,0]
[null,null,null,null,null,null,"",1.95,0,null,{"$f":"IF(L100=TRUE,$N$3,IF(L101=TRUE,$N$4,IF(L102=TRUE,$N$5,IF(L103=TRUE,$N$6,IF(L104=TRUE,$N$7,0)))))","v":0}]
["SUBTOTAL OF THIS PAGE",null,null,null,null,null,null,null,{"$f":"SUM(I100:I122)","v":0}]
["TOTAL TRAVEL",null,null,null,null,null,null,null,{"$f":"SUM(K122)","v":0},null,{"$f":"IF(I124>0,1,0)","v":0}]
["Page              of               (Travel Supplementary Sheet)"]
[]
["PART 5.D (2)"]
["TRAVEL SUPPLEMENTARY SHEET"]
["Check Event:"]
[]
["UNIT PRICE TRAVEL"]
["(The unit price addresses costs associated with vehicle mileage and employees’ travel time)"]
["1. When multiple sites are visited in a single day, the total mileage shall be divided by the number of sites visited. "]
["     Total Mileage should be rounded UP to a whole number and adjusted mileage should be rounded to two (2) decimal places. "]
["2. Activity Performed Codes:"]
["        1 - Groundwater Sampling, Free Product Recovery (Handbailing of Wells), Gauging, Treatment Unit Operation & Maintenance, "]
["             Discharge Sampling, Drilling/Plugging and Abandonment; "]
["        2 - Excavation, System Installation, Major Renovation, Major Repair, Site Investigation, Soil Confirmation Sampling;  "]
["        3 - Non-Unit Price Activity (Charged Time/Materials)     "]
["ACTIVITY PERFORMED","DATE\nSort By Oldest to Newest","DESTINATION\nShow Beginning,\nInterim, Ending Areas\nTraveled\n(Ex.:BR, Rayne,\nLafayette, BR.)","RAC\nINVOICE\nNO.\n","TOTAL MILEAGE","Complete these\ncolumns only when\nmultiple site visits\noccurred",null,"RATE","TOTAL"]
[null,null,null,null,null,"NO. OF\nSITES\nVISITED","ADJUSTED\nMILEAGE",null,null,null,null,null,"total"]
[null,null,null,null,null,null,{"$f":"IF(F142=0,\"\",ROUND(E142/F142,2))","v":""},1.95,{"$f":"ROUND(IF(F142=0,E142*H142,G142*H142),2)","v":0},null,"Emergency/Initial Work   ",false,{"$f":"IF(L142=TRUE,$I$165,\"\")","v":""}]
[null,null,null,null,null,null,"",1.95,0,null,"Investigation Work      ",false,{"$f":"IF(L143=TRUE,$I$165,\"\")","v":""}]
[null,null,null,null,null,null,"",1.95,0,null,"Monitoring/Interim Work        ",false,""]
[null,null,null,null,null,null,"",1.95,0,null,"Corrective Action Plan Work",false,""]
[null,null,null,null,null,null,"",1.95,0,null,"Report Preparation ",false,""]
[null,null,null,null,null,null,"",1.95,0,null,"Emergency/Initial Work   ",{"$f":"IF(L142=TRUE,1,\"\")","v":""}]
[null,null,null,null,null,null,"",1.95,0,null,"Investigation Work      ",{"$f":"IF(L143=TRUE,2,\"\")","v":""}]
[null,null,null,null,null,null,"",1.95,0,null,"Monitoring/Interim Work        ",{"$f":"IF(L144=TRUE,3,\"\")","v":""}]
[null,null,null,null,null,null,"",1.95,0,null,"Corrective Action Plan Work",{"$f":"IF(L145=TRUE,4,\"\")","v":""}]
[null,null,null,null,null,null,"",1.95,0,null,"Report Preparation ",{"$f":"IF(L146=TRUE,5,\"\")","v":""}]
[null,null,null,null,null,null,"",1.95,0]
[null,null,null,null,null,null,"",1.95,0]
[null,null,null,null,null,null,"",1.95,0]
[null,null,null,null,null,null,"",1.95,0]
[null,null,null,null,null,null,"",1.95,0]
[null,null,null,null,null,null,"",1.95,0]
[null,null,null,null,null,null,"",1.95,0]
[null,null,null,null,null,null,"",1.95,0]
[null,null,null,null,null,null,"",1.95,0]
[null,null,null,null,null,null,"",1.95,0]
[null,null,null,null,null,null,"",1.95,0]
[null,null,null,null,null,null,"",1.95,0]
[null,null,null,null,null,null,"",1.95,0,null,{"$f":"IF(L142=TRUE,$N$3,IF(L143=TRUE,$N$4,IF(L144=TRUE,$N$5,IF(L145=TRUE,$N$6,IF(L146=TRUE,$N$7,0)))))","v":0}]
["SUBTOTAL OF THIS PAGE",null,null,null,null,null,null,null,{"$f":"SUM(I142:I164)","v":0}]
["TOTAL TRAVEL",null,null,null,null,null,null,null,{"$f":"SUM(K164)","v":0},null,{"$f":"IF(I166>0,1,0)","v":0}]
["Page              of               (Travel Supplementary Sheet)"]
[]
["PART 5.D (2)"]
["TRAVEL SUPPLEMENTARY SHEET"]
["Check Event:"]
[]
["UNIT PRICE TRAVEL"]
["(The unit price addresses costs associated with vehicle mileage and employees’ travel time)"]
["1. When multiple sites are visited in a single day, the total mileage shall be divided by the number of sites visited. "]
["     Total Mileage should be rounded UP to a whole number and adjusted mileage should be rounded to two (2) decimal places. "]
["2. Activity Performed Codes:"]
["        1 - Groundwater Sampling, Free Product Recovery (Handbailing of Wells), Gauging, Treatment Unit Operation & Maintenance, "]
["             Discharge Sampling, Drilling/Plugging and Abandonment; "]
["        2 - Excavation, System Installation, Major Renovation, Major Repair, Site Investigation, Soil Confirmation Sampling;  "]
["        3 - Non-Unit Price Activity (Charged Time/Materials)     "]
["ACTIVITY PERFORMED","DATE\nSort By Oldest to Newest","DESTINATION\nShow Beginning,\nInterim, Ending Areas\nTraveled\n(Ex.:BR, Rayne,\nLafayette, BR.)","RAC\nINVOICE\nNO.\n","TOTAL MILEAGE","Complete these\ncolumns only when\nmultiple site visits\noccurred",null,"RATE","TOTAL"]
[null,null,null,null,null,"NO. OF\nSITES\nVISITED","ADJUSTED\nMILEAGE",null,null,null,null,null,"total"]
[null,null,null,null,null,null,{"$f":"IF(F184=0,\"\",ROUND(E184/F184,2))","v":""},1.95,{"$f":"ROUND(IF(F184=0,E184*H184,G184*H184),2)","v":0},null,"Emergency/Initial Work   ",false,{"$f":"IF(L184=TRUE,$I$207,\"\")","v":""}]
[null,null,null,null,null,null,"",1.95,0,null,"Investigation Work      ",false,{"$f":"IF(L185=TRUE,$I$207,\"\")","v":""}]
[null,null,null,null,null,null,"",1.95,0,null,"Monitoring/Interim Work        ",false,""]
[null,null,null,null,null,null,"",1.95,0,null,"Corrective Action Plan Work",false,""]
[null,null,null,null,null,null,"",1.95,0,null,"Report Preparation ",false,""]
[null,null,null,null,null,null,"",1.95,0,null,"Emergency/Initial Work   ",{"$f":"IF(L184=TRUE,1,\"\")","v":""}]
[null,null,null,null,null,null,"",1.95,0,null,"Investigation Work      ",{"$f":"IF(L185=TRUE,2,\"\")","v":""}]
[null,null,null,null,null,null,"",1.95,0,null,"Monitoring/Interim Work        ",{"$f":"IF(L186=TRUE,3,\"\")","v":""}]
[null,null,null,null,null,null,"",1.95,0,null,"Corrective Action Plan Work",{"$f":"IF(L187=TRUE,4,\"\")","v":""}]
[null,null,null,null,null,null,"",1.95,0,null,"Report Preparation ",{"$f":"IF(L188=TRUE,5,\"\")","v":""}]
[null,null,null,null,null,null,"",1.95,0]
[null,null,null,null,null,null,"",1.95,0]
[null,null,null,null,null,null,"",1.95,0]
[null,null,null,null,null,null,"",1.95,0]
[null,null,null,null,null,null,"",1.95,0]
[null,null,null,null,null,null,"",1.95,0]
[null,null,null,null,null,null,"",1.95,0]
[null,null,null,null,null,null,"",1.95,0]
[null,null,null,null,null,null,"",1.95,0]
[null,null,null,null,null,null,"",1.95,0]
[null,null,null,null,null,null,"",1.95,0]
[null,null,null,null,null,null,"",1.95,0]
[null,null,null,null,null,null,"",1.95,0,null,{"$f":"IF(L184=TRUE,$N$3,IF(L185=TRUE,$N$4,IF(L186=TRUE,$N$5,IF(L187=TRUE,$N$6,IF(L188=TRUE,$N$7,0)))))","v":0}]
["SUBTOTAL OF THIS PAGE",null,null,null,null,null,null,null,{"$f":"SUM(I184:I206)","v":0}]
["TOTAL TRAVEL",null,null,null,null,null,null,null,{"$f":"SUM(K206)","v":0},null,{"$f":"IF(I208>0,1,0)","v":0}]
["Page              of               (Travel Supplementary Sheet)"]

{"sheet":"Transportation&Shipping","index":12,"n_rows":171,"n_cols":10,"rows_kept":171,"cut":false,"hidden":false,"merged":[[138,0,138,3],[139,0,139,3],[168,0,168,2],[170,0,170,2],[169,0,169,2],[134,0,134,3],[135,0,135,3],[136,0,136,3],[137,0,137,3],[129,0,129,3],[130,0,130,3],[131,0,131,3],[133,0,133,3],[95,0,95,3],[96,0,96,3],[125,0,125,2],[127,0,127,2],[126,0,126,2],[91,0,91,3],[92,0,92,3],[93,0,93,3],[94,0,94,3],[86,0,86,3],[87,0,87,3],[88,0,88,3],[90,0,90,3],[52,0,52,3],[53,0,53,3],[82,0,82,2],[84,0,84,2],[83,0,83,2],[48,0,48,3],[49,0,49,3],[50,0,50,3],[51,0,51,3],[43,0,43,3],[44,0,44,3],[45,0,45,3],[47,0,47,3],[41,0,41,2],[4,0,4,3],[40,0,40,2],[0,0,0,3],[1,0,1,3],[2,0,2,3],[5,0,5,3],[6,0,6,3],[7,0,7,3],[9,0,9,3],[10,0,10,3],[39,0,39,2],[8,0,8,3]]}
["PART 5.E"]
["TRANSPORTATION/SHIPPING SUPPLEMENTARY SHEET"]
["Check Event:"]
[]
["1.    This form should include shipping charges for contaminated soils and/or water, shipping charges for laboratory analysis, and"]
["       mob/demob of equipment used, other than for well drilling, plugging/abandonment, geoprobe work."]
["2.   Do not address RAC markup on this sheet.  RAC markup is to be shown on the Miscellaneous Supplementary Sheet."]
["3.   If a single invoice addresses charges for multiple sites, indicate on the invoice each site name and the amount charged to "]
["      each site."]
["4.   Rush charges not required by DEQ will not be paid."]
["5.   Transportation charges for work activities addressed in unit pricing should not be addressed on this form."]
["DESCRIPTION OF EACH\nITEM SHIPPED","RAC\nINVOICE NO.","OUTSIDE\nINVOICE NO.","TOTAL"]
[null,null,null,null,null,"Emergency/Initial Work   ",false,{"$f":"IF(G13=TRUE,$D$40,\"\")","v":""},"Emergency/Initial Work   ",{"$f":"SUM(H13,H56,H99,H142)","v":0}]
[null,null,null,null,null,"Investigation Work      ",false,{"$f":"IF(G14=TRUE,$D$40,\"\")","v":""},"Investigation Work      ",{"$f":"SUM(H14,H57,H100,H143)","v":0}]
[null,null,null,null,null,"Monitoring/Interim Work    ",false,"","Monitoring/Interim Work    ",{"$f":"SUM(H15,H58,H101,H144)","v":0}]
[null,null,null,null,null,"Corrective Action Plan Work",false,"","Corrective Action Plan Work",{"$f":"SUM(H16,H59,H102,H145)","v":0}]
[]
[null,null,null,null,null,"Emergency/Initial Work   ",{"$f":"IF(G13=TRUE,1,\"\")","v":""}]
[null,null,null,null,null,"Investigation Work      ",{"$f":"IF(G14=TRUE,2,\"\")","v":""}]
[null,null,null,null,null,"Monitoring/Interim Work    ",{"$f":"IF(G15=TRUE,3,\"\")","v":""}]
[null,null,null,null,null,"Corrective Action Plan Work",{"$f":"IF(G16=TRUE,4,\"\")","v":""}]
[]
[]
[]
[]
[]
[]
[]
[]
[]
[]
[]
[]
[]
[]
[]
[]
[]
[null,null,null,null,null,{"$f":"IF(G13=TRUE,$J$13,IF(G14=TRUE,$J$14,IF(G15=TRUE,$J$15,IF(G16=TRUE,$J$16,0))))","v":0}]
["SUBTOTAL OF THIS PAGE",null,null,{"$f":"SUM(D13:D38)","v":0}]
["TOTAL TRANSPORTATION/SHIPPING COSTS",null,null,{"$f":"SUM(F39)","v":0},null,{"$f":"IF(D41>0,1,0)","v":0}]
["Page                of                 (Transportation/Shipping Supplementary Sheet)"]
[]
["PART 5.E"]
["TRANSPORTATION/SHIPPING SUPPLEMENTARY SHEET"]
["Check Event:"]
[]
["1.    This form should include shipping charges for contaminated soils and/or water; shipping charges for laboratory analysis, "]
["       moblization and demobilization of equipment used other than for well drilling, plugging/abandonment, geoprobe work"]
["2.   Do not address RAC markup on this sheet.  RAC markup is to be shown on the Miscellaneous Supplementary Sheet."]
["3.   If a single invoice addresses charges for multiple sites, indicate on the invoice each site name and the amount charged to "]
["      each site."]
["4.   Rush charges not required by DEQ will not be paid."]
["5.   Transportation charges for work activities addressed in unit pricing should not be addressed on this form."]
["DESCRIPTION OF EACH\nITEM SHIPPED","RAC\nINVOICE NO.","OUTSIDE\nINVOICE NO.","TOTAL"]
[null,null,null,null,null,"Emergency/Initial Work   ",false,{"$f":"IF(G56=TRUE,$D$83,\"\")","v":""}]
[null,null,null,null,null,"Investigation Work      ",false,{"$f":"IF(G57=TRUE,$D$83,\"\")","v":""}]
[null,null,null,null,null,"Monitoring/Interim Work    ",false,""]
[null,null,null,null,null,"Corrective Action Plan Work",false,""]
[]
[null,null,null,null,null,"Emergency/Initial Work   ",{"$f":"IF(G56=TRUE,1,\"\")","v":""}]
[null,null,null,null,null,"Investigation Work      ",{"$f":"IF(G57=TRUE,2,\"\")","v":""}]
[null,null,null,null,null,"Monitoring/Interim Work    ",{"$f":"IF(G58=TRUE,3,\"\")","v":""}]
[null,null,null,null,null,"Corrective Action Plan Work",{"$f":"IF(G59=TRUE,4,\"\")","v":""}]
[]
[]
[]
[]
[]
[]
[]
[]
[]
[]
[]
[]
[]
[]
[]
[]
[]
[null,null,null,null,null,{"$f":"IF(G56=TRUE,$J$13,IF(G57=TRUE,$J$14,IF(G58=TRUE,$J$15,IF(G59=TRUE,$J$16,0))))","v":0}]
["SUBTOTAL OF THIS PAGE",null,null,{"$f":"SUM(D56:D81)","v":0}]
["TOTAL TRANSPORTATION/SHIPPING COSTS",null,null,{"$f":"SUM(F82)","v":0},null,{"$f":"IF(D84>0,1,0)","v":0}]
["Page                of                 (Transportation/Shipping Supplementary Sheet)"]
[]
["PART 5.E"]
["TRANSPORTATION/SHIPPING SUPPLEMENTARY SHEET"]
["Check Event:"]
[]
["1.    This form should include shipping charges for contaminated soils and/or water; shipping charges for laboratory analysis, "]
["       moblization and demobilization of equipment used other than for well drilling, plugging/abandonment, geoprobe work"]
["2.   Do not address RAC markup on this sheet.  RAC markup is to be shown on the Miscellaneous Supplementary Sheet."]
["3.   If a single invoice addresses charges for multiple sites, indicate on the invoice each site name and the amount charged to "]
["      each site."]
["4.   Rush charges not required by DEQ will not be paid."]
["5.   Transportation charges for work activities addressed in unit pricing should not be addressed on this form."]
["DESCRIPTION OF EACH\nITEM SHIPPED","RAC\nINVOICE NO.","OUTSIDE\nINVOICE NO.","TOTAL"]
[null,null,null,null,null,"Emergency/Initial Work   ",false,{"$f":"IF(G99=TRUE,$D$126,\"\")","v":""}]
[null,null,null,null,null,"Investigation Work      ",false,{"$f":"IF(G100=TRUE,$D$126,\"\")","v":""}]
[null,null,null,null,null,"Monitoring/Interim Work    ",false,""]
[null,null,null,null,null,"Corrective Action Plan Work",false,""]
[]
[null,null,null,null,null,"Emergency/Initial Work   ",{"$f":"IF(G99=TRUE,1,\"\")","v":""}]
[null,null,null,null,null,"Investigation Work      ",{"$f":"IF(G100=TRUE,2,\"\")","v":""}]
[null,null,null,null,null,"Monitoring/Interim Work    ",{"$f":"IF(G101=TRUE,3,\"\")","v":""}]
[null,null,null,null,null,"Corrective Action Plan Work",{"$f":"IF(G102=TRUE,4,\"\")","v":""}]
[]
[]
[]
[]
[]
[]
[]
[]
[]
[]
[]
[]
[]
[]
[]
[]
[]
[null,null,null,null,null,{"$f":"IF(G99=TRUE,$J$13,IF(G100=TRUE,$J$14,IF(G101=TRUE,$J$15,IF(G102=TRUE,$J$16,0))))","v":0}]
["SUBTOTAL OF THIS PAGE",null,null,{"$f":"SUM(D99:D124)","v":0}]
["TOTAL TRANSPORTATION/SHIPPING COSTS",null,null,{"$f":"SUM(F125)","v":0},null,{"$f":"IF(D127>0,1,0)","v":0}]
["Page                of                 (Transportation/Shipping Supplementary Sheet)"]
[]
["PART 5.E"]
["TRANSPORTATION/SHIPPING SUPPLEMENTARY SHEET"]
["Check Event:"]
[]
["1.    This form should include shipping charges for contaminated soils and/or water; shipping charges for laboratory analysis, "]
["       moblization and demobilization of equipment used other than for well drilling, plugging/abandonment, geoprobe work"]
["2.   Do not address RAC markup on this sheet.  RAC markup is to be shown on the Miscellaneous Supplementary Sheet."]
["3.   If a single invoice addresses charges for multiple sites, indicate on the invoice each site name and the amount charged to "]
["      each site."]
["4.   Rush charges not required by DEQ will not be paid."]
["5.   Transportation charges for work activities addressed in unit pricing should not be addressed on this form."]
["DESCRIPTION OF EACH\nITEM SHIPPED","RAC\nINVOICE NO.","OUTSIDE\nINVOICE NO.","TOTAL"]
[null,null,null,null,null,"Emergency/Initial Work   ",false,{"$f":"IF(G142=TRUE,$D$169,\"\")","v":""}]
[null,null,null,null,null,"Investigation Work      ",false,{"$f":"IF(G143=TRUE,$D$169,\"\")","v":""}]
[null,null,null,null,null,"Monitoring/Interim Work    ",false,""]
[null,null,null,null,null,"Corrective Action Plan Work",false,""]
[]
[null,null,null,null,null,"Emergency/Initial Work   ",{"$f":"IF(G142=TRUE,1,\"\")","v":""}]
[null,null,null,null,null,"Investigation Work      ",{"$f":"IF(G143=TRUE,2,\"\")","v":""}]
[null,null,null,null,null,"Monitoring/Interim Work    ",{"$f":"IF(G144=TRUE,3,\"\")","v":""}]
[null,null,null,null,null,"Corrective Action Plan Work",{"$f":"IF(G145=TRUE,4,\"\")","v":""}]
[]
[]
[]
[]
[]
[]
[]
[]
[]
[]
[]
[]
[]
[]
[]
[]
[]
[null,null,null,null,null,{"$f":"IF(G142=TRUE,$J$13,IF(G143=TRUE,$J$14,IF(G144=TRUE,$J$15,IF(G145=TRUE,$J$16,0))))","v":0}]
["SUBTOTAL OF THIS PAGE",null,null,{"$f":"SUM(D142:D167)","v":0}]
["TOTAL TRANSPORTATION/SHIPPING COSTS",null,null,{"$f":"SUM(F168)","v":0},null,{"$f":"IF(D170>0,1,0)","v":0}]
["Page                of                 (Transportation/Shipping Supplementary Sheet)"]

{"sheet":"Drilling-P&A","index":13,"n_rows":164,"n_cols":15,"rows_kept":164,"cut":false,"hidden":false,"merged":[[16,0,16,8],[53,0,53,8],[118,3,118,4],[118,5,118,7],[36,5,36,7],[35,5,35,7],[34,5,34,7],[36,3,36,4],[35,3,35,4],[34,3,34,4],[93,0,93,8],[94,0,94,8],[95,0,95,8],[87,0,87,8],[88,0,88,8],[89,0,89,8],[90,0,90,8],[91,0,91,8],[83,0,83,8],[84,0,84,8],[85,0,85,8],[78,0,78,2],[81,0,81,3],[76,0,76,2],[157,3,157,4],[157,5,157,7],[82,0,82,8],[155,0,155,2],[155,3,155,4],[155,5,155,7],[158,0,158,2],[158,3,158,4],[158,5,158,7],[125,0,125,8],[126,0,126,8],[127,0,127,8],[96,0,96,8],[116,3,116,4],[116,5,116,7],[97,0,97,8],[98,0,98,8],[92,0,92,8],[114,0,114,2],[114,3,114,4],[114,5,114,7],[119,0,119,2],[119,3,119,4],[119,5,119,7],[33,3,33,4],[33,5,33,7],[128,0,128,8],[120,0,120,7],[121,0,121,7],[123,0,123,8],[124,0,124,8],[122,0,122,3],[115,0,115,2],[115,3,115,4],[115,5,115,7],[116,0,116,2],[86,0,86,8],[37,3,37,4],[45,0,45,8],[46,0,46,8],[47,0,47,8],[48,0,48,8],[49,0,49,8],[41,0,41,8],[117,0,117,2],[117,3,117,4],[117,5,117,7],[118,0,118,2],[79,0,79,7],[80,0,80,7],[56,0,56,8],[57,0,57,8],[77,0,77,2],[77,3,77,4],[77,5,77,7],[78,3,78,4],[78,5,78,7],[75,0,75,2],[75,3,75,4],[75,5,75,7],[74,0,74,2],[74,3,74,4],[74,5,74,7],[73,0,73,2],[76,5,76,7],[76,3,76,4],[163,0,163,3],[129,0,129,8],[130,0,130,8],[131,0,131,8],[132,0,132,8],[133,0,133,8],[162,0,162,7],[134,0,134,8],[135,0,135,8],[136,0,136,8],[137,0,137,8],[161,0,161,7],[156,0,156,2],[156,3,156,4],[156,5,156,7],[157,0,157,2],[138,0,138,8],[139,0,139,8],[160,0,160,2],[160,3,160,4],[160,5,160,7],[159,0,159,2],[159,3,159,4],[159,5,159,7],[14,0,14,8],[15,0,15,8],[34,0,34,2],[35,0,35,2],[36,0,36,2],[37,0,37,2],[73,3,73,4],[73,5,73,7],[38,0,38,7],[39,0,39,7],[40,0,40,3],[42,0,42,8],[43,0,43,8],[44,0,44,8],[37,5,37,7],[50,0,50,8],[51,0,51,8],[52,0,52,8],[54,0,54,8],[55,0,55,8],[32,5,32,7],[32,3,32,4],[32,0,32,2],[33,0,33,2],[0,0,0,8],[1,0,1,8],[2,0,2,8],[6,0,6,8],[8,0,8,8],[13,0,13,8],[9,0,9,8],[3,0,3,8],[7,0,7,8],[4,0,4,8],[5,0,5,8],[11,0,11,8],[12,0,12,8],[10,0,10,8]]}
["PART 5.F"]
["DRILLING/PLUGGING & ABANDONMENT SUPPLEMENTARY SHEET"]
["Check Event:"]
["1.    The per foot rates encompass all costs associated with drilling or plugging & abandoning of wells, borings, and"]
["       recovery wells with the exceptions of mileage, mob/demob unit price, analysis, and transportation and disposal of cuttings."]
["2.    Depth of (Boring or Well) X Cost Per Foot = Total.",null,null,null,null,null,null,null,null,null,null,null,null,"Chemical Injection"]
["3.    If a boring is converted to a monitoring well, it should be noted on this sheet.  When a boring is converted to a monitoring ",null,null,null,null,null,null,null,null,null,null,null,null,"Boring - Direct Push",1]
["       well, the Department will pay only for the monitoring well cost.",null,null,null,null,null,null,null,null,null,null,null,null,"Boring - Drilling",2]
["4.   Please reduce the applicable cost per foot rate by $15/foot, if soil samples were not taken, prior to calculating the row total",null,null,null,null,null,null,null,null,null,null,null,null,"Montioring Well",3]
["5.   Include drilling logs, well registrations, and plugging and abandonment forms as required.",null,null,null,null,null,null,null,null,null,null,null,null,"Extraction Well"]
["6.   Methods of Plugging and Abandonment Wells (P&A) - In “P&A Wells” column, enter  ",null,null,null,null,null,null,null,null,null,null,null,null,"Hornizontal Recovery Well"]
["                     1      if P&A includes overdrilling of wells  ",null,null,null,null,null,null,null,null,null,null,null,null,"Recovery Well"]
["                     2      if P&A was limited to pulling casing/screen and grouting well ",null,null,null,null,null,null,null,null,null,null,null,null,"Sparge Well"]
["                     3      if well is grouted only",null,null,null,null,null,null,null,null,null,null,null,null,"Temporary Well"]
["7.  If a minimum rate, or per day rate for chemical injection, is being charged, please indicate the number of events next to the"]
["      appropriate activity.  All well/activity information must still be documented, excluding the Cost Per Foot Rate; this includes"]
["     listing the dates of chemical injection events."]
["WELL/BORING\nIDENTIFICATION NUMBER\n(As shown in technical\nreports to DEQ) ","DATE \nOF ACTIVITY","TYPE OF ACTIVITY","RAC\nINVOICE\nNO.","P/A\nWELLS\n(Enter\n1, 2, or 3;\nsee note 6)","WELL\nDIAMETER\n(inches)","DEPTH (in feet)","COST PER\nFOOT\nRATE ","TOTAL"]
[null,null,null,null,null,null,null,null,{"$f":"ROUND((G19*H19),2)","v":0},null,"Emergency/Initial Work   ",false,{"$f":"IF(L19=TRUE,$I$39,\"\")","v":""},"Emergency/Initial Work   ",{"$f":"SUM(M19,M60,M101,M142)","v":0}]
[null,null,null,null,null,null,null,null,{"$f":"ROUND((G20*H20),2)","v":0},null,"Investigation Work      ",false,{"$f":"IF(L20=TRUE,$I$39,\"\")","v":""},"Investigation Work      ",{"$f":"SUM(M20,M61,M102,M143)","v":0}]
[null,null,null,null,null,null,null,null,0,null,"Monitoring/Interim Work    ",false,"","Monitoring/Interim Work    ",{"$f":"SUM(M21,M62,M103,M144)","v":0}]
[null,null,null,null,null,null,null,null,0,null,"Corrective Action Plan Work",false,"","Corrective Action Plan Work",{"$f":"SUM(M22,M63,M104,M145)","v":0}]
[null,null,null,null,null,null,null,null,0]
[null,null,null,null,null,null,null,null,0,null,"Emergency/Initial Work   ",{"$f":"IF(L19=TRUE,1,\"\")","v":""}]
[null,null,null,null,null,null,null,null,0,null,"Investigation Work      ",{"$f":"IF(L20=TRUE,2,\"\")","v":""}]
[null,null,null,null,null,null,null,null,0,null,"Monitoring/Interim Work    ",{"$f":"IF(L21=TRUE,3,\"\")","v":""}]
[null,null,null,null,null,null,null,null,0,null,"Corrective Action Plan Work",{"$f":"IF(L22=TRUE,4,\"\")","v":""}]
[null,null,null,null,null,null,null,null,0]
[null,null,null,null,null,null,null,null,0]
[null,null,null,null,null,null,null,null,0]
[null,null,null,null,null,null,null,null,0]
[null,null,null,null,null,null,null,null,0]
["TYPE OF ACTIVITY",null,null,"LIST # OF EVENTS",null,"MINMUM RATE"]
["DRILLING",null,null,null,null,3360,null,null,{"$f":"D34*F34","v":0}]
["DIRECT PUSH ",null,null,null,null,2700,null,null,{"$f":"D35*F35","v":0}]
["TEMPORARY WELL",null,null,null,null,3000,null,null,{"$f":"D36*F36","v":0}]
["CHEMICAL INJECTION",null,null,null,null,4000,null,null,{"$f":"D37*F37","v":0}]
["PLUGGING AND ABANDONMENT",null,null,null,null,1680,null,null,{"$f":"D38*F38","v":0},null,{"$f":"IF(L19=TRUE,$O$19,IF(L20=TRUE,$O$20,IF(L21=TRUE,$O$21,IF(L22=TRUE,$O$22,0))))","v":0}]
["SUBTOTAL OF THIS PAGE",null,null,null,null,null,null,null,{"$f":"SUM(I19:I38)","v":0}]
["TOTAL DRILLING/P&A COSTS",null,null,null,null,null,null,null,{"$f":"SUM(K38)","v":0},null,{"$f":"IF(I40>0,1,0)","v":0}]
["Page            of              (Drilling/P & A Supplementary Sheet)"]
["PART 5.F"]
["DRILLING/PLUGGING & ABANDONMENT SUPPLEMENTARY SHEET"]
["Check Event:"]
["1.    The per foot rates encompass all costs associated with drilling or plugging & abandoning of wells, borings, and"]
["       recovery wells with the exceptions of mileage, mob/demob unit price, analysis, and transportation and disposal of cuttings."]
["2.    Depth of (Boring or Well) X Cost Per Foot = Total."]
["3.    If a boring is converted to a monitoring well, it should be noted on this sheet.  When a boring is converted to a monitoring "]
["       well, the Department will pay only for the monitoring well cost."]
["4.   Please reduce the applicable cost per foot rate by $15/foot, if soil samples were not taken, prior to calculating the row total"]
["5.   Include drilling logs, well registrations, and plugging and abandonment forms as required."]
["6.   Methods of Plugging and Abandonment Wells (P&A) - In “P&A Wells” column, enter  "]
["                     1      if P&A includes overdrilling of wells  "]
["                     2      if P&A was limited to pulling casing/screen and grouting well "]
["                     3      if well is grouted only"]
["7.  If a minimum rate, or per day rate for chemical injection, is being charged, please indicate the number of events next to the"]
["      appropriate activity.  All well/activity information must still be documented, excluding the Cost Per Foot Rate; this includes"]
["     listing the dates of chemical injection events."]
["WELL/BORING\nIDENTIFICATION NUMBER\n(As shown in technical\nreports to DEQ) ","DATE \nOF ACTIVITY","TYPE OF ACTIVITY","RAC\nINVOICE\nNO.","P/A\nWELLS\n(Enter\n1, 2, or 3;\nsee note 6)","WELL\nDIAMETER\n(inches)","DEPTH (in feet)","COST PER\nFOOT\nRATE ","TOTAL"]
[null,null,null,null,null,null,null,null,{"$f":"ROUND((G60*H60),2)","v":0},null,"Emergency/Initial Work   ",false,{"$f":"IF(L60=TRUE,$I$80,\"\")","v":""},"Emergency/Initial Work   ",{"$f":"SUM(M60,M100,M141,M183)","v":0}]
[null,null,null,null,null,null,null,null,0,null,"Investigation Work      ",false,{"$f":"IF(L61=TRUE,$I$80,\"\")","v":""},"Investigation Work      ",{"$f":"SUM(M61,M101,M142,M184)","v":0}]
[null,null,null,null,null,null,null,null,0,null,"Monitoring/Interim Work    ",false,"","Monitoring/Interim Work    ",{"$f":"SUM(M62,M102,M143,M185)","v":0}]
[null,null,null,null,null,null,null,null,0,null,"Corrective Action Plan Work",false,"","Corrective Action Plan Work",{"$f":"SUM(M63,M103,M144,M186)","v":0}]
[null,null,null,null,null,null,null,null,0]
[null,null,null,null,null,null,null,null,0,null,"Emergency/Initial Work   ",{"$f":"IF(L60=TRUE,1,\"\")","v":""}]
[null,null,null,null,null,null,null,null,0,null,"Investigation Work      ",{"$f":"IF(L61=TRUE,2,\"\")","v":""}]
[null,null,null,null,null,null,null,null,0,null,"Monitoring/Interim Work    ",{"$f":"IF(L62=TRUE,3,\"\")","v":""}]
[null,null,null,null,null,null,null,null,0,null,"Corrective Action Plan Work",{"$f":"IF(L63=TRUE,4,\"\")","v":""}]
[null,null,null,null,null,null,null,null,0]
[null,null,null,null,null,null,null,null,0]
[null,null,null,null,null,null,null,null,0]
[null,null,null,null,null,null,null,null,0]
[null,null,null,null,null,null,null,null,0]
["TYPE OF ACTIVITY",null,null,"LIST # OF EVENTS",null,"MINMUM RATE"]
["DRILLING",null,null,null,null,3360,null,null,{"$f":"D75*F75","v":0}]
["DIRECT PUSH ",null,null,null,null,2700,null,null,{"$f":"D76*F76","v":0}]
["TEMPORARY WELL",null,null,null,null,3000,null,null,{"$f":"D77*F77","v":0}]
["CHEMICAL INJECTION",null,null,null,null,4000,null,null,{"$f":"D78*F78","v":0}]
["PLUGGING AND ABANDONMENT",null,null,null,null,1680,null,null,{"$f":"D79*F79","v":0},null,{"$f":"IF(L60=TRUE,$O$19,IF(L61=TRUE,$O$20,IF(L62=TRUE,$O$21,IF(L63=TRUE,$O$22,0))))","v":0}]
["SUBTOTAL OF THIS PAGE",null,null,null,null,null,null,null,{"$f":"SUM(I60:I79)","v":0}]
["TOTAL DRILLING/P&A COSTS",null,null,null,null,null,null,null,{"$f":"SUM(K79)","v":0},null,{"$f":"IF(I81>0,1,0)","v":0}]
["Page            of              (Drilling/P & A Supplementary Sheet)"]
["PART 5.F"]
["DRILLING/PLUGGING & ABANDONMENT SUPPLEMENTARY SHEET"]
["Check Event:"]
["1.    The per foot rates encompass all costs associated with drilling or plugging & abandoning of wells, borings, and"]
["       recovery wells with the exceptions of mileage, mob/demob unit price, analysis, and transportation and disposal of cuttings."]
["2.    Depth of (Boring or Well) X Cost Per Foot = Total."]
["3.    If a boring is converted to a monitoring well, it should be noted on this sheet.  When a boring is converted to a monitoring "]
["       well, the Department will pay only for the monitoring well cost."]
["4.   Please reduce the applicable cost per foot rate by $15/foot, if soil samples were not taken, prior to calculating the row total"]
["5.   Include drilling logs, well registrations, and plugging and abandonment forms as required."]
["6.   Methods of Plugging and Abandonment Wells (P&A) - In “P&A Wells” column, enter  "]
["                     1      if P&A includes overdrilling of wells  "]
["                     2      if P&A was limited to pulling casing/screen and grouting well "]
["                     3      if well is grouted only"]
["7.  If a minimum rate, or per day rate for chemical injection, is being charged, please indicate the number of events next to the"]
["      appropriate activity.  All well/activity information must still be documented, excluding the Cost Per Foot Rate; this includes"]
["     listing the dates of chemical injection events."]
["WELL/BORING\nIDENTIFICATION NUMBER\n(As shown in technical\nreports to DEQ) ","DATE \nOF ACTIVITY","TYPE OF ACTIVITY","RAC\nINVOICE\nNO.","P/A\nWELLS\n(Enter\n1, 2, or 3;\nsee note 6)","WELL\nDIAMETER\n(inches)","DEPTH (in feet)","COST PER\nFOOT\nRATE ","TOTAL"]
[null,null,null,null,null,null,null,null,{"$f":"ROUND((G101*H101),2)","v":0},null,"Emergency/Initial Work   ",false,{"$f":"IF(L101=TRUE,$I$121,\"\")","v":""},"Emergency/Initial Work   ",{"$f":"SUM(M101,M140,M182,M224)","v":0}]
[null,null,null,null,null,null,null,null,0,null,"Investigation Work      ",false,{"$f":"IF(L102=TRUE,$I$121,\"\")","v":""},"Investigation Work      ",{"$f":"SUM(M102,M141,M183,M225)","v":0}]
[null,null,null,null,null,null,null,null,0,null,"Monitoring/Interim Work    ",false,"","Monitoring/Interim Work    ",{"$f":"SUM(M103,M142,M184,M226)","v":0}]
[null,null,null,null,null,null,null,null,0,null,"Corrective Action Plan Work",false,"","Corrective Action Plan Work",{"$f":"SUM(M104,M143,M185,M227)","v":0}]
[null,null,null,null,null,null,null,null,0]
[null,null,null,null,null,null,null,null,0,null,"Emergency/Initial Work   ",{"$f":"IF(L101=TRUE,1,\"\")","v":""}]
[null,null,null,null,null,null,null,null,0,null,"Investigation Work      ",{"$f":"IF(L102=TRUE,2,\"\")","v":""}]
[null,null,null,null,null,null,null,null,0,null,"Monitoring/Interim Work    ",{"$f":"IF(L103=TRUE,3,\"\")","v":""}]
[null,null,null,null,null,null,null,null,0,null,"Corrective Action Plan Work",{"$f":"IF(L104=TRUE,4,\"\")","v":""}]
[null,null,null,null,null,null,null,null,0]
[null,null,null,null,null,null,null,null,0]
[null,null,null,null,null,null,null,null,0]
[null,null,null,null,null,null,null,null,0]
[null,null,null,null,null,null,null,null,0]
["TYPE OF ACTIVITY",null,null,"LIST # OF EVENTS",null,"MINMUM RATE"]
["DRILLING",null,null,null,null,3360,null,null,{"$f":"D116*F116","v":0}]
["DIRECT PUSH ",null,null,null,null,2700,null,null,{"$f":"D117*F117","v":0}]
["TEMPORARY WELL",null,null,null,null,3000,null,null,{"$f":"D118*F118","v":0}]
["CHEMICAL INJECTION",null,null,null,null,4000,null,null,{"$f":"D119*F119","v":0}]
["PLUGGING AND ABANDONMENT",null,null,null,null,1680,null,null,{"$f":"D120*F120","v":0},null,{"$f":"IF(L101=TRUE,$O$19,IF(L102=TRUE,$O$20,IF(L103=TRUE,$O$21,IF(L104=TRUE,$O$22,0))))","v":0}]
["SUBTOTAL OF THIS PAGE",null,null,null,null,null,null,null,{"$f":"SUM(I101:I120)","v":0}]
["TOTAL DRILLING/P&A COSTS",null,null,null,null,null,null,null,{"$f":"SUM(K120)","v":0},null,{"$f":"IF(I122>0,1,0)","v":0}]
["Page            of              (Drilling/P & A Supplementary Sheet)"]
["PART 5.F"]
["DRILLING/PLUGGING & ABANDONMENT SUPPLEMENTARY SHEET"]
["Check Event:"]
["1.    The per foot rates encompass all costs associated with drilling or plugging & abandoning of wells, borings, and"]
["       recovery wells with the exceptions of mileage, mob/demob unit price, analysis, and transportation and disposal of cuttings."]
["2.    Depth of (Boring or Well) X Cost Per Foot = Total."]
["3.    If a boring is converted to a monitoring well, it should be noted on this sheet.  When a boring is converted to a monitoring "]
["       well, the Department will pay only for the monitoring well cost."]
["4.   Please reduce the applicable cost per foot rate by $15/foot, if soil samples were not taken, prior to calculating the row total"]
["5.   Include drilling logs, well registrations, and plugging and abandonment forms as required."]
["6.   Methods of Plugging and Abandonment Wells (P&A) - In “P&A Wells” column, enter  "]
["                     1      if P&A includes overdrilling of wells  "]
["                     2      if P&A was limited to pulling casing/screen and grouting well "]
["                     3      if well is grouted only"]
["7.  If a minimum rate, or per day rate for chemical injection, is being charged, please indicate the number of events next to the"]
["      appropriate activity.  All well/activity information must still be documented, excluding the Cost Per Foot Rate; this includes"]
["     listing the dates of chemical injection events."]
["WELL/BORING\nIDENTIFICATION NUMBER\n(As shown in technical\nreports to DEQ) ","DATE \nOF ACTIVITY","TYPE OF ACTIVITY","RAC\nINVOICE\nNO.","P/A\nWELLS\n(Enter\n1, 2, or 3;\nsee note 6)","WELL\nDIAMETER\n(inches)","DEPTH (in feet)","COST PER\nFOOT\nRATE ","TOTAL"]
[null,null,null,null,null,null,null,null,{"$f":"ROUND((G142*H142),2)","v":0},null,"Emergency/Initial Work   ",false,{"$f":"IF(L142=TRUE,$I$162,\"\")","v":""},"Emergency/Initial Work   ",{"$f":"SUM(M142,M181,M223,M265)","v":0}]
[null,null,null,null,null,null,null,null,0,null,"Investigation Work      ",false,{"$f":"IF(L143=TRUE,$I$162,\"\")","v":""},"Investigation Work      ",{"$f":"SUM(M143,M182,M224,M266)","v":0}]
[null,null,null,null,null,null,null,null,0,null,"Monitoring/Interim Work    ",false,"","Monitoring/Interim Work    ",{"$f":"SUM(M144,M183,M225,M267)","v":0}]
[null,null,null,null,null,null,null,null,0,null,"Corrective Action Plan Work",false,"","Corrective Action Plan Work",{"$f":"SUM(M145,M184,M226,M268)","v":0}]
[null,null,null,null,null,null,null,null,0]
[null,null,null,null,null,null,null,null,0,null,"Emergency/Initial Work   ",{"$f":"IF(L142=TRUE,1,\"\")","v":""}]
[null,null,null,null,null,null,null,null,0,null,"Investigation Work      ",{"$f":"IF(L143=TRUE,2,\"\")","v":""}]
[null,null,null,null,null,null,null,null,0,null,"Monitoring/Interim Work    ",{"$f":"IF(L144=TRUE,3,\"\")","v":""}]
[null,null,null,null,null,null,null,null,0,null,"Corrective Action Plan Work",{"$f":"IF(L145=TRUE,4,\"\")","v":""}]
[null,null,null,null,null,null,null,null,0]
[null,null,null,null,null,null,null,null,0]
[null,null,null,null,null,null,null,null,0]
[null,null,null,null,null,null,null,null,0]
[null,null,null,null,null,null,null,null,0]
["TYPE OF ACTIVITY",null,null,"LIST # OF EVENTS",null,"MINMUM RATE"]
["DRILLING",null,null,null,null,3360,null,null,{"$f":"D157*F157","v":0}]
["DIRECT PUSH ",null,null,null,null,2700,null,null,{"$f":"D158*F158","v":0}]
["TEMPORARY WELL",null,null,null,null,3000,null,null,{"$f":"D159*F159","v":0}]
["CHEMICAL INJECTION",null,null,null,null,4000,null,null,{"$f":"D160*F160","v":0}]
["PLUGGING AND ABANDONMENT",null,null,null,null,1680,null,null,{"$f":"D161*F161","v":0},null,{"$f":"IF(L142=TRUE,$O$19,IF(L143=TRUE,$O$20,IF(L144=TRUE,$O$21,IF(L145=TRUE,$O$22,0))))","v":0}]
["SUBTOTAL OF THIS PAGE",null,null,null,null,null,null,null,{"$f":"SUM(I142:I161)","v":0}]
["TOTAL DRILLING/P&A COSTS",null,null,null,null,null,null,null,{"$f":"SUM(K161)","v":0},null,{"$f":"IF(I163>0,1,0)","v":0}]
["Page            of              (Drilling/P & A Supplementary Sheet)"]

{"sheet":"Analysis","index":14,"n_rows":167,"n_cols":17,"rows_kept":167,"cut":false,"hidden":false,"merged":[[158,0,158,7],[166,0,166,7],[164,0,164,5],[164,6,164,7],[165,0,165,5],[165,6,165,7],[133,0,133,7],[134,0,134,7],[135,0,135,7],[136,0,136,7],[137,0,137,7],[129,0,129,7],[130,0,130,7],[131,0,131,7],[132,0,132,7],[124,0,124,7],[126,0,126,7],[127,0,127,7],[128,0,128,7],[94,0,94,7],[95,0,95,7],[122,0,122,5],[122,6,122,7],[123,0,123,5],[123,6,123,7],[116,0,116,7],[89,0,89,7],[90,0,90,7],[91,0,91,7],[92,0,92,7],[93,0,93,7],[85,0,85,7],[86,0,86,7],[87,0,87,7],[88,0,88,7],[81,0,81,5],[81,6,81,7],[82,0,82,7],[84,0,84,7],[50,0,50,7],[51,0,51,7],[52,0,52,7],[53,0,53,7],[80,0,80,5],[80,6,80,7],[74,0,74,7],[45,0,45,7],[46,0,46,7],[47,0,47,7],[48,0,48,7],[49,0,49,7],[3,0,3,7],[0,0,0,7],[1,0,1,7],[2,0,2,7],[38,0,38,5],[38,6,38,7],[7,0,7,7],[8,0,8,7],[11,0,11,7],[4,0,4,7],[5,0,5,7],[6,0,6,7],[9,0,9,7],[10,0,10,7],[32,0,32,7],[40,0,40,7],[42,0,42,7],[43,0,43,7],[44,0,44,7],[39,0,39,5],[39,6,39,7]]}
["PART 5.G"]
["ANALYSIS SUPPLEMENTARY SHEET"]
["Check Event:"]
[]
["1.    Do not address RAC markups on this sheet.  RAC markups should be shown on the Miscellaneous Supplementary Sheet."]
["2.    Charges for analyzing samples will only be reimbursed at the intervals required by DEQ.",null,null,null,null,null,null,null,null,null,null,null,null,null,null,"Atterberg Limits (LL, PLI, PI)",56]
["3.    If the owner is directly billed for analysis, no markup allowed.",null,null,null,null,null,null,null,null,null,null,null,null,null,null,"BTEX",55]
["4.   Rush charges assessed by the laboratory to analyze a sample will not be paid when not required by DEQ.",null,null,null,null,null,null,null,null,null,null,null,null,null,null,"BTEX/MTBE",84]
["5.   (No. of Test) X (Cost Per Test) = Total",null,null,null,null,null,null,null,null,"SOIL",null,null,null,null,null,"BTEX/TPH-G",70]
["6.   See Appendix B, Table 4 of the Trust Fund Cost Control Guidance Document for rates",null,null,null,null,null,null,null,null,"WATER",null,null,null,null,null,"Dry Density-Calculated/Unit Weight Determination",22.5]
["7.   Purchase of sampling equipment (EnCores, preserved vials, etc.) should be addressed on the Part 5.H (1).",null,null,null,null,null,null,null,null,"AIR",null,null,null,null,null,"EPH Analysis",160]
[null,null,null,null,null,null,null,null,null,null,null,null,null,null,null,"Fractional Organic Carbon",45]
["RAC\nINVOICE\nNO.","LAB INVOICE NUMBER","PARAMETER\n(Ex.:  BTEX, TPH-G, etc.)","METHOD USED","MEDIUM ANALYZED","NO. OF TESTS","COST PER\nTEST","TOTAL",null,null,"total",null,"Sheet total",null,null,"Hydraulic Conductivity - Constant Head",168]
[null,null,null,null,null,null,{"$f":"IF(C14>0,VLOOKUP(C14,$P$6:$Q$35,2,FALSE),\"\")","v":""},{"$f":"ROUND(IF(C14>0,(F14*G14),0),2)","v":0},"Emergency/Initial Work   ",false,{"$f":"IF(J14=TRUE,$G$39,\"\")","v":""},"Emergency/Initial Work   ",{"$f":"SUM(K14,K56,K98,K140)","v":0},null,null,"Hydraulic Conductivity - Falling Head",313.5]
[null,null,null,null,null,null,"",{"$f":"ROUND(IF(C15>0,(F15*G15),0),2)","v":0},"Investigation Work      ",false,{"$f":"IF(J15=TRUE,$G$39,\"\")","v":""},"Investigation Work      ",{"$f":"SUM(K15,K57,K99,K141)","v":0},null,null,"Lead",27]
[null,null,null,null,null,null,"",0,"Monitoring/Interim Work    ",false,"","Monitoring/Interim Work    ",{"$f":"SUM(K16,K58,K100,K142)","v":0},null,null,"Moisture Content",8]
[null,null,null,null,null,null,"",0,"Corrective Action Plan Work",false,"","Corrective Action Plan Work",{"$f":"SUM(K17,K59,K101,K143)","v":0},null,null,"MTBE",84]
[null,null,null,null,null,null,"",0,null,null,null,null,null,null,null,"Organic matter",45]
[null,null,null,null,null,null,"",0,"Emergency/Initial Work   ",{"$f":"IF(J14=TRUE,1,\"\")","v":""},null,null,null,null,null,"PAH",135]
[null,null,null,null,null,null,"",0,"Investigation Work      ",{"$f":"IF(J15=TRUE,2,\"\")","v":""},null,null,null,null,null,"Particle Size Analysis – Hydrometer",106.5]
[null,null,null,null,null,null,"",0,"Monitoring/Interim Work    ",{"$f":"IF(J16=TRUE,3,\"\")","v":""},null,null,null,null,null,"Particle Size Analysis – Sieve",56]
[null,null,null,null,null,null,"",0,"Corrective Action Plan Work",{"$f":"IF(J17=TRUE,4,\"\")","v":""},null,null,null,null,null,"RCRA Metals",135]
[null,null,null,null,null,null,"",0,null,null,null,null,null,null,null,"Soil pH",28]
[null,null,null,null,null,null,"",0,null,null,null,null,null,null,null,"Specific Gravity",100]
[null,null,null,null,null,null,"",0,null,null,null,null,null,null,null,"SPLP Analysis",40]
[null,null,null,null,null,null,"",0,null,null,null,null,null,null,null,"TCLP",40]
[null,null,null,null,null,null,"",0,null,null,null,null,null,null,null,"TOC",30]
[null,null,null,null,null,null,"",0,null,null,null,null,null,null,null,"Total Porosity - Calculated",62]
[null,null,null,null,null,null,"",0,null,null,null,null,null,null,null,"TPH-D (RECAP DRO)",65]
[null,null,null,null,null,null,"",0,null,null,null,null,null,null,null,"TPH-G (RECAP GRO)",45]
[null,null,null,null,null,null,"",0,null,null,null,null,null,null,null,"TPH-O",65]
[null,null,null,null,null,null,"",0,null,null,null,null,null,null,null,"Triaxial Permeability - Falling Head",313.5]
["USE SPACE BELOW FOR PARAMETERS/METHODS/RATES NOT LISTED/POPULATED ABOVE",null,null,null,null,null,null,null,null,null,null,null,null,null,null,"Unified Soil Classification System",45]
[null,null,null,null,null,null,null,{"$f":"ROUND(IF(C34>0,(F34*G34),0),2)","v":0},null,null,null,null,null,null,null,"Volumetric Content",8]
[null,null,null,null,null,null,null,{"$f":"ROUND(IF(C35>0,(F35*G35),0),2)","v":0},null,null,null,null,null,null,null,"VPH Analysis (TPH-G Fractions)",135]
[null,null,null,null,null,null,null,0]
[null,null,null,null,null,null,null,0]
[null,null,null,null,null,null,null,0,{"$f":"IF(J14=TRUE,$M$14,IF(J15=TRUE,$M$15,IF(J16=TRUE,$M$16,IF(J17=TRUE,$M$17,0))))","v":0}]
["SUBTOTAL OF THIS PAGE",null,null,null,null,null,{"$f":"SUM(H14:H38)","v":0}]
["TOTAL ANALYSIS COSTS",null,null,null,null,null,{"$f":"SUM(I38)","v":0},null,{"$f":"IF(G40>0,1,0)","v":0}]
["Page               of                    (Analysis Supplementary Sheet)"]
[]
["PART 5.G"]
["ANALYSIS SUPPLEMENTARY SHEET"]
["Check Event:"]
[]
["1.    Do not address RAC markups on this sheet.  RAC markups should be shown on the Miscellaneous Supplementary Sheet."]
["2.    Charges for analyzing samples will only be reimbursed at the intervals required by DEQ."]
["3.    If the owner is directly billed for analysis, no markup allowed."]
["4.   Rush charges assessed by the laboratory to analyze a sample will not be paid when not required by DEQ."]
["5.   (No. of Test) X (Cost Per Test) = Total"]
["6.   See Appendix B, Table 4 of the Trust Fund Cost Control Guidance Document for rates"]
["7.   Purchase of sampling equipment (EnCores, preserved vials, etc.) should be addressed on the Part 5.H (1)."]
[]
["RAC\nINVOICE\nNO.","LAB INVOICE NUMBER","PARAMETER\n(Ex:  BTEX, TPH-G, etc.)","METHOD USED","MEDIUM ANALYZED","NO. OF TESTS","COST PER\nTEST","TOTAL",null,null,"total"]
[null,null,null,null,null,null,{"$f":"IF(C56>0,VLOOKUP(C56,$P$6:$Q$35,2,FALSE),\"\")","v":""},{"$f":"ROUND(IF(C56>0,(F56*G56),0),2)","v":0},"Emergency/Initial Work   ",false,{"$f":"IF(J56=TRUE,$G$81,\"\")","v":""}]
[null,null,null,null,null,null,"",0,"Investigation Work      ",false,{"$f":"IF(J57=TRUE,$G$81,\"\")","v":""}]
[null,null,null,null,null,null,"",0,"Monitoring/Interim Work    ",false,""]
[null,null,null,null,null,null,"",0,"Corrective Action Plan Work",false,""]
[null,null,null,null,null,null,"",0]
[null,null,null,null,null,null,"",0,"Emergency/Initial Work   ",{"$f":"IF(J56=TRUE,1,\"\")","v":""}]
[null,null,null,null,null,null,"",0,"Investigation Work      ",{"$f":"IF(J57=TRUE,2,\"\")","v":""}]
[null,null,null,null,null,null,"",0,"Monitoring/Interim Work    ",{"$f":"IF(J58=TRUE,3,\"\")","v":""}]
[null,null,null,null,null,null,"",0,"Corrective Action Plan Work",{"$f":"IF(J59=TRUE,4,\"\")","v":""}]
[null,null,null,null,null,null,"",0]
[null,null,null,null,null,null,"",0]
[null,null,null,null,null,null,"",0]
[null,null,null,null,null,null,"",0]
[null,null,null,null,null,null,"",0]
[null,null,null,null,null,null,"",0]
[null,null,null,null,null,null,"",0]
[null,null,null,null,null,null,"",0]
[null,null,null,null,null,null,"",0]
[null,null,null,null,null,null,"",0]
["USE SPACE BELOW FOR PARAMETERS/METHODS/RATES NOT LISTED/POPULATED ABOVE"]
[null,null,null,null,null,null,null,{"$f":"ROUND(IF(C76>0,(F76*G76),0),2)","v":0}]
[null,null,null,null,null,null,null,0]
[null,null,null,null,null,null,null,0]
[null,null,null,null,null,null,null,0]
[null,null,null,null,null,null,null,0,{"$f":"IF(J56=TRUE,$M$14,IF(J57=TRUE,$M$15,IF(J58=TRUE,$M$16,IF(J59=TRUE,$M$17,0))))","v":0}]
["SUBTOTAL OF THIS PAGE",null,null,null,null,null,{"$f":"SUM(H56:H80)","v":0}]
["TOTAL ANALYSIS COSTS",null,null,null,null,null,{"$f":"SUM(I80)","v":0},null,{"$f":"IF(G82>0,1,0)","v":0}]
["Page               of                    (Analysis Supplementary Sheet)"]
[]
["PART 5.G"]
["ANALYSIS SUPPLEMENTARY SHEET"]
["Check Event:"]
[]
["1.    Do not address RAC markups on this sheet.  RAC markups should be shown on the Miscellaneous Supplementary Sheet."]
["2.    Charges for analyzing samples will only be reimbursed at the intervals required by DEQ."]
["3.    If the owner is directly billed for analysis, no markup allowed."]
["4.   Rush charges assessed by the laboratory to analyze a sample will not be paid when not required by DEQ."]
["5.   (No. of Test) X (Cost Per Test) = Total"]
["6.   See Appendix B, Table 4 of the Trust Fund Cost Control Guidance Document for rates"]
["7.   Purchase of sampling equipment (EnCores, preserved vials, etc.) should be addressed on the Part 5.H (1)."]
[]
["RAC\nINVOICE\nNO.","LAB INVOICE NUMBER","PARAMETER\n(Ex.:  BTEX, TPH-G, etc.)","METHOD USED","MEDIUM ANALYZED","NO. OF TESTS","COST PER\nTEST","TOTAL",null,null,"total"]
[null,null,null,null,null,null,{"$f":"IF(C98>0,VLOOKUP(C98,$P$6:$Q$35,2,FALSE),\"\")","v":""},{"$f":"ROUND(IF(C98>0,(F98*G98),0),2)","v":0},"Emergency/Initial Work   ",false,{"$f":"IF(J98=TRUE,$G$123,\"\")","v":""}]
[null,null,null,null,null,null,"",0,"Investigation Work      ",false,{"$f":"IF(J99=TRUE,$G$123,\"\")","v":""}]
[null,null,null,null,null,null,"",0,"Monitoring/Interim Work    ",false,""]
[null,null,null,null,null,null,"",0,"Corrective Action Plan Work",false,""]
[null,null,null,null,null,null,"",0]
[null,null,null,null,null,null,"",0,"Emergency/Initial Work   ",{"$f":"IF(J98=TRUE,1,\"\")","v":""}]
[null,null,null,null,null,null,"",0,"Investigation Work      ",{"$f":"IF(J99=TRUE,2,\"\")","v":""}]
[null,null,null,null,null,null,"",0,"Monitoring/Interim Work    ",{"$f":"IF(J100=TRUE,3,\"\")","v":""}]
[null,null,null,null,null,null,"",0,"Corrective Action Plan Work",{"$f":"IF(J101=TRUE,4,\"\")","v":""}]
[null,null,null,null,null,null,"",0]
[null,null,null,null,null,null,"",0]
[null,null,null,null,null,null,"",0]
[null,null,null,null,null,null,"",0]
[null,null,null,null,null,null,"",0]
[null,null,null,null,null,null,"",0]
[null,null,null,null,null,null,"",0]
[null,null,null,null,null,null,"",0]
[null,null,null,null,null,null,"",0]
[null,null,null,null,null,null,"",0]
["USE SPACE BELOW FOR PARAMETERS/METHODS/RATES NOT LISTED/POPULATED ABOVE"]
[null,null,null,null,null,null,null,{"$f":"ROUND(IF(C118>0,(F118*G118),0),2)","v":0}]
[null,null,null,null,null,null,null,0]
[null,null,null,null,null,null,null,0]
[null,null,null,null,null,null,null,0]
[null,null,null,null,null,null,null,0,{"$f":"IF(J98=TRUE,$M$14,IF(J99=TRUE,$M$15,IF(J100=TRUE,$M$16,IF(J101=TRUE,$M$17,0))))","v":0}]
["SUBTOTAL OF THIS PAGE",null,null,null,null,null,{"$f":"SUM(H98:H122)","v":0}]
["TOTAL ANALYSIS COSTS",null,null,null,null,null,{"$f":"SUM(I122)","v":0},null,{"$f":"IF(G124>0,1,0)","v":0}]
["Page               of                    (Analysis Supplementary Sheet)"]
[]
["PART 5.G"]
["ANALYSIS SUPPLEMENTARY SHEET"]
["Check Event:"]
[]
["1.    Do not address RAC markups on this sheet.  RAC markups should be shown on the Miscellaneous Supplementary Sheet."]
["2.    Charges for analyzing samples will only be reimbursed at the intervals required by DEQ."]
["3.    If the owner is directly billed for analysis, no markup allowed."]
["4.   Rush charges assessed by the laboratory to analyze a sample will not be paid when not required by DEQ."]
["5.   (No. of Test) X (Cost Per Test) = Total"]
["6.   See Appendix B, Table 4 of the Trust Fund Cost Control Guidance Document for rates"]
["7.   Purchase of sampling equipment (EnCores, preserved vials, etc.) should be addressed on the Part 5.H (1)."]
[]
["RAC\nINVOICE\nNO.","LAB INVOICE NUMBER","PARAMETER\n(Ex.:  BTEX, TPH-G, etc.)","METHOD USED","MEDIUM ANALYZED","NO. OF TESTS","COST PER\nTEST","TOTAL",null,null,"total"]
[null,null,null,null,null,null,{"$f":"IF(C140>0,VLOOKUP(C140,$P$6:$Q$35,2,FALSE),\"\")","v":""},{"$f":"ROUND(IF(C140>0,(F140*G140),0),2)","v":0},"Emergency/Initial Work   ",false,{"$f":"IF(J140=TRUE,$G$165,\"\")","v":""}]
[null,null,null,null,null,null,"",0,"Investigation Work      ",false,{"$f":"IF(J141=TRUE,$G$165,\"\")","v":""}]
[null,null,null,null,null,null,"",0,"Monitoring/Interim Work    ",false,""]
[null,null,null,null,null,null,"",0,"Corrective Action Plan Work",false,""]
[null,null,null,null,null,null,"",0]
[null,null,null,null,null,null,"",0,"Emergency/Initial Work   ",{"$f":"IF(J140=TRUE,1,\"\")","v":""}]
[null,null,null,null,null,null,"",0,"Investigation Work      ",{"$f":"IF(J141=TRUE,2,\"\")","v":""}]
[null,null,null,null,null,null,"",0,"Monitoring/Interim Work    ",{"$f":"IF(J142=TRUE,3,\"\")","v":""}]
[null,null,null,null,null,null,"",0,"Corrective Action Plan Work",{"$f":"IF(J143=TRUE,4,\"\")","v":""}]
[null,null,null,null,null,null,"",0]
[null,null,null,null,null,null,"",0]
[null,null,null,null,null,null,"",0]
[null,null,null,null,null,null,"",0]
[null,null,null,null,null,null,"",0]
[null,null,null,null,null,null,"",0]
[null,null,null,null,null,null,"",0]
[null,null,null,null,null,null,"",0]
[null,null,null,null,null,null,"",0]
[null,null,null,null,null,null,"",0]
["USE SPACE BELOW FOR PARAMETERS/METHODS/RATES NOT LISTED/POPULATED ABOVE"]
[null,null,null,null,null,null,null,{"$f":"ROUND(IF(C160>0,(F160*G160),0),2)","v":0}]
[null,null,null,null,null,null,null,0]
[null,null,null,null,null,null,null,0]
[null,null,null,null,null,null,null,0]
[null,null,null,null,null,null,null,0,{"$f":"IF(J140=TRUE,$M$14,IF(J141=TRUE,$M$15,IF(J142=TRUE,$M$16,IF(J143=TRUE,$M$17,0))))","v":0}]
["SUBTOTAL OF THIS PAGE",null,null,null,null,null,{"$f":"SUM(H140:H164)","v":0}]
["TOTAL ANALYSIS COSTS",null,null,null,null,null,{"$f":"SUM(I164)","v":0},null,{"$f":"IF(G166>0,1,0)","v":0}]
["Page               of                    (Analysis Supplementary Sheet)"]

{"sheet":"Miscellaneous 1","index":15,"n_rows":252,"n_cols":19,"rows_kept":252,"cut":false,"hidden":false,"merged":[[229,3,229,4],[230,3,230,4],[231,3,231,4],[232,3,232,4],[233,3,233,4],[234,3,234,4],[235,3,235,4],[236,3,236,4],[237,3,237,4],[251,0,251,2],[238,3,238,4],[239,3,239,4],[240,3,240,4],[241,3,241,4],[242,3,242,4],[243,3,243,4],[244,3,244,4],[245,3,245,4],[246,3,246,4],[250,0,250,2],[250,3,250,4],[247,3,247,4],[248,3,248,4],[249,0,249,2],[249,3,249,4],[226,3,226,4],[227,3,227,4],[228,3,228,4],[210,0,210,4],[211,0,211,4],[212,0,212,4],[213,0,213,4],[215,0,215,4],[216,0,216,4],[217,0,217,4],[218,0,218,4],[219,3,219,4],[220,3,220,4],[221,3,221,4],[222,3,222,4],[223,3,223,4],[224,3,224,4],[225,3,225,4],[204,3,204,4],[206,3,206,4],[207,0,207,2],[207,3,207,4],[209,0,209,2],[199,3,199,4],[200,3,200,4],[201,3,201,4],[202,3,202,4],[203,3,203,4],[208,0,208,2],[208,3,208,4],[205,3,205,4],[194,3,194,4],[195,3,195,4],[196,3,196,4],[197,3,197,4],[198,3,198,4],[189,3,189,4],[190,3,190,4],[191,3,191,4],[192,3,192,4],[193,3,193,4],[184,3,184,4],[185,3,185,4],[186,3,186,4],[187,3,187,4],[188,3,188,4],[179,3,179,4],[180,3,180,4],[181,3,181,4],[182,3,182,4],[183,3,183,4],[174,0,174,4],[175,0,175,4],[176,0,176,4],[177,3,177,4],[178,3,178,4],[168,0,168,4],[169,0,169,4],[170,0,170,4],[171,0,171,4],[173,0,173,4],[162,3,162,4],[164,3,164,4],[165,0,165,2],[165,3,165,4],[167,0,167,2],[157,3,157,4],[158,3,158,4],[159,3,159,4],[160,3,160,4],[161,3,161,4],[163,3,163,4],[152,3,152,4],[153,3,153,4],[154,3,154,4],[155,3,155,4],[156,3,156,4],[147,3,147,4],[148,3,148,4],[149,3,149,4],[150,3,150,4],[151,3,151,4],[142,3,142,4],[143,3,143,4],[144,3,144,4],[145,3,145,4],[146,3,146,4],[137,3,137,4],[138,3,138,4],[139,3,139,4],[140,3,140,4],[141,3,141,4],[132,0,132,4],[133,0,133,4],[134,0,134,4],[135,3,135,4],[136,3,136,4],[126,0,126,4],[127,0,127,4],[128,0,128,4],[129,0,129,4],[131,0,131,4],[120,3,120,4],[122,3,122,4],[123,0,123,2],[123,3,123,4],[125,0,125,2],[115,3,115,4],[116,3,116,4],[117,3,117,4],[118,3,118,4],[119,3,119,4],[121,3,121,4],[110,3,110,4],[111,3,111,4],[112,3,112,4],[113,3,113,4],[114,3,114,4],[105,3,105,4],[106,3,106,4],[107,3,107,4],[108,3,108,4],[109,3,109,4],[100,3,100,4],[101,3,101,4],[102,3,102,4],[103,3,103,4],[104,3,104,4],[95,3,95,4],[96,3,96,4],[97,3,97,4],[98,3,98,4],[99,3,99,4],[90,0,90,4],[91,0,91,4],[92,0,92,4],[93,3,93,4],[94,3,94,4],[84,0,84,4],[85,0,85,4],[86,0,86,4],[87,0,87,4],[89,0,89,4],[79,3,79,4],[80,3,80,4],[81,0,81,2],[81,3,81,4],[83,0,83,2],[73,3,73,4],[74,3,74,4],[75,3,75,4],[76,3,76,4],[77,3,77,4],[78,3,78,4],[68,3,68,4],[69,3,69,4],[70,3,70,4],[71,3,71,4],[72,3,72,4],[63,3,63,4],[64,3,64,4],[65,3,65,4],[66,3,66,4],[67,3,67,4],[58,3,58,4],[59,3,59,4],[60,3,60,4],[61,3,61,4],[62,3,62,4],[53,3,53,4],[54,3,54,4],[55,3,55,4],[56,3,56,4],[57,3,57,4],[12,3,12,4],[14,3,14,4],[48,0,48,4],[49,0,49,4],[50,0,50,4],[51,3,51,4],[52,3,52,4],[42,0,42,4],[43,0,43,4],[44,0,44,4],[45,0,45,4],[47,0,47,4],[37,3,37,4],[33,3,33,4],[39,3,39,4],[34,3,34,4],[35,3,35,4],[36,3,36,4],[38,3,38,4],[28,3,28,4],[29,3,29,4],[30,3,30,4],[31,3,31,4],[32,3,32,4],[0,0,0,4],[1,0,1,4],[2,0,2,4],[3,0,3,4],[5,0,5,4],[9,3,9,4],[6,0,6,4],[10,3,10,4],[11,3,11,4],[7,0,7,4],[8,0,8,4],[40,0,40,2],[40,3,40,4],[82,0,82,2],[82,3,82,4],[124,0,124,2],[124,3,124,4],[166,0,166,2],[166,3,166,4],[13,3,13,4],[19,3,19,4],[15,3,15,4],[16,3,16,4],[17,3,17,4],[18,3,18,4],[23,3,23,4],[24,3,24,4],[25,3,25,4],[26,3,26,4],[27,3,27,4],[41,0,41,2],[39,0,39,2],[20,3,20,4],[21,3,21,4],[22,3,22,4]]}
["PART 5.H (1)"]
["MISCELLANEOUS SUPPLEMENTARY SHEET"]
["Check Event:"]
[]
[]
["1. All costs not associated with the previous categories should be listed here. (Ex.: utility charges, DOTD or DNR permits/maps,"]
["    DEQ permits, surveying charges, subcontracted drafting charges, purchases of supplies, disposal of sampling kits and bailing kits)"]
["2. Miscellaneous charges for work activities addressed in unit pricing should not be addressed on this form."]
["3. All markups allowed to the RAC should be identified on this sheet."]
["DESCRIPTION OF EACH\nMISCELLANEOUS ITEM AND NO. OF\nITEMS","RAC\nINVOICE NO.","OUTSIDE\nINVOICE\nNO.","COST",null,null,null,null,"TOTAL",null,"Sheet total"]
[null,null,null,null,null,null,"Emergency/Initial Work   ",false,{"$f":"IF(H11=TRUE,$D$40,\"\")","v":""},"Emergency/Initial Work   ",{"$f":"SUM(I11,I53,I95,I137,I179,I221)","v":0},null,null,null,null,null,null,null,{"$f":"IF(H11=TRUE,1,\"\")","v":""}]
[null,null,null,null,null,null,"Investigation Work      ",false,{"$f":"IF(H12=TRUE,$D$40,\"\")","v":""},"Investigation Work      ",{"$f":"SUM(I12,I54,I96,I138,I180,I222)","v":0},null,null,null,null,null,null,null,{"$f":"IF(H12=TRUE,2,\"\")","v":""}]
[null,null,null,null,null,null,"Monitoring/Interim Work        ",false,"","Monitoring/Interim Work        ",{"$f":"SUM(I13,I55,I97,I139,I181,I223)","v":0},null,null,null,null,null,null,null,{"$f":"IF(H13=TRUE,3,\"\")","v":""}]
[null,null,null,null,null,null,"Corrective Action Plan Work",false,"","Corrective Action Plan Work",{"$f":"SUM(I14,I56,I98,I140,I182,I224)","v":0},null,null,null,null,null,null,null,{"$f":"IF(H14=TRUE,4,\"\")","v":""}]
[null,null,null,null,null,null,"Report Preparation ",false,"","Report Preparation ",{"$f":"SUM(I15,I57,I99,I141,I183,I225)","v":0},null,null,null,null,null,null,null,{"$f":"IF(H15=TRUE,5,\"\")","v":""}]
[]
[]
[null,null,null,null,null,null,"MIS 2","box 1-4","box 5-8","box8-12","box13-16",null,"MIS 2"]
[null,null,null,null,null,null,"Emergency/Initial Work   ",{"$f":"'Miscellaneous 2'!K9","v":false},{"$f":"'Miscellaneous 2'!K59","v":false},{"$f":"'Miscellaneous 2'!K109","v":false},{"$f":"'Miscellaneous 2'!K159","v":false},null,"Emergency/Initial Work   ",{"$f":"IF(H19=FALSE,0,1)","v":0},{"$f":"IF(I19=FALSE,0,1)","v":0},0,0,{"$f":"SUM(N19:Q19)","v":0}]
[null,null,null,null,null,null,"Investigation Work      ",{"$f":"'Miscellaneous 2'!K10","v":false},{"$f":"'Miscellaneous 2'!K60","v":false},{"$f":"'Miscellaneous 2'!K110","v":false},{"$f":"'Miscellaneous 2'!K160","v":false},null,"Investigation Work      ",{"$f":"IF(H20=FALSE,0,1)","v":0},{"$f":"IF(I20=FALSE,0,1)","v":0},{"$f":"IF(J20=FALSE,0,1)","v":0},{"$f":"IF(K20=FALSE,0,1)","v":0},{"$f":"SUM(N20:Q20)","v":0}]
[null,null,null,null,null,null,"Monitoring/Interim Work        ",{"$f":"'Miscellaneous 2'!K11","v":false},{"$f":"'Miscellaneous 2'!K61","v":false},{"$f":"'Miscellaneous 2'!K111","v":false},{"$f":"'Miscellaneous 2'!K161","v":false},null,"Monitoring/Interim Work        ",0,0,0,0,0]
[null,null,null,null,null,null,"Corrective Action Plan Work",{"$f":"'Miscellaneous 2'!K12","v":false},{"$f":"'Miscellaneous 2'!K62","v":false},{"$f":"'Miscellaneous 2'!K112","v":false},{"$f":"'Miscellaneous 2'!K162","v":false},null,"Corrective Action Plan Work",0,0,0,0,0]
[]
[null,null,null,null,null,null,"MIS3","box 1-5","box 6-10","box11-15","box16-20","box20-25","MIS3"]
[null,null,null,null,null,null,"Emergency/Initial Work   ",{"$f":"'Miscellaneous 2'!K18","v":false},{"$f":"'Miscellaneous 2'!L18","v":false},{"$f":"'Miscellaneous 2'!M18","v":false},{"$f":"'Miscellaneous 2'!N18","v":false},{"$f":"'Miscellaneous 2'!O18","v":false},"Emergency/Initial Work   ",{"$f":"IF(H25=FALSE,0,1)","v":0},{"$f":"IF(I25=FALSE,0,1)","v":0},0,0,{"$f":"SUM(N25:Q25)","v":0}]
[null,null,null,null,null,null,"Investigation Work      ",{"$f":"'Miscellaneous 2'!K19","v":false},{"$f":"'Miscellaneous 2'!L19","v":false},{"$f":"'Miscellaneous 2'!M19","v":false},{"$f":"'Miscellaneous 2'!N19","v":false},{"$f":"'Miscellaneous 2'!O19","v":false},"Investigation Work      ",{"$f":"IF(H26=FALSE,0,1)","v":0},0,0,0,{"$f":"SUM(N26:Q26)","v":0}]
[null,null,null,null,null,null,"Monitoring/Interim Work        ",{"$f":"'Miscellaneous 2'!K20","v":false},{"$f":"'Miscellaneous 2'!L20","v":false},{"$f":"'Miscellaneous 2'!M20","v":false},{"$f":"'Miscellaneous 2'!N20","v":false},{"$f":"'Miscellaneous 2'!O20","v":false},"Monitoring/Interim Work        ",0,0,0,0,0]
[null,null,null,null,null,null,"Corrective Action Plan Work",{"$f":"'Miscellaneous 2'!K21","v":false},{"$f":"'Miscellaneous 2'!L21","v":false},{"$f":"'Miscellaneous 2'!M21","v":false},{"$f":"'Miscellaneous 2'!N21","v":false},{"$f":"'Miscellaneous 2'!O21","v":false},"Corrective Action Plan Work",0,0,0,0,0]
[]
[]
[null,null,null,null,null,null,"Emergency/Initial Work   ",{"$f":"(R19+R25)","v":0},{"$f":"IF(H31>=1,TRUE,FALSE)","v":false}]
[null,null,null,null,null,null,"Investigation Work      ",{"$f":"(R20+R26)","v":0},{"$f":"IF(H32>=1,TRUE,FALSE)","v":false}]
[null,null,null,null,null,null,"Monitoring/Interim Work        ",0,{"$f":"IF(H33>=1,TRUE,FALSE)","v":false}]
[null,null,null,null,null,null,"Corrective Action Plan Work",0,{"$f":"IF(H34>=1,TRUE,FALSE)","v":false}]
[]
[]
[]
[]
[null,null,null,null,null,null,{"$f":"IF(H11=TRUE,$K$11,IF(H12=TRUE,$K$12,IF(H13=TRUE,$K$13,IF(H14=TRUE,$K$14,IF(H15=TRUE,$K$15,0)))))","v":0}]
["SUBTOTAL OF THIS PAGE",null,null,{"$f":"SUM(D11:E39)","v":0},null,null,{"$f":"SUM(G39)","v":0},{"$f":"IF(G40>0,1,0)","v":0}]
["MISCELLANEOUS TOTAL",null,null,{"$f":"G41","v":""},null,null,{"$f":"IF(AND(H11=TRUE,$I$31=FALSE),$K$11,IF(AND(H12=TRUE,$I$32=FALSE),$K$12,IF(AND(H13=TRUE,$I$33=FALSE),$K$13,IF(AND(H14=TRUE,$I$34=FALSE),$K$14,\"\"))))","v":""}]
["Page                 of                  (Miscellaneous Supplementary Sheet)"]
["PART 5.H (1)"]
["MISCELLANEOUS SUPPLEMENTARY SHEET"]
["Check Event:"]
[]
[]
["1. All costs not associated with the previous categories should be listed here. (Ex.: utility charges, DOTD or DNR permits/maps,"]
["    DEQ permits, surveying charges, subcontracted drafting charges, purchases of supplies, disposal of sampling kits and bailing kits)"]
["2. Miscellaneous charges for work activities addressed in unit pricing should not be addressed on this form."]
["3.   All markups allowed to the RAC should be identified on this sheet."]
["DESCRIPTION OF EACH\nMISCELLANEOUS ITEM AND NO. OF\nITEMS","RAC\nINVOICE NO.","OUTSIDE\nINVOICE\nNO.","COST",null,null,null,null,"TOTAL"]
[null,null,null,null,null,null,"Emergency/Initial Work   ",false,{"$f":"IF(H53=TRUE,$D$82,\"\")","v":""},null,null,null,null,null,null,null,null,null,{"$f":"IF(H53=TRUE,1,\"\")","v":""}]
[null,null,null,null,null,null,"Investigation Work      ",false,{"$f":"IF(H54=TRUE,$D$82,\"\")","v":""},null,null,null,null,null,null,null,null,null,{"$f":"IF(H54=TRUE,2,\"\")","v":""}]
[null,null,null,null,null,null,"Monitoring/Interim Work        ",false,"",null,null,null,null,null,null,null,null,null,{"$f":"IF(H55=TRUE,3,\"\")","v":""}]
[null,null,null,null,null,null,"Corrective Action Plan Work",false,"",null,null,null,null,null,null,null,null,null,{"$f":"IF(H56=TRUE,4,\"\")","v":""}]
[null,null,null,null,null,null,"Report Preparation ",false,"",null,null,null,null,null,null,null,null,null,{"$f":"IF(H57=TRUE,5,\"\")","v":""}]
[]
[]
[]
[]
[]
[]
[]
[]
[]
[]
[]
[]
[]
[]
[]
[]
[]
[]
[]
[]
[]
[]
[]
[null,null,null,null,null,null,{"$f":"IF(H53=TRUE,$K$11,IF(H54=TRUE,$K$12,IF(H55=TRUE,$K$13,IF(H56=TRUE,$K$14,IF(H57=TRUE,$K$15,0)))))","v":0}]
["SUBTOTAL OF THIS PAGE",null,null,{"$f":"SUM(D53:E81)","v":0},null,null,{"$f":"SUM(G81)","v":0},{"$f":"IF(G82>0,1,0)","v":0}]
["MISCELLANEOUS TOTAL",null,null,{"$f":"G83","v":""},null,null,{"$f":"IF(AND(H53=TRUE,$I$31=FALSE),$K$11,IF(AND(H54=TRUE,$I$32=FALSE),$K$12,IF(AND(H55=TRUE,$I$33=FALSE),$K$13,IF(AND(H56=TRUE,$I$34=FALSE),$K$14,\"\"))))","v":""}]
["Page                 of                  (Miscellaneous Supplementary Sheet)"]
["PART 5.H (1)"]
["MISCELLANEOUS SUPPLEMENTARY SHEET"]
["Check Event:"]
[]
[]
["1. All costs not associated with the previous categories should be listed here. (Ex.: utility charges, DOTD or DNR permits/maps,"]
["    DEQ permits, surveying charges, subcontracted drafting charges, purchases of supplies, disposal of sampling kits and bailing kits)"]
["2. Miscellaneous charges for work activities addressed in unit pricing should not be addressed on this form."]
["3.   All markups allowed to the RAC should be identified on this sheet."]
["DESCRIPTION OF EACH\nMISCELLANEOUS ITEM AND NO. OF\nITEMS","RAC\nINVOICE NO.","OUTSIDE\nINVOICE\nNO.","COST",null,null,null,null,"TOTAL"]
[null,null,null,null,null,null,"Emergency/Initial Work   ",false,{"$f":"IF(H95=TRUE,$D$124,\"\")","v":""},null,null,null,null,null,null,null,null,null,{"$f":"IF(H95=TRUE,1,\"\")","v":""}]
[null,null,null,null,null,null,"Investigation Work      ",false,{"$f":"IF(H96=TRUE,$D$124,\"\")","v":""},null,null,null,null,null,null,null,null,null,{"$f":"IF(H96=TRUE,2,\"\")","v":""}]
[null,null,null,null,null,null,"Monitoring/Interim Work        ",false,"",null,null,null,null,null,null,null,null,null,{"$f":"IF(H97=TRUE,3,\"\")","v":""}]
[null,null,null,null,null,null,"Corrective Action Plan Work",false,"",null,null,null,null,null,null,null,null,null,{"$f":"IF(H98=TRUE,4,\"\")","v":""}]
[null,null,null,null,null,null,"Report Preparation ",false,"",null,null,null,null,null,null,null,null,null,{"$f":"IF(H99=TRUE,5,\"\")","v":""}]
[]
[]
[]
[]
[]
[]
[]
[]
[]
[]
[]
[]
[]
[]
[]
[]
[]
[]
[]
[]
[]
[]
[]
[null,null,null,null,null,null,{"$f":"IF(H95=TRUE,$K$11,IF(H96=TRUE,$K$12,IF(H97=TRUE,$K$13,IF(H98=TRUE,$K$14,IF(H99=TRUE,$K$15,0)))))","v":0}]
["SUBTOTAL OF THIS PAGE",null,null,{"$f":"SUM(D95:E123)","v":0},null,null,{"$f":"SUM(G123)","v":0},{"$f":"IF(G124>0,1,0)","v":0}]
["MISCELLANEOUS TOTAL",null,null,{"$f":"G125","v":""},null,null,{"$f":"IF(AND(H95=TRUE,$I$31=FALSE),$K$11,IF(AND(H96=TRUE,$I$32=FALSE),$K$12,IF(AND(H97=TRUE,$I$33=FALSE),$K$13,IF(AND(H98=TRUE,$I$34=FALSE),$K$14,\"\"))))","v":""}]
["Page                 of                  (Miscellaneous Supplementary Sheet)"]
["PART 5.H (1)"]
["MISCELLANEOUS SUPPLEMENTARY SHEET"]
["Check Event:"]
[]
[]
["1. All costs not associated with the previous categories should be listed here. (Ex.: utility charges, DOTD or DNR permits/maps,"]
["    DEQ permits, surveying charges, subcontracted drafting charges, purchases of supplies, disposal of sampling kits and bailing kits)"]
["2. Miscellaneous charges for work activities addressed in unit pricing should not be addressed on this form."]
["3.   All markups allowed to the RAC should be identified on this sheet."]
["DESCRIPTION OF EACH\nMISCELLANEOUS ITEM AND NO. OF\nITEMS","RAC\nINVOICE NO.","OUTSIDE\nINVOICE\nNO.","COST",null,null,null,null,"TOTAL"]
[null,null,null,null,null,null,"Emergency/Initial Work   ",false,{"$f":"IF(H137=TRUE,$D$166,\"\")","v":""},null,null,null,null,null,null,null,null,null,{"$f":"IF(H137=TRUE,1,\"\")","v":""}]
[null,null,null,null,null,null,"Investigation Work      ",false,{"$f":"IF(H138=TRUE,$D$166,\"\")","v":""},null,null,null,null,null,null,null,null,null,{"$f":"IF(H138=TRUE,2,\"\")","v":""}]
[null,null,null,null,null,null,"Monitoring/Interim Work        ",false,"",null,null,null,null,null,null,null,null,null,{"$f":"IF(H139=TRUE,3,\"\")","v":""}]
[null,null,null,null,null,null,"Corrective Action Plan Work",false,"",null,null,null,null,null,null,null,null,null,{"$f":"IF(H140=TRUE,4,\"\")","v":""}]
[null,null,null,null,null,null,"Report Preparation ",false,"",null,null,null,null,null,null,null,null,null,{"$f":"IF(H141=TRUE,5,\"\")","v":""}]
[]
[]
[]
[]
[]
[]
[]
[]
[]
[]
[]
[]
[]
[]
[]
[]
[]
[]
[]
[]
[]
[]
[]
[null,null,null,null,null,null,{"$f":"IF(H137=TRUE,$K$11,IF(H138=TRUE,$K$12,IF(H139=TRUE,$K$13,IF(H140=TRUE,$K$14,IF(H141=TRUE,$K$15,0)))))","v":0}]
["SUBTOTAL OF THIS PAGE",null,null,{"$f":"SUM(D137:E165)","v":0},null,null,{"$f":"SUM(G165)","v":0},{"$f":"IF(G166>0,1,0)","v":0}]
["MISCELLANEOUS TOTAL",null,null,{"$f":"G167","v":""},null,null,{"$f":"IF(AND(H137=TRUE,$I$31=FALSE),$K$11,IF(AND(H138=TRUE,$I$32=FALSE),$K$12,IF(AND(H139=TRUE,$I$33=FALSE),$K$13,IF(AND(H140=TRUE,$I$34=FALSE),$K$14,\"\"))))","v":""}]
["Page                 of                  (Miscellaneous Supplementary Sheet)"]
["PART 5.H (1)"]
["MISCELLANEOUS SUPPLEMENTARY SHEET"]
["Check Event:"]
[]
[]
["1. All costs not associated with the previous categories should be listed here. (Ex.: utility charges, DOTD or DNR permits/maps,"]
["    DEQ permits, surveying charges, subcontracted drafting charges, purchases of supplies, disposal of sampling kits and bailing kits)"]
["2. Miscellaneous charges for work activities addressed in unit pricing should not be addressed on this form."]
["3.   All markups allowed to the RAC should be identified on this sheet."]
["DESCRIPTION OF EACH\nMISCELLANEOUS ITEM AND NO. OF\nITEMS","RAC\nINVOICE NO.","OUTSIDE\nINVOICE\nNO.","COST",null,null,null,null,"TOTAL"]
[null,null,null,null,null,null,"Emergency/Initial Work   ",false,{"$f":"IF(H179=TRUE,$D$208,\"\")","v":""},null,null,null,null,null,null,null,null,null,{"$f":"IF(H179=TRUE,1,\"\")","v":""}]
[null,null,null,null,null,null,"Investigation Work      ",false,{"$f":"IF(H180=TRUE,$D$208,\"\")","v":""},null,null,null,null,null,null,null,null,null,{"$f":"IF(H180=TRUE,2,\"\")","v":""}]
[null,null,null,null,null,null,"Monitoring/Interim Work        ",false,"",null,null,null,null,null,null,null,null,null,{"$f":"IF(H181=TRUE,3,\"\")","v":""}]
[null,null,null,null,null,null,"Corrective Action Plan Work",false,"",null,null,null,null,null,null,null,null,null,{"$f":"IF(H182=TRUE,4,\"\")","v":""}]
[null,null,null,null,null,null,"Report Preparation ",false,"",null,null,null,null,null,null,null,null,null,{"$f":"IF(H183=TRUE,5,\"\")","v":""}]
[]
[]
[]
[]
[]
[]
[]
[]
[]
[]
[]
[]
[]
[]
[]
[]
[]
[]
[]
[]
[]
[]
[]
[null,null,null,null,null,null,{"$f":"IF(H179=TRUE,$K$11,IF(H180=TRUE,$K$12,IF(H181=TRUE,$K$13,IF(H182=TRUE,$K$14,IF(H183=TRUE,$K$15,0)))))","v":0}]
["SUBTOTAL OF THIS PAGE",null,null,{"$f":"SUM(D179:E207)","v":0},null,null,{"$f":"SUM(G207)","v":0},{"$f":"IF(G208>0,1,0)","v":0}]
["MISCELLANEOUS TOTAL",null,null,{"$f":"G209","v":""},null,null,{"$f":"IF(AND(H179=TRUE,$I$31=FALSE),$K$11,IF(AND(H180=TRUE,$I$32=FALSE),$K$12,IF(AND(H181=TRUE,$I$33=FALSE),$K$13,IF(AND(H182=TRUE,$I$34=FALSE),$K$14,\"\"))))","v":""}]
["Page                 of                  (Miscellaneous Supplementary Sheet)"]
["PART 5.H (1)"]
["MISCELLANEOUS SUPPLEMENTARY SHEET"]
["Check Event:"]
[]
[]
["1. All costs not associated with the previous categories should be listed here. (Ex.: utility charges, DOTD or DNR permits/maps,"]
["    DEQ permits, surveying charges, subcontracted drafting charges, purchases of supplies, disposal of sampling kits and bailing kits)"]
["2. Miscellaneous charges for work activities addressed in unit pricing should not be addressed on this form."]
["3.   All markups allowed to the RAC should be identified on this sheet."]
["DESCRIPTION OF EACH\nMISCELLANEOUS ITEM AND NO. OF\nITEMS","RAC\nINVOICE NO.","OUTSIDE\nINVOICE\nNO.","COST",null,null,null,null,"TOTAL"]
[null,null,null,null,null,null,"Emergency/Initial Work   ",false,{"$f":"IF(H221=TRUE,$D$250,\"\")","v":""},null,null,null,null,null,null,null,null,null,{"$f":"IF(H221=TRUE,1,\"\")","v":""}]
[null,null,null,null,null,null,"Investigation Work      ",false,{"$f":"IF(H222=TRUE,$D$250,\"\")","v":""},null,null,null,null,null,null,null,null,null,{"$f":"IF(H222=TRUE,2,\"\")","v":""}]
[null,null,null,null,null,null,"Monitoring/Interim Work        ",false,"",null,null,null,null,null,null,null,null,null,{"$f":"IF(H223=TRUE,3,\"\")","v":""}]
[null,null,null,null,null,null,"Corrective Action Plan Work",false,"",null,null,null,null,null,null,null,null,null,{"$f":"IF(H224=TRUE,4,\"\")","v":""}]
[null,null,null,null,null,null,"Report Preparation ",false,"",null,null,null,null,null,null,null,null,null,{"$f":"IF(H225=TRUE,5,\"\")","v":""}]
[]
[]
[]
[]
[]
[]
[]
[]
[]
[]
[]
[]
[]
[]
[]
[]
[]
[]
[]
[]
[]
[]
[]
[null,null,null,null,null,null,{"$f":"IF(H221=TRUE,$K$11,IF(H222=TRUE,$K$12,IF(H223=TRUE,$K$13,IF(H224=TRUE,$K$14,IF(H225=TRUE,$K$15,0)))))","v":0}]
["SUBTOTAL OF THIS PAGE",null,null,{"$f":"SUM(D221:E249)","v":0},null,null,{"$f":"SUM(G249)","v":0},{"$f":"IF(G250>0,1,0)","v":0}]
["MISCELLANEOUS TOTAL",null,null,{"$f":"G251","v":""},null,"`",{"$f":"IF(AND(H221=TRUE,$I$31=FALSE),$K$11,IF(AND(H222=TRUE,$I$32=FALSE),$K$12,IF(AND(H223=TRUE,$I$33=FALSE),$K$13,IF(AND(H224=TRUE,$I$34=FALSE),$K$14,\"\"))))","v":""}]
["Page                 of                  (Miscellaneous Supplementary Sheet)"]

{"sheet":"Miscellaneous 2","index":16,"n_rows":200,"n_cols":19,"rows_kept":200,"cut":false,"hidden":false,"merged":[[106,6,112,6],[106,7,112,7],[100,0,100,7],[98,5,98,7],[113,6,118,6],[113,7,118,7],[119,0,119,3],[119,6,124,6],[119,7,124,7],[94,0,94,4],[47,0,47,4],[146,0,146,4],[97,0,97,4],[97,5,97,7],[101,0,101,7],[139,7,143,7],[133,0,133,4],[133,7,138,7],[125,6,132,6],[125,7,132,7],[93,3,93,4],[83,6,88,6],[114,0,114,3],[120,0,120,3],[106,0,106,3],[107,0,107,3],[98,0,98,4],[113,0,113,3],[99,0,99,5],[102,0,102,7],[103,0,103,7],[104,0,104,7],[105,0,105,4],[125,0,125,3],[163,6,168,6],[163,7,168,7],[133,6,138,6],[140,3,140,4],[141,3,141,4],[142,3,142,4],[143,3,143,4],[139,0,139,4],[139,6,143,6],[127,0,127,1],[126,2,126,3],[144,7,146,7],[145,0,145,1],[145,2,145,4],[127,2,127,3],[126,0,126,1],[144,0,144,4],[144,6,146,6],[148,5,148,7],[164,0,164,3],[199,0,199,5],[197,0,197,4],[197,5,197,7],[147,0,147,4],[147,5,147,7],[183,0,183,4],[183,6,188,6],[183,7,188,7],[152,0,152,7],[153,0,153,7],[154,0,154,7],[155,0,155,4],[156,6,162,6],[156,7,162,7],[189,7,193,7],[190,3,190,4],[191,3,191,4],[192,3,192,4],[198,0,198,4],[198,5,198,7],[194,6,196,6],[194,7,196,7],[195,0,195,1],[195,2,195,4],[26,2,26,3],[63,6,68,6],[45,2,45,4],[48,5,48,7],[53,0,53,7],[50,0,50,7],[70,0,70,3],[57,0,57,3],[54,0,54,7],[25,7,32,7],[39,6,43,6],[52,0,52,7],[25,6,32,6],[33,7,38,7],[27,2,27,3],[33,0,33,4],[33,6,38,6],[69,0,69,3],[69,6,74,6],[69,7,74,7],[56,7,62,7],[48,0,48,4],[46,0,46,4],[13,0,13,3],[14,0,14,3],[20,0,20,3],[19,0,19,3],[94,6,96,6],[47,5,47,7],[44,0,44,4],[25,0,25,3],[44,7,46,7],[39,0,39,4],[13,7,18,7],[19,6,24,6],[19,7,24,7],[13,6,18,6],[51,0,51,7],[83,0,83,4],[91,3,91,4],[55,0,55,4],[42,3,42,4],[43,3,43,4],[63,0,63,3],[64,0,64,3],[56,6,62,6],[27,0,27,1],[0,0,0,7],[1,0,1,7],[3,0,3,7],[2,0,2,7],[4,0,4,7],[5,0,5,4],[6,6,12,6],[6,7,12,7],[6,0,6,3],[7,0,7,3],[196,0,196,4],[189,0,189,4],[189,6,193,6],[163,0,163,3],[150,0,150,7],[151,0,151,7],[149,0,149,5],[148,0,148,4],[177,0,177,1],[194,0,194,4],[176,2,176,3],[193,3,193,4],[156,0,156,3],[157,0,157,3],[170,0,170,3],[169,0,169,3],[169,6,174,6],[169,7,174,7],[177,2,177,3],[176,0,176,1],[175,0,175,3],[175,6,182,6],[175,7,182,7],[94,7,96,7],[95,0,95,1],[95,2,95,4],[96,0,96,4],[89,7,93,7],[90,3,90,4],[39,7,43,7],[45,0,45,1],[40,3,40,4],[41,3,41,4],[76,2,76,3],[92,3,92,4],[83,7,88,7],[89,0,89,4],[89,6,93,6],[63,7,68,7],[77,2,77,3],[75,0,75,3],[75,6,82,6],[49,0,49,5],[44,6,46,6],[56,0,56,3],[75,7,82,7],[77,0,77,1]]}
["PART 5.H (2)",null,null,null,null,null,null,null,null,null,"Mis 1 ","Mis 2","Mis 1&2 total"]
["MISCELLANEOUS SUPPLEMENTARY SHEET",null,null,null,null,null,null,null,null,"Emergency/Initial Work   ",{"$f":"'Miscellaneous 1'!K11","v":0},{"$f":"N9","v":0},{"$f":"SUM(K2:L2)","v":0}]
["UNIT PRICING FORM",null,null,null,null,null,null,null,null,"Investigation Work      ",{"$f":"'Miscellaneous 1'!K12","v":0},{"$f":"N10","v":0},{"$f":"SUM(K3:L3)","v":0}]
["Check Event:",null,null,null,null,null,null,null,null,"Monitoring/Interim Work    ",{"$f":"'Miscellaneous 1'!K13","v":0},0,0]
["Charges for the following activities shall be addressed on this form:  groundwater sampling, discharge sampling and routine scheduled treatment unit operation and maintenance events.  Refer to the Cost Control Guidance Document regarding specific activities/items covered under these unit prices. It is mandatory unit pricing for these activities.",null,null,null,null,null,null,null,null,"Corrective Action Plan Work",{"$f":"'Miscellaneous 1'!K14","v":0},0,0]
["UNIT PRICE ACTIVITY",null,null,null,null,"RAC INVOICE NO.","RATES","COST"]
["Groundwater Sampling             Total Number of Wells Sampled:\n",null,null,null,{"$f":"IF(COUNTA(A9:E13)>0,COUNTA(A9:E13),\"\")","v":""},null,"$560.00 - 1st Well\n$175.00 – Others",{"$f":"IF(COUNTA(A9:E13)=1,560,IF(COUNTA(A9:E13)>1,560+((COUNTA(A9:E13)-1)*175),0))","v":0},null,null,null,null,null,"PAGE TOTAL"]
["List wells sampled below:                        Date sampling occurred:",null,null,null,null,null,null,null,null,null,null,null,null,null,null,null,null,null,"2nd type of print report"]
[null,null,null,null,null,null,null,null,null,"Emergency/Initial Work   ",false,{"$f":"IF(K9=TRUE,$F$48,\"\")","v":""},"Emergency/Initial Work   ",{"$f":"SUM(L9,L59,L109,L159)","v":0},null,null,null,"Emergency/Initial Work   ",{"$f":"IF(K9=TRUE,1,\"\")","v":""}]
[null,null,null,null,null,null,null,null,null,"Investigation Work      ",false,{"$f":"IF(K10=TRUE,$F$48,\"\")","v":""},"Investigation Work      ",{"$f":"SUM(L10,L60,L110,L160)","v":0},null,null,null,"Investigation Work      ",{"$f":"IF(K10=TRUE,2,\"\")","v":""}]
[null,null,null,null,null,null,null,null,null,"Monitoring/Interim Work    ",false,{"$f":"IF(K11=TRUE,$F$48,\"\")","v":""},"Monitoring/Interim Work    ",{"$f":"SUM(L11,L61,L111,L161)","v":0},null,null,null,"Monitoring/Interim Work    ",{"$f":"IF(K11=TRUE,3,\"\")","v":""}]
[null,null,null,null,null,null,null,null,null,"Corrective Action Plan Work",false,{"$f":"IF(K12=TRUE,$F$48,\"\")","v":""},"Corrective Action Plan Work",{"$f":"SUM(L12,L62,L112,L162)","v":0},null,null,null,"Corrective Action Plan Work",{"$f":"IF(K12=TRUE,4,\"\")","v":""}]
[]
["Free Product Recovery        Total Number of Wells Handbailed:",null,null,null,{"$f":"IF(COUNTA(A16:E19)>0,COUNTA(A16:E19),\"\")","v":""},null,"$170.00 - 1st Well\n$55.00 – Others\n\nThe $55.00 rate applies to all wells handbailed on the same date as sampled."]
["List wells handbailed below:              Date handbailing occurred:"]
[]
[null,null,null,null,null,null,null,null,null,null,"box 1-5","box 6-10","box 11-15","box 16-20","box 21-25"]
[null,null,null,null,null,null,null,null,null,"Emergency/Initial Work   ",{"$f":"'Miscellaneous 3'!H8","v":false},{"$f":"'Miscellaneous 3'!H56","v":false},{"$f":"'Miscellaneous 3'!H104","v":false},{"$f":"'Miscellaneous 3'!H152","v":false},{"$f":"'Miscellaneous 3'!H200","v":false}]
[null,null,null,null,null,null,null,null,null,"Investigation Work      ",{"$f":"'Miscellaneous 3'!H9","v":false},{"$f":"'Miscellaneous 3'!H57","v":false},{"$f":"'Miscellaneous 3'!H105","v":false},{"$f":"'Miscellaneous 3'!H153","v":false},{"$f":"'Miscellaneous 3'!H201","v":false}]
["Gauging Wells                             Total Number of Wells Gauged:",null,null,null,{"$f":"IF(COUNTA(A22:E25)>0,COUNTA(A22:E25),\"\")","v":""},null,"$15.50 per well",{"$f":"(COUNTA(A22:E25)*15.5)","v":0},null,"Monitoring/Interim Work        ",{"$f":"'Miscellaneous 3'!H10","v":false},{"$f":"'Miscellaneous 3'!H58","v":false},{"$f":"'Miscellaneous 3'!H106","v":false},{"$f":"'Miscellaneous 3'!H154","v":false},{"$f":"'Miscellaneous 3'!H202","v":false}]
["List wells gauged below:                           Date gauging occurred:",null,null,null,null,null,null,null,null,"Corrective Action Plan Work",{"$f":"'Miscellaneous 3'!H11","v":false},{"$f":"'Miscellaneous 3'!H59","v":false},{"$f":"'Miscellaneous 3'!H107","v":false},{"$f":"'Miscellaneous 3'!H155","v":false},{"$f":"'Miscellaneous 3'!H203","v":false}]
[]
[null,null,null,null,null,null,null,null,null,"Emergency/Initial Work   ",{"$f":"IF(K18=FALSE,0,1)","v":0},{"$f":"IF(L18=FALSE,0,1)","v":0},0,0,0,{"$f":"SUM(K23:O23)","v":0}]
[null,null,null,null,null,null,null,null,null,"Investigation Work      ",{"$f":"IF(K19=FALSE,0,1)","v":0},0,0,0,0,{"$f":"SUM(K24:O24)","v":0},null,"O&M Dorp down"]
[null,null,null,null,null,null,null,null,null,"Monitoring/Interim Work        ",0,0,0,0,0,0,null,200]
["Treatment Unit Operation & Maintenance Total No. of Events: ",null,null,null,{"$f":"IF(COUNTA(A29:E33)>0,COUNTA(A29:E33),\"\")","v":""},null,"Active Remediation\n$337.50 - Weekly Dual Media Unit*\n$675.00 - Biweekly or Twice monthly Dual Media Unit*\n$200.00 - Weekly Single Medium Unit\n$395.00 - Biweekly Single Medium Unit\n$170.00 - *Additional Units                                                           Post-Remediation\n$337.50 - Monthly Dual Media Unit\n$560.00 - Quarterly Dual Media Unit\n$337.50 - Quarterly Single Medium Unit\n$170.00 - Additional Units",{"$f":"IF(COUNTA(A29:E33)>=1,(E26*E27)+(E28*170),0)","v":0},null,"Corrective Action Plan Work",0,0,0,0,0,0,null,337.5]
[null,null,"Select Rate:",null,null,null,null,null,null,null,null,null,null,null,null,null,null,395]
["List Dates O/M Occurred",null,"Number of Multi-System O/M:",null,null,null,null,null,null,null,null,null,null,null,null,null,null,560]
[null,null,null,null,null,null,null,null,null,null,null,null,null,null,null,null,null,675]
[]
[]
[]
[]
["Discharge Sampling Event - List dates sampling occurred \n(When additional sampling events is being requested due to an exceedance, a copy of the analytical result documenting the exceedance must be provided.)",null,null,null,null,null,"$225.00 per event",{"$f":"(COUNTA(A35:E39)*225)","v":0}]
[null,null,null,null,null,null,null,null,null,"Emergency/Initial Work   ",{"$f":"IF(P23=1,TRUE,FALSE)","v":false}]
[null,null,null,null,null,null,null,null,null,"Investigation Work      ",{"$f":"IF(P24=1,TRUE,FALSE)","v":false}]
[null,null,null,null,null,null,null,null,null,"Monitoring/Interim Work        ",{"$f":"IF(P25=1,TRUE,FALSE)","v":false}]
[null,null,null,null,null,null,null,null,null,"Corrective Action Plan Work",{"$f":"IF(P26=1,TRUE,FALSE)","v":false}]
[]
["Mob/Demob for Drilling/Direct Push/P&A",null,null,null,null,null,"$275.00 once per event",{"$f":"(COUNTA(B41:B44)*275)","v":0}]
["Date of event:",null," Type of event:"]
["Date of event:",null," Type of event:"]
["Date of event:",null," Type of event:"]
["Date of event:",null," Type of event:"]
["Obtaining offsite access",null,null,null,null,null,"$395.00 per property",{"$f":"C46*395","v":0}]
["Number of Properties Accessed"]
["    Please attach required documentation",null,null,null,null,null,null,null,null,{"$f":"IF(K9=TRUE,$N$9,IF(K10=TRUE,$N$10,IF(K11=TRUE,$N$11,IF(K12=TRUE,$N$12,0))))","v":0}]
["SUBTOTAL OF THIS PAGE",null,null,null,null,{"$f":"SUM(H7:H47)","v":0},null,null,null,{"$f":"SUM(J47)","v":0},{"$f":"IF(J48>0,1,0)","v":0}]
["MISCELLANEOUS TOTAL",null,null,null,null,{"$f":"J49","v":""},null,null,null,{"$f":"IF(AND(K9=TRUE,$K$35=FALSE),$M$2,IF(AND(K10=TRUE,$K$36=FALSE),$M$3,IF(AND(K11=TRUE,$K$37=FALSE),$M$4,IF(AND(K12=TRUE,$K$38=FALSE),$M$5,\"\"))))","v":""}]
["Page             of                (Miscellaneous Supplementary Sheet)"]
["PART 5.H (2)"]
["MISCELLANEOUS SUPPLEMENTARY SHEET"]
["UNIT PRICING FORM"]
["Check Event:"]
["Charges for the following activities shall be addressed on this form:  groundwater sampling, discharge sampling and routine scheduled treatment unit operation and maintenance events.  Refer to the Cost Control Guidance Document regarding specific activities/items covered under these unit prices. It is mandatory unit pricing for these activities."]
["UNIT PRICE ACTIVITY",null,null,null,null,"RAC INVOICE NO.","RATES","COST"]
["Groundwater Sampling             Total Number of Wells Sampled:\n",null,null,null,{"$f":"IF(COUNTA(A59:E63)>0,COUNTA(A59:E63),\"\")","v":""},null,"$560.00 - 1st Well\n$175.00 – Others",{"$f":"IF(COUNTA(A59:E63)=1,560,IF(COUNTA(A59:E63)>1,560+((COUNTA(A59:E63)-1)*175),0))","v":0}]
["List wells sampled below:                        Date sampling occurred:",null,null,null,null,null,null,null,null,null,null,null,null,null,null,null,null,null,"2nd type of print report"]
[null,null,null,null,null,null,null,null,null,"Emergency/Initial Work   ",false,{"$f":"IF(K59=TRUE,$F$98,\"\")","v":""},null,null,null,null,null,"Emergency/Initial Work   ",{"$f":"IF(K59=TRUE,1,\"\")","v":""}]
[null,null,null,null,null,null,null,null,null,"Investigation Work      ",false,{"$f":"IF(K60=TRUE,$F$98,\"\")","v":""},null,null,null,null,null,"Investigation Work      ",{"$f":"IF(K60=TRUE,2,\"\")","v":""}]
[null,null,null,null,null,null,null,null,null,"Monitoring/Interim Work    ",false,"",null,null,null,null,null,"Monitoring/Interim Work    ",{"$f":"IF(K61=TRUE,3,\"\")","v":""}]
[null,null,null,null,null,null,null,null,null,"Corrective Action Plan Work",false,"",null,null,null,null,null,"Corrective Action Plan Work",{"$f":"IF(K62=TRUE,4,\"\")","v":""}]
[]
["Free Product Recovery        Total Number of Wells Handbailed:",null,null,null,{"$f":"IF(COUNTA(A66:E69)>0,COUNTA(A66:E69),\"\")","v":""},null,"$170.00 - 1st Well\n$55.00 – Others\n\nThe $55.00 rate applies to all wells handbailed on the same date as sampled."]
["List wells handbailed below:              Date handbailing occurred:"]
[]
[]
[]
[]
["Gauging Wells                             Total Number of Wells Gauged:",null,null,null,{"$f":"IF(COUNTA(A72:E75)>0,COUNTA(A72:E75),\"\")","v":""},null,"$15.50 per well",{"$f":"(COUNTA(A72:E75)*15.5)","v":0}]
["List wells gauged below:                           Date gauging occurred:"]
[]
[]
[]
[]
["Treatment Unit Operation & Maintenance Total No. of Events: ",null,null,null,{"$f":"IF(COUNTA(A79:E83)>0,COUNTA(A79:E83),\"\")","v":""},null,"Active Remediation\n$337.50 - Weekly Dual Media Unit*\n$675.00 - Biweekly or Twice monthly Dual Media Unit*\n$200.00 - Weekly Single Medium Unit\n$395.00 - Biweekly Single Medium Unit\n$170.00 - *Additional Units                                                           Post-Remediation\n$337.50 - Monthly Dual Media Unit\n$560.00 - Quarterly Dual Media Unit\n$337.50 - Quarterly Single Medium Unit\n$170.00 - Additional Units",{"$f":"IF(COUNTA(A79:E83)>=1,(E76*E77)+(E78*170),0)","v":0}]
[null,null,"Select Rate:"]
["List Dates O/M Occurred",null,"Number of Multi-System O/M:"]
[]
[]
[]
[]
[]
["Discharge Sampling Event - List dates sampling occurred \n(When additional sampling events is being requested due to an exceedance, a copy of the analytical result documenting the exceedance must be provided.)",null,null,null,null,null,"$225.00 per event",{"$f":"(COUNTA(A85:E89)*225)","v":0}]
[]
[]
[]
[]
[]
["Mob/Demob for Drilling/Direct Push/P&A",null,null,null,null,null,"$275.00 once per event",{"$f":"(COUNTA(B91:B94)*275)","v":0}]
["Date of event:",null," Type of event:"]
["Date of event:",null," Type of event:"]
["Date of event:",null," Type of event:"]
["Date of event:",null," Type of event:"]
["Obtaining offsite access",null,null,null,null,null,"$395.00 per property",{"$f":"C96*395","v":0}]
["Number of Properties Accessed"]
["    Please attach required documentation",null,null,null,null,null,null,null,null,{"$f":"IF(K59=TRUE,$N$9,IF(K60=TRUE,$N$10,IF(K61=TRUE,$N$11,IF(K62=TRUE,$N$12,0))))","v":0}]
["SUBTOTAL OF THIS PAGE",null,null,null,null,{"$f":"SUM(H57:H97)","v":0},null,null,null,{"$f":"SUM(J97)","v":0},{"$f":"IF(J98>0,1,0)","v":0}]
["MISCELLANEOUS TOTAL",null,null,null,null,{"$f":"J99","v":""},null,null,null,{"$f":"IF((K59=TRUE)*AND($K$35=FALSE),$M$2,IF((K60=TRUE)*AND($K$36=FALSE),$M$3,IF((K61=TRUE)*AND($K$37=FALSE),$M$4,IF((K62=TRUE)*AND($K$38=FALSE),$M$5,\"\"))))","v":""}]
["Page             of                (Miscellaneous Supplementary Sheet)"]
["PART 5.H (2)"]
["MISCELLANEOUS SUPPLEMENTARY SHEET"]
["UNIT PRICING FORM"]
["Check Event:"]
["Charges for the following activities shall be addressed on this form:  groundwater sampling, discharge sampling and routine scheduled treatment unit operation and maintenance events.  Refer to the Cost Control Guidance Document regarding specific activities/items covered under these unit prices. It is mandatory unit pricing for these activities."]
["UNIT PRICE ACTIVITY",null,null,null,null,"RAC INVOICE NO.","RATES","COST"]
["Groundwater Sampling             Total Number of Wells Sampled:\n",null,null,null,{"$f":"IF(COUNTA(A109:E113)>0,COUNTA(A109:E113),\"\")","v":""},null,"$560.00 - 1st Well\n$175.00 – Others",{"$f":"IF(COUNTA(A109:E113)=1,560,IF(COUNTA(A109:E113)>1,560+((COUNTA(A109:E113)-1)*175),0))","v":0}]
["List wells sampled below:                        Date sampling occurred:",null,null,null,null,null,null,null,null,null,null,null,null,null,null,null,null,null,"2nd type of print report"]
[null,null,null,null,null,null,null,null,null,"Emergency/Initial Work   ",false,{"$f":"IF(K109=TRUE,$F$148,\"\")","v":""},null,null,null,null,null,"Emergency/Initial Work   ",{"$f":"IF(K109=TRUE,1,\"\")","v":""}]
[null,null,null,null,null,null,null,null,null,"Investigation Work      ",false,{"$f":"IF(K110=TRUE,$F$148,\"\")","v":""},null,null,null,null,null,"Investigation Work      ",{"$f":"IF(K110=TRUE,2,\"\")","v":""}]
[null,null,null,null,null,null,null,null,null,"Monitoring/Interim Work    ",false,"",null,null,null,null,null,"Monitoring/Interim Work    ",{"$f":"IF(K111=TRUE,3,\"\")","v":""}]
[null,null,null,null,null,null,null,null,null,"Corrective Action Plan Work",false,"",null,null,null,null,null,"Corrective Action Plan Work",{"$f":"IF(K112=TRUE,4,\"\")","v":""}]
[]
["Free Product Recovery        Total Number of Wells Handbailed:",null,null,null,{"$f":"IF(COUNTA(A116:E119)>0,COUNTA(A116:E119),\"\")","v":""},null,"$170.00 - 1st Well\n$55.00 – Others\n\nThe $55.00 rate applies to all wells handbailed on the same date as sampled."]
["List wells handbailed below:              Date handbailing occurred:"]
[]
[]
[]
[]
["Gauging Wells                             Total Number of Wells Gauged:",null,null,null,{"$f":"IF(COUNTA(A122:E125)>0,COUNTA(A122:E125),\"\")","v":""},null,"$15.50 per well",{"$f":"(COUNTA(A122:E125)*15.5)","v":0}]
["List wells gauged below:                           Date gauging occurred:"]
[]
[]
[]
[]
["Treatment Unit Operation & Maintenance Total No. of Events: ",null,null,null,{"$f":"IF(COUNTA(A129:E133)>0,COUNTA(A129:E133),\"\")","v":""},null,"Active Remediation\n$337.50 - Weekly Dual Media Unit*\n$675.00 - Biweekly or Twice monthly Dual Media Unit*\n$200.00 - Weekly Single Medium Unit\n$395.00 - Biweekly Single Medium Unit\n$170.00 - *Additional Units                                                           Post-Remediation\n$337.50 - Monthly Dual Media Unit\n$560.00 - Quarterly Dual Media Unit\n$337.50 - Quarterly Single Medium Unit\n$170.00 - Additional Units",{"$f":"IF(COUNTA(A129:E133)>=1,(E126*E127)+(E128*170),0)","v":0}]
[null,null,"Select Rate:"]
["List Dates O/M Occurred",null,"Number of Multi-System O/M:"]
[]
[]
[]
[]
[]
["Discharge Sampling Event - List dates sampling occurred \n(When additional sampling events is being requested due to an exceedance, a copy of the analytical result documenting the exceedance must be provided.)",null,null,null,null,null,"$225.00 per event",{"$f":"(COUNTA(A135:E139)*225)","v":0}]
[]
[]
[]
[]
[]
["Mob/Demob for Drilling/Direct Push/P&A",null,null,null,null,null,"$275.00 once per event",{"$f":"(COUNTA(B141:B144)*275)","v":0}]
["Date of event:",null," Type of event:"]
["Date of event:",null," Type of event:"]
["Date of event:",null," Type of event:"]
["Date of event:",null," Type of event:"]
["Obtaining offsite access",null,null,null,null,null,"$395.00 per property",{"$f":"C146*395","v":0}]
["Number of Properties Accessed"]
["    Please attach required documentation",null,null,null,null,null,null,null,null,{"$f":"IF(K109=TRUE,$N$9,IF(K110=TRUE,$N$10,IF(K111=TRUE,$N$11,IF(K112=TRUE,$N$12,0))))","v":0}]
["SUBTOTAL OF THIS PAGE",null,null,null,null,{"$f":"SUM(H107:H147)","v":0},null,null,null,{"$f":"SUM(J147)","v":0},{"$f":"IF(J148>0,1,0)","v":0}]
["MISCELLANEOUS TOTAL",null,null,null,null,{"$f":"J149","v":""},null,null,null,{"$f":"IF((K109=TRUE)*AND($K$35=FALSE),$M$2,IF((K110=TRUE)*AND($K$36=FALSE),$M$3,IF((K111=TRUE)*AND($K$37=FALSE),$M$4,IF((K112=TRUE)*AND($K$38=FALSE),$M$5,\"\"))))","v":""}]
["Page             of                (Miscellaneous Supplementary Sheet)"]
["PART 5.H (2)"]
["MISCELLANEOUS SUPPLEMENTARY SHEET"]
["UNIT PRICING FORM"]
["Check Event:"]
["Charges for the following activities shall be addressed on this form:  groundwater sampling, discharge sampling and routine scheduled treatment unit operation and maintenance events.  Refer to the Cost Control Guidance Document regarding specific activities/items covered under these unit prices. It is mandatory unit pricing for these activities."]
["UNIT PRICE ACTIVITY",null,null,null,null,"RAC INVOICE NO.","RATES","COST"]
["Groundwater Sampling             Total Number of Wells Sampled:\n",null,null,null,{"$f":"IF(COUNTA(A159:E163)>0,COUNTA(A159:E163),\"\")","v":""},null,"$560.00 - 1st Well\n$175.00 – Others",{"$f":"IF(COUNTA(A159:E163)=1,560,IF(COUNTA(A159:E163)>1,560+((COUNTA(A159:E163)-1)*175),0))","v":0}]
["List wells sampled below:                        Date sampling occurred:",null,null,null,null,null,null,null,null,null,null,null,null,null,null,null,null,null,"2nd type of print report"]
[null,null,null,null,null,null,null,null,null,"Emergency/Initial Work   ",false,{"$f":"IF(K159=TRUE,$F$198,\"\")","v":""},null,null,null,null,null,"Emergency/Initial Work   ",{"$f":"IF(K159=TRUE,1,\"\")","v":""}]
[null,null,null,null,null,null,null,null,null,"Investigation Work      ",false,{"$f":"IF(K160=TRUE,$F$198,\"\")","v":""},null,null,null,null,null,"Investigation Work      ",{"$f":"IF(K160=TRUE,2,\"\")","v":""}]
[null,null,null,null,null,null,null,null,null,"Monitoring/Interim Work    ",false,"",null,null,null,null,null,"Monitoring/Interim Work    ",{"$f":"IF(K161=TRUE,3,\"\")","v":""}]
[null,null,null,null,null,null,null,null,null,"Corrective Action Plan Work",false,"",null,null,null,null,null,"Corrective Action Plan Work",{"$f":"IF(K162=TRUE,4,\"\")","v":""}]
[]
["Free Product Recovery        Total Number of Wells Handbailed:",null,null,null,{"$f":"IF(COUNTA(A166:E169)>0,COUNTA(A166:E169),\"\")","v":""},null,"$170.00 - 1st Well\n$55.00 – Others\n\nThe $55.00 rate applies to all wells handbailed on the same date as sampled."]
["List wells handbailed below:              Date handbailing occurred:"]
[]
[]
[]
[]
["Gauging Wells                             Total Number of Wells Gauged:",null,null,null,{"$f":"IF(COUNTA(A172:E175)>0,COUNTA(A172:E175),\"\")","v":""},null,"$15.50 per well",{"$f":"(COUNTA(A172:E175)*15.5)","v":0}]
["List wells gauged below:                           Date gauging occurred:"]
[]
[]
[]
[]
["Treatment Unit Operation & Maintenance Total No. of Events: ",null,null,null,{"$f":"IF(COUNTA(A179:E183)>0,COUNTA(A179:E183),\"\")","v":""},null,"Active Remediation\n$337.50 - Weekly Dual Media Unit*\n$675.00 - Biweekly or Twice monthly Dual Media Unit*\n$200.00 - Weekly Single Medium Unit\n$395.00 - Biweekly Single Medium Unit\n$170.00 - *Additional Units                                                           Post-Remediation\n$337.50 - Monthly Dual Media Unit\n$560.00 - Quarterly Dual Media Unit\n$337.50 - Quarterly Single Medium Unit\n$170.00 - Additional Units",{"$f":"IF(COUNTA(A179:E183)>=1,(E176*E177)+(E178*170),0)","v":0}]
[null,null,"Select Rate:"]
["List Dates O/M Occurred",null,"Number of Multi-System O/M:"]
[]
[]
[]
[]
[]
["Discharge Sampling Event - List dates sampling occurred \n(When additional sampling events is being requested due to an exceedance, a copy of the analytical result documenting the exceedance must be provided.)",null,null,null,null,null,"$225.00 per event",{"$f":"(COUNTA(A185:E189)*225)","v":0}]
[]
[]
[]
[]
[]
["Mob/Demob for Drilling/Direct Push/P&A",null,null,null,null,null,"$275.00 once per event",{"$f":"(COUNTA(B191:B194)*275)","v":0}]
["Date of event:",null," Type of event:"]
["Date of event:",null," Type of event:"]
["Date of event:",null," Type of event:"]
["Date of event:",null," Type of event:"]
["Obtaining offsite access",null,null,null,null,null,"$395.00 per property",{"$f":"C196*395","v":0}]
["Number of Properties Accessed"]
["    Please attach required documentation",null,null,null,null,null,null,null,null,{"$f":"IF(K159=TRUE,$N$9,IF(K160=TRUE,$N$10,IF(K161=TRUE,$N$11,IF(K162=TRUE,$N$12,0))))","v":0}]
["SUBTOTAL OF THIS PAGE",null,null,null,null,{"$f":"SUM(H157:H197)","v":0},null,null,null,{"$f":"SUM(J197)","v":0},{"$f":"IF(J198>0,1,0)","v":0}]
["MISCELLANEOUS TOTAL",null,null,null,null,{"$f":"J199","v":""},null,null,null,{"$f":"IF((K159=TRUE)*AND($K$35=FALSE),$M$2,IF((K160=TRUE)*AND($K$36=FALSE),$M$3,IF((K161=TRUE)*AND($K$37=FALSE),$M$4,IF((K162=TRUE)*AND($K$38=FALSE),$M$5,\"\"))))","v":""}]
["Page             of                (Miscellaneous Supplementary Sheet)"]

{"sheet":"Miscellaneous 3","index":17,"n_rows":240,"n_cols":11,"rows_kept":240,"cut":false,"hidden":false,"merged":[[129,4,130,4],[150,0,150,1],[55,2,56,2],[9,2,10,2],[11,2,12,2],[67,2,71,2],[72,2,77,2],[83,2,88,2],[52,0,52,4],[48,0,48,4],[49,0,49,4],[50,0,50,4],[51,0,51,4],[46,0,46,2],[46,3,46,4],[45,0,45,2],[43,2,44,2],[43,3,44,3],[43,4,44,4],[55,0,56,1],[58,0,58,1],[15,3,16,3],[36,0,36,1],[30,3,32,3],[30,4,32,4],[15,4,16,4],[120,4,125,4],[113,2,114,2],[126,3,128,3],[126,4,128,4],[159,2,160,2],[142,0,142,2],[142,3,142,4],[129,2,130,2],[113,3,114,3],[113,4,114,4],[147,0,147,4],[120,2,125,2],[148,0,148,4],[131,2,136,2],[155,2,156,2],[143,0,143,3],[151,3,156,3],[156,0,156,1],[144,0,144,4],[145,0,145,4],[146,0,146,4],[137,4,138,4],[149,0,149,4],[151,0,152,1],[159,0,159,1],[168,0,168,1],[163,3,167,3],[159,3,160,3],[159,4,160,4],[198,0,198,1],[190,0,190,2],[190,3,190,4],[191,0,191,3],[174,4,176,4],[187,2,188,2],[187,3,188,3],[177,3,178,3],[177,4,178,4],[179,4,184,4],[179,3,184,3],[187,4,188,4],[196,0,196,4],[168,4,173,4],[174,3,176,3],[161,2,162,2],[161,3,162,3],[216,0,216,1],[216,3,221,3],[216,4,221,4],[209,4,210,4],[211,0,211,1],[211,4,215,4],[211,2,215,2],[216,2,221,2],[209,3,210,3],[209,2,210,2],[211,3,215,3],[239,0,239,3],[222,0,222,1],[233,0,233,1],[237,0,237,2],[237,3,237,4],[238,0,238,2],[238,3,238,4],[225,2,226,2],[225,3,226,3],[225,4,226,4],[222,3,224,3],[222,4,224,4],[222,2,224,2],[227,3,232,3],[227,4,232,4],[233,3,234,3],[233,2,234,2],[235,2,236,2],[235,3,236,3],[233,4,234,4],[235,4,236,4],[228,0,228,1],[235,0,235,1],[227,2,232,2],[199,4,204,4],[205,0,205,1],[207,3,208,3],[207,2,208,2],[207,4,208,4],[202,0,202,1],[204,0,204,1],[199,0,200,1],[197,0,197,4],[199,3,204,3],[206,0,206,1],[207,0,207,1],[199,2,200,2],[201,2,202,2],[203,2,204,2],[161,4,162,4],[177,2,178,2],[169,0,169,1],[171,0,171,1],[163,4,167,4],[163,2,167,2],[168,2,173,2],[174,2,176,2],[180,0,180,1],[187,0,187,1],[193,0,193,4],[194,0,194,4],[195,0,195,4],[192,0,192,4],[185,0,185,1],[189,0,189,2],[179,2,184,2],[189,3,189,4],[185,4,186,4],[126,0,126,1],[137,0,137,1],[141,0,141,2],[94,0,94,2],[84,0,84,1],[185,3,186,3],[174,0,174,1],[163,0,163,1],[168,3,173,3],[185,2,186,2],[157,0,157,1],[154,0,154,1],[141,3,141,4],[120,0,120,1],[120,3,125,3],[131,3,136,3],[131,4,136,4],[137,3,138,3],[137,2,138,2],[139,3,140,3],[139,2,140,2],[139,4,140,4],[132,0,132,1],[129,3,130,3],[6,0,6,1],[7,0,8,1],[10,0,10,1],[12,0,12,1],[19,3,23,3],[158,0,158,1],[151,4,156,4],[151,2,152,2],[153,2,154,2],[41,0,41,1],[35,4,40,4],[41,3,42,3],[41,4,42,4],[41,2,42,2],[115,0,115,1],[55,3,60,3],[55,4,60,4],[61,0,61,1],[67,3,71,3],[96,0,96,4],[103,0,104,1],[106,0,106,1],[139,0,139,1],[126,2,128,2],[35,2,40,2],[57,2,58,2],[59,2,60,2],[62,0,62,1],[63,3,64,3],[4,0,4,4],[0,0,0,4],[1,0,1,4],[3,0,3,4],[2,0,2,4],[7,4,12,4],[24,3,29,3],[24,4,29,4],[24,0,24,1],[19,0,19,1],[17,3,18,3],[17,2,18,2],[17,4,18,4],[19,4,23,4],[19,2,23,2],[7,2,8,2],[24,2,29,2],[5,0,5,4],[7,3,12,3],[102,0,102,1],[103,3,108,3],[103,4,108,4],[109,0,109,1],[108,0,108,1],[15,2,16,2],[30,0,30,1],[13,0,13,1],[14,0,14,1],[15,0,15,1],[30,2,32,2],[63,0,63,1],[63,4,64,4],[60,0,60,1],[63,2,64,2],[33,3,34,3],[33,2,34,2],[33,4,34,4],[35,3,40,3],[43,0,43,1],[45,3,45,4],[47,0,47,3],[53,0,53,4],[54,0,54,1],[91,3,92,3],[91,4,92,4],[97,0,97,4],[91,0,91,1],[91,2,92,2],[93,0,93,2],[93,3,93,4],[115,4,119,4],[103,2,104,2],[105,2,106,2],[107,2,108,2],[115,2,119,2],[115,3,119,3],[111,2,112,2],[94,3,94,4],[111,3,112,3],[111,4,112,4],[95,0,95,3],[110,0,110,1],[111,0,111,1],[98,0,98,4],[99,0,99,4],[100,0,100,4],[101,0,101,4],[78,0,78,1],[89,0,89,1],[72,0,72,1],[72,3,77,3],[72,4,77,4],[65,2,66,2],[65,3,66,3],[81,4,82,4],[78,2,80,2],[78,3,80,3],[78,4,80,4],[67,4,71,4],[65,4,66,4],[67,0,67,1],[81,3,82,3],[81,2,82,2],[83,3,88,3],[83,4,88,4],[89,3,90,3],[89,4,90,4],[89,2,90,2]]}
["PART 5.H (3)",null,null,null,null,null,null,"Mis1","Mis 2","Mis 3","Total"]
["MISCELLANEOUS SUPPLEMENTARY SHEET",null,null,null,null,null,"Emergency/Initial Work   ",{"$f":"'Miscellaneous 1'!K11","v":0},{"$f":"'Miscellaneous 2'!N9","v":0},{"$f":"K8","v":0},{"$f":"SUM(H2:J2)","v":0}]
["UNIT PRICING FORM",null,null,null,null,null,"Investigation Work      ",{"$f":"'Miscellaneous 1'!K12","v":0},{"$f":"'Miscellaneous 2'!N10","v":0},{"$f":"K9","v":0},{"$f":"SUM(H3:J3)","v":0}]
["Check Event:",null,null,null,null,null,"Monitoring/Interim Work        ",{"$f":"'Miscellaneous 1'!K13","v":0},{"$f":"'Miscellaneous 2'!N11","v":0},{"$f":"K10","v":0},0]
[null,null,null,null,null,null,"Corrective Action Plan Work",{"$f":"'Miscellaneous 1'!K14","v":0},{"$f":"'Miscellaneous 2'!N12","v":0},0,{"$f":"SUM(H5:J5)","v":0}]
[" Unit pricing for these activities is mandatory.",null,null,null,null,null,"Report Preparation ",{"$f":"'Miscellaneous 1'!K15","v":0},0,0,0]
["UNIT PRICE ACTIVITY",null,"RAC INVOICE NO.","RATES","COST",null,null,null,null,null,"Sheet Total"]
["Bid Package Preparation:\n    Provide Bid Summary with RAC Invoice.",null,null,"$0.00 - Work $0.00 - $1,999.99\n $112.00 - Work $2,000.00 -  $9,999.99\n$280.00 - Work = or>$10,000.00 \n$1,680.00 - Treatment System Installation; = or > 500 cu. yd excavation\n$560.00 - Treatment Unit Purchase  or Used Treatment System Sale",null,null,"Emergency/Initial Work   ",false,{"$f":"IF(H8=TRUE,$D$46,\"\")","v":""},"Emergency/Initial Work   ",{"$f":"SUM(I8,I56,I104,I152,I200)","v":0}]
[null,null,null,null,null,null,"Investigation Work      ",false,{"$f":"IF(H9=TRUE,$D$46,\"\")","v":""},"Investigation Work      ",{"$f":"SUM(I9,I57,I105,I153,I201)","v":0}]
["Description of work:",null,null,null,null,null,"Monitoring/Interim Work        ",false,{"$f":"IF(H10=TRUE,$D$46,\"\")","v":""},"Monitoring/Interim Work        ",0]
[null,null,null,null,null,null,"Corrective Action Plan Work",false,{"$f":"IF(H11=TRUE,$D$46,\"\")","v":""},"Corrective Action Plan Work",{"$f":"SUM(I11,I59,I107,I155,I203)","v":0}]
["Description of work:",null,null,null,null,null,"Report Preparation ",false,{"$f":"IF(H12=TRUE,$D$46,\"\")","v":""},"Report Preparation ",0]
[]
["Treatment System Design/Engineering/Planning and Treatment System Installation Design/Engineering/Planning",null,null,"$4,500.00 (to be paid with system installation)",{"$f":"IF(C14>0,4500,0)","v":0},null,"Emergency/Initial Work   ",{"$f":"IF(H8=TRUE,1,\"\")","v":""}]
["Conveyance Notice \n(Copy of conveyance notice for each property is required for payment)",null,null,"$900.00 per affected property",{"$f":"IF(C15>0,900,0)","v":0},null,"Investigation Work      ",{"$f":"IF(H9=TRUE,2,\"\")","v":""}]
["Corrective Action Plan Construction and Operations Report",null,null,"$1,770.00 per report",{"$f":"IF(B17>0,1770,0)","v":0},null,"Monitoring/Interim Work        ",{"$f":"IF(H10=TRUE,3,\"\")","v":""}]
["Date of Report:",null,null,null,null,null,"Corrective Action Plan Work",{"$f":"IF(H11=TRUE,4,\"\")","v":""}]
["P & A Report             Date of Report:",null,null,"17% of field work with\n $560.00 Minimum \n $1,000.00 Maximum.",{"$f":"ROUND(IF(OR(B19=0,B18=0),0,IF(B19*0.17<560,560,IF(B19*0.17>1000,1000,B19*0.17))),2)","v":0},null,"Report Preparation ",{"$f":"IF(H12=TRUE,5,\"\")","v":""}]
["Cost of P&A Work:",0]
["Quarterly Monitoring Reports (if applicable) – Indicate report period",null,null,"Without Active Treatment Unit\n$1,680.00 - Initial \n$1,400.00 - Subsequent \nActive Treatment Unit\n$2,800.00 - Initial w/New Wells \n$2,520.00 - Subsequent "]
["Jan-March","April - June"]
[]
["July - Sept.","Oct. - Dec."]
[]
["Annual or Semi-Annual Report (if applicable) - Indicate report period",null,null,"Without Active Treatment Unit\n$1,960.00 - Initial\n$1,680.00 - Subsequent\nActive Treatment Unit\n$3,080.00 - Initial w/New Wells\n$2,800.00 - Subsequent"]
[]
["Start Month & Year:"]
[]
["End Month & Year:"]
[]
["State or Municipal/Parish Quarterly Discharge Monitoring Report ",null,null,"$200.00/ Report\n($75.00 for “No Discharge\")"]
["Report period(S):"]
["Permit number(s):"]
["Soil Confirmation Report         Date:\n",null,null,"17% of reimbursed\n field work performed",{"$f":"ROUND(IF(OR(B34=0,B35=0),0,(B35*0.17)),2)","v":0}]
["Cost of Field Work:",0]
["Vac. Events Report       Date of Report:",null,null,"$550.00 – 1st Event\n$100.00 – Others",{"$f":"(IF(OR(COUNTA(A38:B41)=0,B36=0),0,IF(COUNTA(A38:B41)=1,550,IF(COUNTA(A38:B41)>1,550+((COUNTA(A38:B41)-1)*100),0))))","v":0}]
["List Dates of Events:"]
[]
[]
[]
[]
["Vacuum Event Planning",null,null,"$82.50 per event",{"$f":"B43*82.5","v":0}]
["Number of Events:"]
["Vacuum Extraction Pilot Test Report",null,null,2800,{"$f":"IF(B45>0,2800,0)","v":0}]
[" Date of Report:"]
["SUBTOTAL OF THIS PAGE",null,null,{"$f":"SUM(E8:E44)","v":0},null,null,{"$f":"IF(H8=TRUE,$K$2,IF(H9=TRUE,$K$3,IF(H10=TRUE,$K$4,IF(H11=TRUE,$K$5,))))","v":0}]
["MISCELLANOUS TOTAL",null,null,{"$f":"SUM(G46)","v":0},null,null,{"$f":"IF(SUM(D46:E47)>0,1,0)","v":0}]
["Page             of                 (Miscellaneous Supplementary Sheet)"]
["PART 5.H (3)"]
["MISCELLANEOUS SUPPLEMENTARY SHEET"]
["UNIT PRICING FORM"]
["Check Event:"]
[]
[" Unit pricing for these activities is mandatory."]
["UNIT PRICE ACTIVITY",null,"RAC INVOICE NO.","RATES","COST"]
["Bid Package Preparation:\n    Provide Bid Summary with RAC Invoice.",null,null,"$0.00 - Work $0.00 - $1,999.99\n $112.00 - Work $2,000.00 -  $9,999.99\n$280.00 - Work = or>$10,000.00 \n$1,680.00 - Treatment System Installation; = or > 500 cu. yd excavation\n$560.00 - Treatment Unit Purchase  or Used Treatment System Sale",null,null,"Emergency/Initial Work   ",false,{"$f":"IF(H56=TRUE,$D$94,\"\")","v":""}]
[null,null,null,null,null,null,"Investigation Work      ",false,{"$f":"IF(H57=TRUE,$D$94,\"\")","v":""}]
["Description of work:",null,null,null,null,null,"Monitoring/Interim Work        ",false,""]
[null,null,null,null,null,null,"Corrective Action Plan Work",false,""]
["Description of work:",null,null,null,null,null,"Report Preparation ",false,""]
[]
["Treatment System Design/Engineering/Planning and Treatment System Installation Design/Engineering/Planning",null,null,"$4,500.00 (to be paid with system installation)",{"$f":"IF(C62>0,4500,0)","v":0},null,"Emergency/Initial Work   ",{"$f":"IF(H56=TRUE,1,\"\")","v":""}]
["Conveyance Notice \n(Copy of conveyance notice for each property is required for payment)",null,null,"$900.00 per affected property",{"$f":"IF(C63>0,900,0)","v":0},null,"Investigation Work      ",{"$f":"IF(H57=TRUE,2,\"\")","v":""}]
["Corrective Action Plan Construction and Operations Report",null,null,"$1,770.00 per report",{"$f":"IF(B65>0,1770,0)","v":0},null,"Monitoring/Interim Work        ",{"$f":"IF(H58=TRUE,3,\"\")","v":""}]
["Date of Report:",null,null,null,null,null,"Corrective Action Plan Work",{"$f":"IF(H59=TRUE,4,\"\")","v":""}]
["P & A Report             Date of Report:",null,null,"17% of field work \n $560.00 Minimum \n $1,000.00 Maximum.",{"$f":"ROUND(IF(OR(B67=0,B66=0),0,IF(B67*0.17<560,560,IF(B67*0.17>1000,1000,B67*0.17))),2)","v":0},null,"Report Preparation ",{"$f":"IF(H60=TRUE,5,\"\")","v":""}]
["Cost of P&A Work:",0]
["Quarterly Monitoring Reports (if applicable) – Indicate report period",null,null,"Without Active Treatment Unit\n$1,680.00 - Initial \n$1,400.00 - Subsequent \nActive Treatment Unit\n$2,800.00 - Initial w/New Wells \n$2,520.00 - Subsequent "]
["Jan-March","April - June"]
[]
["July - Sept.","Oct. - Dec."]
[]
["Annual or Semi-Annual Report (if applicable) - Indicate report period",null,null,"Without Active Treatment Unit\n$1,960.00 - Initial\n$1,680.00 - Subsequent\nActive Treatment Unit\n$3,080.00 - Initial w/New Wells\n$2,800.00 - Subsequent"]
[]
["Start Month & Year:"]
[]
["End Month & Year:"]
[]
["State or Municipal/Parish Quarterly Discharge Monitoring Report ",null,null,"$200.00/ Report\n($75.00 for “No Discharge\")"]
["Report period(S):"]
["Permit number(s):"]
["Soil Confirmation Report         Date:\n",null,null,"17% of reimbursed\n field work performed",{"$f":"ROUND(IF(OR(B82=0,B83=0),0,(B83*0.17)),2)","v":0}]
["Cost of Field Work:",0]
["Vac. Events Report       Date of Report:",null,null,"$550.00 – 1st Event\n$100.00 – Others",{"$f":"(IF(OR(COUNTA(A86:B89)=0,B84=0),0,IF(COUNTA(A86:B89)=1,550,IF(COUNTA(A86:B89)>1,550+((COUNTA(A86:B89)-1)*100),0))))","v":0}]
["List Dates of Events:"]
[]
[]
[]
[]
["Vacuum Event Planning",null,null,"$82.50 per event",{"$f":"B91*82.5","v":0}]
["Number of Events:"]
["Vacuum Extraction Pilot Test Report",null,null,2800,{"$f":"IF(B93>0,2800,0)","v":0}]
[" Date of Report:"]
["SUBTOTAL OF THIS PAGE",null,null,{"$f":"SUM(E56:E92)","v":0},null,null,{"$f":"IF(H56=TRUE,$K$2,IF(H57=TRUE,$K$3,IF(H58=TRUE,$K$4,IF(H59=TRUE,$K$5,))))","v":0}]
["MISCELLANOUS TOTAL",null,null,{"$f":"SUM(G94)","v":0},null,null,{"$f":"IF(SUM(D94:E95)>0,1,0)","v":0}]
["Page             of                 (Miscellaneous Supplementary Sheet)"]
["PART 5.H (3)"]
["MISCELLANEOUS SUPPLEMENTARY SHEET"]
["UNIT PRICING FORM"]
["Check Event:"]
[]
[" Unit pricing for these activities is mandatory."]
["UNIT PRICE ACTIVITY",null,"RAC INVOICE NO.","RATES","COST"]
["Bid Package Preparation:\n    Provide Bid Summary with RAC Invoice.",null,null,"$0.00 - Work $0.00 - $1,999.99\n $112.00 - Work $2,000.00 -  $9,999.99\n$280.00 - Work = or>$10,000.00 \n$1,680.00 - Treatment System Installation; = or > 500 cu. yd excavation\n$560.00 - Treatment Unit Purchase  or Used Treatment System Sale",null,null,"Emergency/Initial Work   ",false,{"$f":"IF(H104=TRUE,$D$142,\"\")","v":""}]
[null,null,null,null,null,null,"Investigation Work      ",false,{"$f":"IF(H105=TRUE,$D$142,\"\")","v":""}]
["Description of work:",null,null,null,null,null,"Monitoring/Interim Work        ",false,""]
[null,null,null,null,null,null,"Corrective Action Plan Work",false,""]
["Description of work:",null,null,null,null,null,"Report Preparation ",false,""]
[]
["Treatment System Design/Engineering/Planning and Treatment System Installation Design/Engineering/Planning",null,null,"$4,500.00 (to be paid with system installation)",{"$f":"IF(C110>0,4500,0)","v":0},null,"Emergency/Initial Work   ",{"$f":"IF(H104=TRUE,1,\"\")","v":""}]
["Conveyance Notice \n(Copy of conveyance notice for each property is required for payment)",null,null,"$900.00 per affected property",{"$f":"IF(C111>0,900,0)","v":0},null,"Investigation Work      ",{"$f":"IF(H105=TRUE,2,\"\")","v":""}]
["Corrective Action Plan Construction and Operations Report",null,null,"$1,770.00 per report",{"$f":"IF(B113>0,1770,0)","v":0},null,"Monitoring/Interim Work        ",{"$f":"IF(H106=TRUE,3,\"\")","v":""}]
["Date of Report:",null,null,null,null,null,"Corrective Action Plan Work",{"$f":"IF(H107=TRUE,4,\"\")","v":""}]
["P & A Report             Date of Report:",null,null,"17% of field work \n $560.00 Minimum \n $1,000.00 Maximum.",{"$f":"ROUND(IF(OR(B115=0,B114=0),0,IF(B115*0.17<560,560,IF(B115*0.17>1000,1000,B115*0.17))),2)","v":0},null,"Report Preparation ",{"$f":"IF(H108=TRUE,5,\"\")","v":""}]
["Cost of P&A Work:",0]
["Quarterly Monitoring Reports (if applicable) – Indicate report period",null,null,"Without Active Treatment Unit\n$1,680.00 - Initial \n$1,400.00 - Subsequent \nActive Treatment Unit\n$2,800.00 - Initial w/New Wells \n$2,520.00 - Subsequent "]
["Jan-March","April - June"]
[]
["July - Sept.","Oct. - Dec."]
[]
["Annual or Semi-Annual Report (if applicable) - Indicate report period",null,null,"Without Active Treatment Unit\n$1,960.00 - Initial\n$1,680.00 - Subsequent\nActive Treatment Unit\n$3,080.00 - Initial w/New Wells\n$2,800.00 - Subsequent"]
[]
["Start Month & Year:"]
[]
["End Month & Year:"]
[]
["State or Municipal/Parish Quarterly Discharge Monitoring Report ",null,null,"$200.00/ Report\n($75.00 for “No Discharge\")"]
["Report period(S):"]
["Permit number(s):"]
["Soil Confirmation Report         Date:\n",null,null,"17% of reimbursed\n field work performed",{"$f":"ROUND(IF(OR(B130=0,B131=0),0,(B131*0.17)),2)","v":0}]
["Cost of Field Work:",0]
["Vac. Events Report       Date of Report:",null,null,"$550.00 – 1st Event\n$100.00 – Others",{"$f":"(IF(OR(COUNTA(A134:B137)=0,B132=0),0,IF(COUNTA(A134:B137)=1,550,IF(COUNTA(A134:B137)>1,550+((COUNTA(A134:B137)-1)*100),0))))","v":0}]
["List Dates of Events:"]
[]
[]
[]
[]
["Vacuum Event Planning",null,null,"$82.50 per event",{"$f":"B139*82.5","v":0}]
["Number of Events:"]
["Vacuum Extraction Pilot Test Report",null,null,2800,{"$f":"IF(B141>0,2800,0)","v":0}]
[" Date of Report:"]
["SUBTOTAL OF THIS PAGE",null,null,{"$f":"SUM(E104:E140)","v":0},null,null,{"$f":"IF(H104=TRUE,$K$2,IF(H105=TRUE,$K$3,IF(H106=TRUE,$K$4,IF(H107=TRUE,$K$5,))))","v":0}]
["MISCELLANOUS TOTAL",null,null,{"$f":"SUM(G142)","v":0},null,null,{"$f":"IF(SUM(D142:E143)>0,1,0)","v":0}]
["Page             of                 (Miscellaneous Supplementary Sheet)"]
["PART 5.H (3)"]
["MISCELLANEOUS SUPPLEMENTARY SHEET"]
["UNIT PRICING FORM"]
["Check Event:"]
[]
[" Unit pricing for these activities is mandatory."]
["UNIT PRICE ACTIVITY",null,"RAC INVOICE NO.","RATES","COST"]
["Bid Package Preparation:\n    Provide Bid Summary with RAC Invoice.",null,null,"$0.00 - Work $0.00 - $1,999.99\n $112.00 - Work $2,000.00 -  $9,999.99\n$280.00 - Work = or>$10,000.00 \n$1,680.00 - Treatment System Installation; = or > 500 cu. yd excavation\n$560.00 - Treatment Unit Purchase  or Used Treatment System Sale",null,null,"Emergency/Initial Work   ",false,{"$f":"IF(H152=TRUE,$D$190,\"\")","v":""}]
[null,null,null,null,null,null,"Investigation Work      ",false,{"$f":"IF(H153=TRUE,$D$190,\"\")","v":""}]
["Description of work:",null,null,null,null,null,"Monitoring/Interim Work        ",false,""]
[null,null,null,null,null,null,"Corrective Action Plan Work",false,""]
["Description of work:",null,null,null,null,null,"Report Preparation ",false,""]
[]
["Treatment System Design/Engineering/Planning and Treatment System Installation Design/Engineering/Planning",null,null,"$4,500.00 (to be paid with system installation)",{"$f":"IF(C158>0,4500,0)","v":0},null,"Emergency/Initial Work   ",{"$f":"IF(H152=TRUE,1,\"\")","v":""}]
["Conveyance Notice \n(Copy of conveyance notice for each property is required for payment)",null,null,"$900.00 per affected property",{"$f":"IF(C159>0,900,0)","v":0},null,"Investigation Work      ",{"$f":"IF(H153=TRUE,2,\"\")","v":""}]
["Corrective Action Plan Construction and Operations Report",null,null,"$1,770.00 per report",{"$f":"IF(B161>0,1770,0)","v":0},null,"Monitoring/Interim Work        ",{"$f":"IF(H154=TRUE,3,\"\")","v":""}]
["Date of Report:",null,null,null,null,null,"Corrective Action Plan Work",{"$f":"IF(H155=TRUE,4,\"\")","v":""}]
["P & A Report             Date of Report:",null,null,"17% of field work \n $560.00 Minimum \n $1,000.00 Maximum.",{"$f":"ROUND(IF(OR(B163=0,B162=0),0,IF(B163*0.17<560,560,IF(B163*0.17>1000,1000,B163*0.17))),2)","v":0},null,"Report Preparation ",{"$f":"IF(H156=TRUE,5,\"\")","v":""}]
["Cost of P&A Work:",0]
["Quarterly Monitoring Reports (if applicable) – Indicate report period",null,null,"Without Active Treatment Unit\n$1,680.00 - Initial \n$1,400.00 - Subsequent \nActive Treatment Unit\n$2,800.00 - Initial w/New Wells \n$2,520.00 - Subsequent "]
["Jan-March","April - June"]
[]
["July - Sept.","Oct. - Dec."]
[]
["Annual or Semi-Annual Report (if applicable) - Indicate report period",null,null,"Without Active Treatment Unit\n$1,960.00 - Initial\n$1,680.00 - Subsequent\nActive Treatment Unit\n$3,080.00 - Initial w/New Wells\n$2,800.00 - Subsequent"]
[]
["Start Month & Year:"]
[]
["End Month & Year:"]
[]
["State or Municipal/Parish Quarterly Discharge Monitoring Report ",null,null,"$200.00/ Report\n($75.00 for “No Discharge\")"]
["Report period(S):"]
["Permit number(s):"]
["Soil Confirmation Report         Date:\n",null,null,"17% of reimbursed\n field work performed",{"$f":"ROUND(IF(OR(B178=0,B179=0),0,(B179*0.17)),2)","v":0}]
["Cost of Field Work:",0]
["Vac. Events Report       Date of Report:",null,null,"$550.00 – 1st Event\n$100.00 – Others",{"$f":"(IF(OR(COUNTA(A182:B185)=0,B180=0),0,IF(COUNTA(A182:B185)=1,550,IF(COUNTA(A182:B185)>1,550+((COUNTA(A182:B185)-1)*100),0))))","v":0}]
["List Dates of Events:"]
[]
[]
[]
[]
["Vacuum Event Planning",null,null,"$82.50 per event",{"$f":"B187*82.5","v":0}]
["Number of Events:"]
["Vacuum Extraction Pilot Test Report",null,null,2800,{"$f":"IF(B189>0,2800,0)","v":0}]
[" Date of Report:"]
["SUBTOTAL OF THIS PAGE",null,null,{"$f":"SUM(E152:E188)","v":0},null,null,{"$f":"IF(H152=TRUE,$K$2,IF(H153=TRUE,$K$3,IF(H154=TRUE,$K$4,IF(H155=TRUE,$K$5,))))","v":0}]
["MISCELLANOUS TOTAL",null,null,{"$f":"SUM(G190)","v":0},null,null,{"$f":"IF(SUM(D190:E191)>0,1,0)","v":0}]
["Page             of                 (Miscellaneous Supplementary Sheet)"]
["PART 5.H (3)"]
["MISCELLANEOUS SUPPLEMENTARY SHEET"]
["UNIT PRICING FORM"]
["Check Event:"]
[]
[" Unit pricing for these activities is mandatory."]
["UNIT PRICE ACTIVITY",null,"RAC INVOICE NO.","RATES","COST"]
["Bid Package Preparation:\n    Provide Bid Summary with RAC Invoice.",null,null,"$0.00 - Work $0.00 - $1,999.99\n $112.00 - Work $2,000.00 -  $9,999.99\n$280.00 - Work = or>$10,000.00 \n$1,680.00 - Treatment System Installation; = or > 500 cu. yd excavation\n$560.00 - Treatment Unit Purchase  or Used Treatment System Sale",null,null,"Emergency/Initial Work   ",false,{"$f":"IF(H200=TRUE,$D$238,\"\")","v":""}]
[null,null,null,null,null,null,"Investigation Work      ",false,{"$f":"IF(H201=TRUE,$D$238,\"\")","v":""}]
["Description of work:",null,null,null,null,null,"Monitoring/Interim Work        ",false,""]
[null,null,null,null,null,null,"Corrective Action Plan Work",false,""]
["Description of work:",null,null,null,null,null,"Report Preparation ",false,""]
[]
["Treatment System Design/Engineering/Planning and Treatment System Installation Design/Engineering/Planning",null,null,"$4,500.00 (to be paid with system installation)",{"$f":"IF(C206>0,4500,0)","v":0},null,"Emergency/Initial Work   ",{"$f":"IF(H200=TRUE,1,\"\")","v":""}]
["Conveyance Notice \n(Copy of conveyance notice for each property is required for payment)",null,null,"$900.00 per affected property",{"$f":"IF(C207>0,900,0)","v":0},null,"Investigation Work      ",{"$f":"IF(H201=TRUE,2,\"\")","v":""}]
["Corrective Action Plan Construction and Operations Report",null,null,"$1,770.00 per report",{"$f":"IF(B209>0,1770,0)","v":0},null,"Monitoring/Interim Work        ",{"$f":"IF(H202=TRUE,3,\"\")","v":""}]
["Date of Report:",null,null,null,null,null,"Corrective Action Plan Work",{"$f":"IF(H203=TRUE,4,\"\")","v":""}]
["P & A Report             Date of Report:",null,null,"17% of field work \n $560.00 Minimum \n $1,000.00 Maximum.",{"$f":"ROUND(IF(OR(B211=0,B210=0),0,IF(B211*0.17<560,560,IF(B211*0.17>1000,1000,B211*0.17))),2)","v":0},null,"Report Preparation ",{"$f":"IF(H204=TRUE,5,\"\")","v":""}]
["Cost of P&A Work:",0]
["Quarterly Monitoring Reports (if applicable) – Indicate report period",null,null,"Without Active Treatment Unit\n$1,680.00 - Initial \n$1,400.00 - Subsequent \nActive Treatment Unit\n$2,800.00 - Initial w/New Wells \n$2,520.00 - Subsequent "]
["Jan-March","April - June"]
[]
["July - Sept.","Oct. - Dec."]
[]
["Annual or Semi-Annual Report (if applicable) - Indicate report period",null,null,"Without Active Treatment Unit\n$1,960.00 - Initial\n$1,680.00 - Subsequent\nActive Treatment Unit\n$3,080.00 - Initial w/New Wells\n$2,800.00 - Subsequent"]
[]
["Start Month & Year:"]
[]
["End Month & Year:"]
[]
["State or Municipal/Parish Quarterly Discharge Monitoring Report ",null,null,"$200.00/ Report\n($75.00 for “No Discharge\")"]
["Report period(S):"]
["Permit number(s):"]
["Soil Confirmation Report         Date:\n",null,null,"17% of reimbursed\n field work performed",{"$f":"ROUND(IF(OR(B226=0,B227=0),0,(B227*0.17)),2)","v":0}]
["Cost of Field Work:",0]
["Vac. Events Report       Date of Report:",null,null,"$550.00 – 1st Event\n$100.00 – Others",{"$f":"(IF(OR(COUNTA(A230:B233)=0,B228=0),0,IF(COUNTA(A230:B233)=1,550,IF(COUNTA(A230:B233)>1,550+((COUNTA(A230:B233)-1)*100),0))))","v":0}]
["List Dates of Events:"]
[]
[]
[]
[]
["Vacuum Event Planning",null,null,"$82.50 per event",{"$f":"B235*82.5","v":0}]
["Number of Events:"]
["Vacuum Extraction Pilot Test Report",null,null,2800,{"$f":"IF(B237>0,2800,0)","v":0}]
[" Date of Report:"]
["SUBTOTAL OF THIS PAGE",null,null,{"$f":"SUM(E200:E236)","v":0},null,null,{"$f":"IF(H200=TRUE,$K$2,IF(H201=TRUE,$K$3,IF(H202=TRUE,$K$4,IF(H203=TRUE,$K$5,))))","v":0}]
["MISCELLANOUS TOTAL",null,null,{"$f":"SUM(G238)","v":0},null,null,{"$f":"IF(SUM(D238:E239)>0,1,0)","v":0}]
["Page             of                 (Miscellaneous Supplementary Sheet)"]

{"sheet":"Miscellaneous 4","index":18,"n_rows":39,"n_cols":12,"rows_kept":39,"cut":false,"hidden":false,"merged":[[22,2,23,2],[22,3,23,3],[22,4,23,4],[38,0,38,4],[22,0,22,1],[26,0,26,1],[30,0,30,1],[30,3,34,3],[30,2,34,2],[36,3,36,4],[35,3,35,4],[35,0,35,2],[36,0,36,2],[30,4,34,4],[24,2,25,2],[24,3,25,3],[24,4,25,4],[26,2,29,2],[26,3,29,3],[26,4,29,4],[0,0,0,4],[1,0,1,4],[3,0,3,4],[2,0,2,4],[4,0,4,4],[13,4,14,4],[6,0,6,1],[7,2,8,2],[7,4,8,4],[10,4,11,4],[10,2,11,2],[13,0,13,1],[6,3,12,3],[5,0,5,1],[13,3,14,3],[13,2,14,2],[15,0,15,1],[16,4,17,4],[19,4,20,4],[16,2,17,2],[19,2,20,2],[15,3,21,3]]}
["PART 5.H (4)"]
["MISCELLANEOUS SUPPLEMENTARY SHEET"]
["UNIT PRICING FORM"]
["Check Event:"]
["Unit pricing for these activities is mandatory."]
["UNIT PRICE ACTIVITY",null,"RAC INVOICE NO.","RATES","COST",null,null,null,"Sheet total",null,"Sheet 1-3 total"]
["Corrective Action Plan ",null,null," $6,720.00 - Initial CAP Development\n\n $3,920.00 - CAP Addendum – Cont’d. Operation  of Systems\n\n 5%     CAP for Vacuum Events  '               (maximum - $3,920)   \n\n 10%    All Others \n(maximum - $3,920)\n\n$200 – CAP Addendum requesting additional funds for excavation",null,null,"Report Preparation ",false,{"$f":"IF(H7=TRUE,D36,\"\")","v":""},"Report Preparation",{"$f":"'Miscellaneous 3'!K6","v":0},{"$f":"SUM(I7,K7)","v":0}]
[" Date of Work Plan:"]
["Description of Work Plan:",null,null,null,null,null,"Report Preparation ",{"$f":"IF(H7=TRUE,5,\"\")","v":""}]
[]
[" Date of Work Plan:"]
["Description of Work Plan:"]
[]
["Plugging & Abandonment Work Plan",null,null,100,{"$f":"IF(B15>0,100,0)","v":0}]
["Date of Work Plan:"]
["Risk Evaluation/Corrective Action Report – Appendix I Sites Only\n\n",null,null,"$6,720.00 Appendix I Only\n   + $500.00 Appendix I and > 20\n       Borings\n   + $500.00 Appendix I and Diesel\n       or Used Oil\n   + $500.00 Enclosed Space\n$3,360.00 MO-1 Only\n$500.00 Response to TL/ROG\n              requested revisions\n$560.00 Input Parameter Form"]
[" Date of Report:"]
[" Description of Report:"]
[]
[" Date of Report:"]
[" Description of Report:"]
[]
["Remediation Oversight Group Meeting Preparation and Attendance",null,null,"$675.00 per meeting",{"$f":"IF(C23>0,675,0)","v":0}]
["Date of Meeting: "]
["Site Investigation Report            Date:",null,null,"17% of reimbursed field work performed",{"$f":"ROUND(IF(OR(B25=0,B26=0),0,(B26*0.17)),2)","v":0}]
["Cost of Field Work:",0]
["Site Investigation or Soil Confirmation Work Plan",null,null,"4% of approved field work in work plan\n($500 minimum)",{"$f":"ROUND(IF(OR(B28=0,B30=0),0,IF(B30*0.04>=500,B30*0.04,500)),2)","v":0}]
["Date of Work Plan:"]
["Date of Team Leader Approval:"]
["Cost of Approved Field Work:"]
["Trust Fund Reimbursement for Application Preparation/Invoicing Work",null,null,"$50.00 - Between $.01 and\n$249.99\n$115.00 - Between $250.00\nand $999.99\n$280.00 - Between $1,000.00\nand $29,999.99\n$560.00 - $30,000 and above"]
["July – September","October - December"]
[{"$f":"IF('Part 1'!E29=\"\",\"\",'Part 1'!E29)","v":""},{"$f":"IF('Part 1'!E31=\"\",\"\",'Part 1'!E31)","v":""}]
["January – March","April - June"]
[{"$f":"IF('Part 1'!E33=\"\",\"\",'Part 1'!E33)","v":""},{"$f":"IF('Part 1'!E35=\"\",\"\",'Part 1'!E35)","v":""}]
["SUBTOTAL OF THIS PAGE",null,null,{"$f":"SUM(E7:E35)","v":0}]
["TOTAL MISCELLANEOUS COSTS",null,null,{"$f":"L7","v":0},null,null,{"$f":"IF(D37>0,1,0)","v":0}]
[]
["Page               of                 (Miscellaneous Supplementary Sheet)"]

{"sheet":"Part 6","index":19,"n_rows":31,"n_cols":18,"rows_kept":31,"cut":false,"hidden":false,"merged":[[7,8,7,9],[6,6,6,10],[26,0,26,1],[25,0,25,1],[25,3,25,4],[8,1,8,7],[8,9,8,10],[12,0,12,1],[11,0,11,1],[10,0,10,1],[10,5,10,6],[11,5,11,6],[12,5,12,6],[10,3,10,4],[12,3,12,4],[11,3,11,4],[12,8,12,10],[20,3,20,4],[20,8,20,10],[15,8,15,10],[15,5,15,6],[20,5,20,6],[13,5,13,6],[13,3,13,4],[15,3,15,4],[14,0,14,1],[14,5,14,6],[21,3,21,4],[16,3,16,4],[17,3,17,4],[16,5,16,6],[17,5,17,6],[18,5,18,6],[18,3,18,4],[19,3,19,4],[19,5,19,6],[14,3,14,4],[15,0,15,1],[20,0,20,1],[22,5,22,6],[22,8,22,10],[18,8,18,10],[19,8,19,10],[24,0,24,1],[23,0,23,1],[18,0,18,1],[19,0,19,1],[22,0,22,1],[21,0,21,1],[26,3,26,4],[29,3,29,4],[21,8,21,10],[23,8,23,10],[24,8,24,10],[25,8,25,10],[26,8,26,10],[26,5,26,6],[29,5,29,6],[23,5,23,6],[24,5,24,6],[25,5,25,6],[23,3,23,4],[24,3,24,4],[21,5,21,6],[22,3,22,4],[0,0,0,10],[1,0,1,10],[2,0,2,10],[3,0,3,10],[4,0,4,10],[5,0,5,10],[16,0,16,1],[17,0,17,1],[16,8,16,10],[17,8,17,10],[7,5,7,6],[9,0,9,1],[7,1,7,4],[9,8,9,10],[9,5,9,6],[9,3,9,4],[10,8,10,10],[11,8,11,10],[13,8,13,10],[14,8,14,10],[13,0,13,1],[29,0,29,1],[29,8,29,10],[30,0,30,6],[30,7,30,10],[27,0,27,1],[27,3,27,4],[27,5,27,6],[27,8,27,10],[28,0,28,1],[28,3,28,4],[28,5,28,6],[28,8,28,10]]}
["PART 6"]
["RAC OR OWNER INVOICE SUMMARY"]
[]
["List in chronological order, all RAC invoices to the owner and all other invoices billed directly to the owner on this sheet. Each application can"]
["not address invoices dated for a period of more than one fiscal year (July 1 thru June 30).  Copies of all listed invoices must be attached."]
["Outside invoices/receipts must be attached to the appropriate RAC/Owner Invoice."]
[null,null,null,null,null,null,{"$f":"IF(OR(H8=\"\",K8=\"\",M31>0,AND(O12=0,M31=0)),\"MISSING INFORMATION\",\"\")","v":"MISSING INFORMATION"}]
["Site Name:",{"$f":"IF('Part 1'!A20>0,'Part 1'!A20,\"\")","v":""},null,null,null,"Invoicing Period:",null,null,"through"]
["Site Address:",{"$f":"IF('Part 1'!A22>0,'Part 1'!A22&\",  \"&'Part 1'!A24&\",  \"&'Part 1'!C24,\"\")","v":""},null,null,null,null,null,null,"AIN:",{"$f":"IF('Part 1'!E24>0,'Part 1'!E24,\"\")","v":""}]
["WORKED PERFORMED           (TIME PERIOD)",null,"INVOICE DATE","COMPANY NAME",null,"INVOICE NO.",null,"AMOUNT","DEQ COMMENTS",null,null,null,"Missing Invoice Info"]
[null,null,null,null,null,null,null,null,null,null,null,null,{"$f":"IF(OR(AND(A11=\"\",OR(C11>0,D11>0,F11>0,H11>0)), AND(C11=\"\",OR(A11>0,D11>0,F11>0,H11>0)), AND(D11=\"\",OR(A11>0,C11>0,F11>0,H11>0)), AND(F11=\"\",OR(A11>0,C11>0,D11>0,H11>0)), AND(H11=\"\",OR(A11>0,C11>0,D11>0,F11>0))),TRUE,FALSE)","v":false},"part 5",{"$f":"'Part 5'!A3","v":0},{"$f":"ROUND(O11,2)","v":0},null,{"$f":"IF(F11=\"\",\"\",F11&\"; \")","v":""}]
[null,null,null,null,null,null,null,null,null,null,null,null,{"$f":"IF(OR(AND(A12=\"\",OR(C12>0,D12>0,F12>0,H12>0)), AND(C12=\"\",OR(A12>0,D12>0,F12>0,H12>0)), AND(D12=\"\",OR(A12>0,C12>0,F12>0,H12>0)), AND(F12=\"\",OR(A12>0,C12>0,D12>0,H12>0)), AND(H12=\"\",OR(A12>0,C12>0,D12>0,F12>0))),TRUE,FALSE)","v":false},"part 6",{"$f":"H31","v":0},{"$f":"ROUND(O12,2)","v":0},null,{"$f":"IF(F12=\"\",\"\",F12&\"; \")","v":""}]
[null,null,null,null,null,null,null,null,null,null,null,null,false,null,null,null,null,""]
[null,null,null,null,null,null,null,null,null,null,null,null,false,{"$f":"IF(P11=P12,0,1)","v":0},null,null,null,""]
[null,null,null,null,null,null,null,null,null,null,null,null,false,null,null,null,null,""]
[null,null,null,null,null,null,null,null,null,null,null,null,false,null,null,null,null,""]
[null,null,null,null,null,null,null,null,null,null,null,null,false,null,null,null,null,""]
[null,null,null,null,null,null,null,null,null,null,null,null,false,null,null,null,null,""]
[null,null,null,null,null,null,null,null,null,null,null,null,false,null,null,null,null,""]
[null,null,null,null,null,null,null,null,null,null,null,null,false,null,null,null,null,""]
[null,null,null,null,null,null,null,null,null,null,null,null,false,null,null,null,null,""]
[null,null,null,null,null,null,null,null,null,null,null,null,false,null,null,null,null,""]
[null,null,null,null,null,null,null,null,null,null,null,null,false,null,null,null,null,""]
[null,null,null,null,null,null,null,null,null,null,null,null,false,null,null,null,null,""]
[null,null,null,null,null,null,null,null,null,null,null,null,false,null,null,null,null,""]
[null,null,null,null,null,null,null,null,null,null,null,null,false,null,null,null,null,""]
[null,null,null,null,null,null,null,null,null,null,null,null,false,null,null,null,null,""]
[null,null,null,null,null,null,null,null,null,null,null,null,false,null,null,null,null,""]
[null,null,null,null,null,null,null,null,null,null,null,null,false,null,null,null,null,""]
[null,null,null,null,null,null,null,null,null,null,null,null,false,null,null,null,null,""]
["TOTAL RAC OR OWNER INVOICE SUMMARY",null,null,null,null,null,null,{"$f":"SUM(H11:H30)","v":0},null,null,null,null,{"$f":"COUNTIF(M11:M30,TRUE)","v":0}]

{"sheet":"Part 7","index":20,"n_rows":48,"n_cols":24,"rows_kept":48,"cut":false,"hidden":false,"merged":[[37,0,37,21],[16,0,16,15],[16,16,16,21],[17,1,17,21],[33,0,33,8],[33,9,33,11],[29,9,29,11],[31,0,31,5],[35,0,35,21],[36,0,36,21],[33,17,33,20],[33,12,33,16],[30,9,30,11],[30,17,30,20],[34,9,34,11],[34,17,34,20],[26,0,26,21],[27,7,27,21],[27,0,27,6],[31,6,31,21],[29,0,29,8],[29,12,29,16],[29,17,29,20],[41,0,41,21],[47,0,47,21],[39,0,39,21],[40,0,40,21],[44,0,44,7],[42,0,42,1],[44,16,44,21],[46,17,46,21],[42,2,42,9],[46,3,46,9],[44,11,44,15],[44,8,44,10],[46,11,46,16],[42,11,42,14],[42,15,42,21],[9,0,9,21],[10,0,10,21],[11,0,11,9],[12,0,12,9],[18,0,18,21],[15,8,15,21],[15,0,15,7],[11,20,11,21],[12,19,12,20],[11,18,11,19],[12,15,12,18],[11,15,11,17],[11,11,11,14],[12,11,12,14],[14,5,14,21],[8,0,8,21],[0,0,0,21],[1,0,1,21],[4,4,4,21],[6,0,6,6],[6,7,6,21],[4,0,4,3],[22,19,22,21],[23,19,23,21],[24,5,24,8],[24,9,24,21],[22,1,22,8],[23,1,23,8],[22,12,22,18],[23,12,23,18],[22,9,22,11],[23,9,23,11],[19,16,19,21],[19,0,19,15],[20,0,20,21],[21,1,21,8],[21,12,21,18],[21,19,21,21],[21,9,21,11]]}
["PART 7"]
["TREATMENT SYSTEM TRACKING FORM"]
[]
[]
["Name of Current Site:",null,null,null,{"$f":"IF('Part 1'!A20>0,\"\"&\"  \"&'Part 1'!A20,\"\")","v":""}]
[]
["Agency Interest Number (AIN):",null,null,null,null,null,null,{"$f":"IF('Part 1'!E24>0,'Part 1'!E24,\"\")","v":""}]
[]
["Please provide the following for groundwater or vapor recovery equipment in use at the above listed site for"]
["which reimbursement is being ,or will be, requested."]
["1.      Detailed invoice indicating price of major components must be supplied."]
["        Purchase",null,null,null,null,null,null,null,null,null,"Cost",null,null,null,null,"Invoice No. ",null,null,null,null,"(Invoice attached)"]
["       Rental (5% of unit cost-DEQ approval only)",null,null,null,null,null,null,null,null,null,"Rate ",null,null,null,null,"Minimum Term:",null,null,null,null,null,"Months"]
[]
["2.      Manufacturer’s Name"]
["3.      Serial Number of Equipment"]
["4.      Prior location of the unit, if previously used at another site (include AIN)"]
[]
["5.      Brief information on the unit: (Please check appropriate method noted below)"]
[null,null,null,null,null,null,null,null,null,null,null,null,null,null,null,null,null,null,null,null,null,null,null,{"$f":"IF(F15>0,1,0)","v":0}]
["         Major Components and Manufacturer's Recommendations:"]
[null,"Motor Size (quantity and size)",null,null,null,null,null,null,null,null,null,null,"Carbon Filter (yes/no, size)"]
[null,"Pump (quantity and size)",null,null,null,null,null,null,null,null,null,null,"Oil Capacity (in gallons)"]
["   ","Air Stripper (flow rate)",null,null,null,null,null,null,null,null,null,null,"Oil Change Frequency"]
[null,null,null,null,null,"Other"]
[]
["6.       Period Operated (If original location, please estimate number of months of expected use at the site.)"]
["          Original Location/AIN:"]
[]
["          (Estimated time-frame) From",null,null,null,null,null,null,null,null,null,null,null,"Length of uses"]
[null,null,null,null,null,null,null,null,null,"(Installation Date)",null,null,null,null,null,null,null,"(Estimated Time)"]
["           New Location/ AIN:."]
[]
["          (Estimated time-frame) From",null,null,null,null,null,null,null,null,null,null,null,"Length of uses"]
[null,null,null,null,null,null,null,null,null,"(Installation Date)",null,null,null,null,null,null,null,"(Estimated Time)"]
["DEQ USE ONLY:"]
["Cost Comparison:  Purchase vs. Rental of the Treatment System "]
["No. Of  Months Projected for Use at the Site (                 ) X .05 of Cost of Unit (                     )=$"]
[]
["I hereby certify that all of the above information is true and correct to the best of my knowledge and I agree to "]
["notify the Trust Fund Section, in writing, indicating the specific address of the relocation of the treatment"]
["equipment as soon as possible, but prior to relocation of the equipment."]
["RAC Name:",null,null,null,null,null,null,null,null,null,"  ","*Signature: ",null,null,null,{"$f":"IF(OR(L12=\"\",S12=\"\",I16=\"\",J22=\"\",J23=\"\",J24=\"\",T22=\"\",T23=\"\",T24=\"\"),\"MISSING INFORMATION\",\"\")","v":"MISSING INFORMATION"}]
[]
["Owner, Operator, or RP Name:",null,null,null,null,null,null,null,null,null,null,"Title of Signatory:"]
[]
["Telefax Number:",null,null,null,null,null,null,null,null,null,null,"Telephone Number:"]
["* Signature is required of Owner, Operator, RP, or RAC (person purchasing unit).  RAC signature is required for rental."]

{"sheet":"Part 8","index":21,"n_rows":46,"n_cols":11,"rows_kept":46,"cut":false,"hidden":false,"merged":[[41,2,41,5],[43,0,43,1],[43,2,43,7],[39,1,39,7],[45,0,45,2],[45,3,45,7],[41,0,41,1],[35,0,35,8],[17,0,17,8],[18,0,18,8],[23,0,23,8],[27,0,27,8],[28,0,28,8],[31,0,31,8],[32,0,32,8],[26,7,26,8],[26,0,26,5],[30,7,30,8],[30,0,30,5],[34,0,34,7],[37,1,37,3],[29,6,29,8],[44,3,44,7],[15,0,15,8],[0,0,0,8],[1,0,1,8],[2,0,2,8],[4,0,4,8],[5,0,5,8],[7,0,7,8],[8,0,8,8],[9,0,9,8],[11,0,11,8],[12,0,12,8],[13,0,13,8],[37,6,37,8]]}
["PART 8"]
["PURCHASE AGREEMENT FORM"]
["(TREATMENT SYSTEMS ONLY)"]
[]
["1.    Treatment systems are defined as systems used in remediation of a contaminated underground storage tank "]
["       site (hereinafter referred to as “equipment”)."]
[]
["2.   The owner, operator, RP, or Response Action Contractor (RAC) (person retaining ownership) is responsible "]
["      for and will ensure that the equipment is inspected, serviced and repaired as required to ensure its continued "]
["      effectiveness."]
[]
["3.   Prior to relocating the equipment to another site, the owner, operator, RP, or RAC will notify the Trust Fund "]
["      Fund Section of the Financial Services Division of the relocation by completing a new Treatment System "]
["      Tracking Form."]
[]
["4.   After selling the equipment, the owner, operator, RP, or RAC will reimburse the Trust Fund all proceeds. "]
[]
["5.   If the owner, operator, RP, or RAC relocates the equipment to a non-Trust Fund site, the owner, operator, RP  "]
["      or RAC will reimburse the Trust Fund ten percent (10%) of the purchase cost of the equipment."]
[]
[]
[]
[]
["I agree to comply with the terms and conditions as stated above."]
[]
[]
[{"$f":"IF(OR(H31=\"\",D46=\"\",G30=\"VALUE DOES NOT MATCH PART 7\",D45=\"SERIAL NUMBER DOES NOT MATCH PART 7\"),\"MISSING INFORMATION\",\"\")","v":"MISSING INFORMATION"}]
["Signature of Owner, Operator, RP, or RAC                                                                        Date Signed"]
["    (Circle:  Owner, Operator, RP, or RAC)"]
[null,null,null,null,null,null,{"$f":"IF(AND(H31>0,H31<>'Part 7'!L12),\"VALUE DOES NOT MATCH PART 7\",\"\")","v":""}]
[null,null,null,null,null,null,null,null,null,null,{"$f":"IF(C44>0,1,0)","v":0}]
["Typed or Printed Name of Owner, Operator, RP, or RAC                                                     Cost of Unit"]
["    (Circle:  Owner, Operator, RP, or RAC)"]
[]
[]
["Mailing Address of Owner, Operator, RP, or RAC (above)"]
[]
["Phone No. ",null,null,null,null,"Telefax No. "]
[]
["Site Name:",{"$f":"IF('Part 1'!A20>0,'Part 1'!A20,\"\")","v":""}]
[]
["Agency Interest No. ",null,{"$f":"IF('Part 1'!E24>0,'Part 1'!E24,\"\")","v":""}]
[]
["Type of Equipment:"]
[null,null,null,{"$f":"IF(D46='Part 7'!I16,\"\",\"SERIAL NUMBER DOES NOT MATCH PART 7\")","v":""}]
["Equipment Serial Number:"]