{"text_format":"1","workbook":"xlsx","n_sheets":25,"sheets":["Part 1","Part 1 Cont'd","Part 2","Part2A Deductible","Part 3","Part 4","Part 5","Personnel Sheet","Soil-Water Disposal","Equipment Rent-Purchase","Hotel & Food","Travel","Transportation&Shipping","Drilling-P&A","Analysis","Miscellaneous 1","Miscellaneous 2","Miscellaneous 3","Miscellaneous 4","Part 7","Part 8","Reference","ExcData","Print Sheets","Actions to correct"],"not_rendered":{"charts":0,"images":25,"macros":1,"external_links":0,"defined_names":64,"comments":6,"pivot_tables":0},"unopened":[],"bounds":{"document_bytes":16777216,"sheet_cells":100000,"rows_first":2000,"rows_last":500,"rows_between":2000,"halvings":0,"cell_chars":16384,"cell_head_chars":4096},"cells_cut":0,"cells_raw":0,"read":"whole","date_system":"1900"}

{"sheet":"Part 1","index":0,"n_rows":47,"n_cols":11,"rows_kept":47,"cut":false,"hidden":false,"merged":[[39,0,39,7],[40,0,40,7],[42,0,42,6],[43,6,45,7],[46,0,46,7],[31,10,32,10],[32,2,32,3],[34,2,34,3],[36,0,36,7],[37,0,37,7],[23,0,24,3],[23,4,24,5],[23,6,24,7],[38,0,38,7],[25,0,25,2],[26,0,26,7],[27,0,27,1],[28,2,28,3],[30,2,30,3],[31,5,32,7],[20,0,20,3],[20,4,20,7],[21,0,21,3],[21,4,21,7],[22,0,22,3],[22,4,22,5],[22,6,22,7],[16,3,17,7],[18,0,18,3],[18,4,18,7],[12,0,12,7],[19,0,19,3],[19,4,19,7],[7,0,7,7],[8,0,8,7],[9,0,9,7],[10,0,10,7],[11,0,11,7],[0,0,0,7],[1,0,1,7],[2,0,2,7],[3,0,3,7],[4,0,4,3],[4,4,6,7],[6,1,6,3]]}
["LOUISIANA MOTOR FUELS UNDERGROUND STORAGE TANK"]
["TRUST FUND REIMBURSEMENT APPLICATION"]
["PART 1"]
["SITE IDENTIFICATION"]
["FOR DEQ OFFICE USE ONLY         ",null,null,null,"DATE RECEIVED/DATE TO BE ENTERED ON EDMS"]
["TF No.",null,"Reviewer’s\nDue Date"]
["Reviewer Name"]
["APPLICATIONS WILL BE REJECTED FOR ANY OF THE FOLLOWING REASONS:"]
["1.  Proof of payment of the appropriate deductible is not provided."]
[]
["2.  Neither a work plan or sufficient budget has been approved by the DEQ prior to the submittal of charges."]
[]
["3.  Refer to section I.C.15.f of the Guidance Document for the complete list of reasons."]
[]
[]
[]
[null,null,null,{"$f":"IF(OR(A20=\"\",E20=\"\",A22=\"\",E22=\"\",A24=\"\",G24=\"\",E24=\"\"),\"MISSING INFORMATION\",\"\")","v":"MISSING INFORMATION"}]
["A. SITE/OWNER INFORMATION"]
["Site Name – Current Name",null,null,null,"Name of Responsible Party as Identified in Part 2 - Affidavit"]
[]
["DEQ Issued \nAgency Interest No.",null,null,null,"DEQ Issued Owner Identification Number of Responsible Party"]
[]
["Site Street Address – Physical Address, Not P.O. Box",null,null,null,"City",null,"Parish"]
[null,null,null,null,null,null,null,null,null,{"$f":"IF(OR(E29>0,E31>0,E33>0,E35>0),1,0)","v":0},"Print check"]
[]
["B.  APPLICATION INFORMATION"]
["1.   This application includes ALL INVOICES to the owner (responsible party) dated from: [Check appropriate quarter(s)"]
["      and indicate year(s)]:",null,null,null,null,null,null,null,null,"Quarters","Fiscal Years"]
[null,null,null,null,null,null,null,null,null,false]
[]
[null,null,null,null,null,null,null,null,null,false]
[null,null,null,null,null,{"$f":"IF(OR(AND(E29=\"\",E31=\"\",E33=\"\",E35=\"\"),OR(AND(E29>0,J29=FALSE),AND(E29=\"\",J29=TRUE),AND(E31>0,J31=FALSE),AND(E31=\"\",J31=TRUE),AND(E33>0,J33=FALSE),AND(E33=\"\",J33=TRUE),AND(E35>0,J35=FALSE),AND(E35=\"\",J35=TRUE))),\"MISSING INFORMATION\",IF(OR(AND(AND(E29>0,E31>0),E31-E29<>0),AND(AND(E29>0,E33>0),E33-E29<>1),AND(AND(E31>0,E33>0),E33-E31<>1),AND(AND(E29>0,E35>0),E35-E29<>1),AND(AND(E31>0,E35>0),E35-E31<>1),AND(AND(E33>0,E35>0),E35-E33<>0)),\"APP CROSSES FISCAL YEARS\",\"\"))","v":"MISSING INFORMATION"},null,null,null,null,{"$f":"IF(F32=\"APP CROSSES FISCAL YEARS\", TRUE,FALSE)","v":false}]
[null,null,null,null,null,null,null,null,null,false]
[]
[null,null,null,null,null,null,null,null,null,false]
[]
["Application requests must include all invoices dated during at least one calendar quarter:  July through September, October through December, January through March, or"]
["April through June.  A single application may include invoices which cover more than one calendar quarter, provided the application includes all invoice for the entire"]
["calendar quarter or quarters.  However, all multiple calendar quarter invoices must be dated within a single state fiscal year, July 1 - June 30. Once an application is submitted"]
["to DEQ, invoices for the period submitted or any prior periods WILL NOT be accepted.  Overlapping \"Work Performed\" dates in subsequent applications is not permitted."]
["When the site’s RAC changes during a quarter, two separate applications addressing each RAC's work should be submitted."]
[]
["2.     Application Grand Total (Reflecting the eligible pre-approved costs shown on Part 5 of this application) :",null,null,null,null,null,null,{"$f":"+'Part 5'!A3","v":0}]
["3.     If applicable, indicate the following:",null,null,null,null,null,{"$f":"IF(J45<>'Part 3'!O17,\"FIRST APPLICATION INIDICATION BOXES ON PART 1 AND PART 3 DO NOT MATCH\",\"\")","v":""},null,null,"First App?"]
[null,null,null,null,null,null,null,null,null,false]
[null,null,null,null,null,null,null,null,null,false]
["(Any application submitted to the Trust Fund Management Section for work performed on or after July 1, 2022 must be submitted on this form.)"]

{"sheet":"Part 1 Cont'd","index":1,"n_rows":40,"n_cols":7,"rows_kept":40,"cut":false,"hidden":false,"merged":[[37,5,39,7],[31,0,31,7],[32,0,32,7],[33,0,33,7],[22,6,22,7],[34,3,35,4],[34,5,35,7],[35,0,35,2],[36,1,36,2],[36,3,36,4],[36,5,36,7],[38,1,38,2],[22,3,22,5],[23,3,23,5],[37,3,39,4],[30,0,30,7],[16,6,16,7],[17,6,17,7],[16,1,16,2],[17,1,17,2],[18,1,18,2],[16,3,16,5],[17,3,17,5],[18,3,18,5],[28,0,28,7],[29,0,29,7],[22,1,22,2],[23,1,23,2],[34,0,34,2],[23,6,23,7],[25,0,25,1],[26,0,26,7],[27,0,27,7],[14,0,14,7],[15,6,15,7],[15,3,15,5],[15,1,15,2],[39,1,39,2],[20,6,20,7],[21,6,21,7],[21,1,21,2],[18,6,18,7],[19,6,19,7],[19,1,19,2],[20,1,20,2],[19,3,19,5],[20,3,20,5],[21,3,21,5],[37,1,37,2],[9,2,9,5],[10,2,10,5],[7,2,7,5],[8,2,8,5],[13,0,13,7],[5,2,5,5],[6,2,6,5],[0,0,0,7],[2,0,2,1],[2,2,2,7],[3,0,3,7],[4,2,4,5]]}
["PART 1 (cont’d)"]
[]
["C. RELEASE INFORMATION",null,{"$f":"IF(AND(A6=\"\",A7=\"\",A8=\"\",A9=\"\",A10=\"\",A11=\"\"),\"MISSING INFORMATION\",\"\")","v":"MISSING INFORMATION"}]
[]
["Incident No(s). \nUse the numeric value","Date Released","Substance(s) Released"]
[]
[]
[]
[]
[]
[]
[]
[]
["D. CORRECTIVE ACTION PLAN AND ADDENDUMS"]
[]
["Addendum Submittal Date","CAP Category",null,"DEQ Approval Date",null,null,"Approved Cost"]
[]
[]
[]
[]
[]
[]
[]
[]
[]
["I certify the following:"]
[" • I have reviewed the time sheets and the personnel charges and verify that they are in line with the duties indicated "]
["    in the UST Trust Fund Cost Control Guidance Document in effect at the time the work was performed;"]
[" • the rates identified in this application are in accordance with the response action contractor equipment rate sheet;"]
[" • the travel charges contained in this application are based on the mileage logs which indicate the person traveling, "]
["    distance traveled and beginning/ending odometer readings;"]
[" • I personally examined and am familiar with the information submitted with this application, and that I "]
["    believe that the submitted information is true, accurate and complete.   "]
[]
["Preparer’s Certification (Original Signature Required)                 ",null,null,"Date Signed"]
[{"$f":"IF(OR(B37=\"\",F37=\"\",B38=\"\",B40=\"\",F38=\"\"),\"MISSING INFORMATION\",\"\")","v":"MISSING INFORMATION"}]
["Preparer’s Name",null,null,"Firm Name"]
["Telephone Number",null,null,"Mailing Address"]
["Telefax Number"]
["Email Address"]

{"sheet":"Part 2","index":2,"n_rows":50,"n_cols":14,"rows_kept":50,"cut":false,"hidden":false,"merged":[[46,0,46,5],[46,8,46,11],[47,0,47,7],[47,8,47,11],[49,1,49,6],[49,9,49,11],[44,0,44,7],[36,0,36,7],[36,8,36,11],[37,0,37,7],[37,8,37,10],[38,0,38,11],[39,0,39,11],[41,0,41,4],[41,5,41,6],[41,10,41,11],[43,0,43,5],[43,10,43,11],[31,0,31,11],[32,0,32,11],[33,0,33,11],[34,0,34,11],[35,0,35,3],[35,4,35,7],[35,8,35,10],[28,0,28,3],[28,4,28,11],[29,0,29,7],[29,8,29,11],[30,0,30,7],[30,8,30,11],[26,0,26,7],[26,8,26,11],[27,0,27,1],[27,2,27,3],[27,5,27,7],[27,8,27,11],[24,0,24,2],[24,3,24,5],[24,6,24,7],[24,8,24,10],[25,0,25,2],[25,3,25,5],[25,6,25,7],[25,8,25,10],[21,0,21,7],[21,8,21,11],[22,0,22,7],[22,8,22,11],[23,0,23,7],[23,9,23,11],[20,0,20,7],[20,8,20,11],[8,0,8,11],[9,0,9,11],[10,0,10,11],[11,0,11,11],[13,0,13,11],[14,0,14,11],[15,0,15,11],[16,0,16,11],[17,0,17,11],[18,0,18,11],[19,0,19,11],[7,0,7,11],[0,0,0,11],[1,0,1,11],[3,0,3,11],[4,0,4,11],[5,0,5,11]]}
["PART 2"]
["OWNER, OPERATOR, OR RESPONSIBLE PARTY CERTIFICATION AFFIDAVIT"]
[]
["         I certify that I have researched and determined that I have no assistance from private sources, such as"]
["insurance or other means of financial assurance, to pay for investigation or remediation costs at this site. I also"]
["certify that all oustanding financial obligations integral to this site investigation/remediation have been met."]
[]
["         I certify that this program task has been completed in accordance with La. R.S. 30:2194 et seq and"]
["La R.S. 30:2195 et seq. I have reviewed and certify that all data and documentation represented on invoices listed in"]
["section D are a true and correct representation of costs actually incurred as an integral part of site rehabilitation from"]
["motor fuel contamination and that reimbursement from the Motor Fuels Underground Storage Tank Trust Fund has"]
["not been received on any of the charges identified in this application."]
[]
["        The site owner, operator, or responsible party warrants that he has not received any fee, commission,"]
["percentage, gift, or other  consideration as a result of his employment of a person, company, corporation,"]
["individual, or firm for purposes of conducting the site assessment or rehabilitation."]
["If charges within this application are being applied toward the deductible(s), the following statement must be certified by checking the box below: "]
["       I also certify that I have paid the appropriate deductible integral to this site rehabilitation program and that proof of payment of the"]
["deductible [canceled checks and a list of corresponding invoices or Proof of Payment of Deductible Affidavit (Part 2A)] is attached."]
[]
["A. Site Owner, Operator, Responsible Party",null,null,null,null,null,null,null,"  I. Site Name"]
[{"$f":"IF('Part 1'!E20=\"\",\"\",'Part 1'!E20)","v":""},null,null,null,null,null,null,null,{"$f":"IF('Part 1'!A20>0,'Part 1'!A20,\"\")","v":""}]
["B. Mailing Address                                                                           ",null,null,null,null,null,null,null,"  J. Site Address"]
[null,null,null,null,null,null,null,null,"Physical Address:",{"$f":"IF('Part 1'!A24>0,'Part 1'!A24,\"\")","v":""}]
["City",null,null,"State",null,null,"Zip",null,"City",null,null,"Parish"]
[null,null,null," ",null,null,null,null,{"$f":"IF('Part 1'!E24>0,'Part 1'!E24,\"\")","v":""},null,null,{"$f":"IF('Part 1'!G24>0,'Part 1'!G24,\"\")","v":""}]
["C. Telephone/Telefax Numbers  ",null,null,null,null,null,null,null,"K. Agency Interest Number"]
["Telephone: ",null,null,null,"Telefax:",null,null,null,{"$f":"IF('Part 1'!A22>0,'Part 1'!A22,\"\")","v":""}]
["D.   RAC/Owner Invoice Nos.",null,null,null,{"$f":"IF(N29=\"\",\"\",LEFT(N29,LEN(N29)-2))","v":""},null,null,null,null,null,null,null,null,{"$f":"CONCATENATE('Part 4'!Q12,'Part 4'!Q13,'Part 4'!Q14,'Part 4'!Q15,'Part 4'!Q16,'Part 4'!Q17,'Part 4'!Q18,'Part 4'!Q19,'Part 4'!Q20,'Part 4'!Q21,'Part 4'!Q22,'Part 4'!Q23,'Part 4'!Q24,'Part 4'!Q25,'Part 4'!Q26,'Part 4'!Q27,'Part 4'!Q28,'Part 4'!Q29,'Part 4'!Q30,'Part 4'!Q31,)","v":""}]
["E. Signature of person designated to sign for the owner, operator, or responsible party",null,null,null,null,null,null,null," L. Federal Tax ID# if applicable\n      (SSN not applicable)"]
[]
["F. Check the appropriate box below.  The contract for work addressed in this application was signed:"]
["        Before August 1, 1995, the owner/operator/responsible party receives reimbursement.",null,null,null,null,null,null,null,null,null,null,null,null,false]
["       On or after August 1, 1995, and as required by Act 336 of the 1995 Regular Session, the RAC receives reimbursement",null,null,null,null,null,null,null,null,null,null,null,null,false]
["G. Invoices to the owner (responsible party) addressed in this application are dated for the following quarters:  [Check appropriate quarter(s) and indicate year(s)] "]
["      July 1,          -Sept 30,          .",null,null,null,"       Oct. 1,           -Dec. 31,            .",null,null,null,"      Jan 1,           - Mar 31,           .",null,null,"      Apr 1,          - June 30,            ."]
["H. Program Grand Task Total Addressed in Part 1, Part 3 and Part 5:",null,null,null,null,null,null,null,{"$f":"'Part 5'!A3","v":0}]
["       Before me, the undersigned notary public, came and appeared ",null,null,null,null,null,null,null,null,null,null,"(please print or type the name"]
["shown in E above), who, being known to me, did execute the foregoing certification affidavit in my presence, who, being duly sworn,"]
["did state under oath or affirmation that he/she executed said document for the purpose expressed therein."]
[]
["WITNESS my hand and official seal, this",null,null,null,null,null,null,"day of,",null,","]
[]
[null,null,null,null,null,null,null,null,"My commission expires"]
["Notary Public (Signature)"]
[]
[]
["Notary Public Name (Printed, typed, or stamped)",null,null,null,null,null,null,null,"Notary # or Bar Roll #( if a Louisiana notary)"]
[]
["State of",null,null,null,null,null,null,null,"County or Parish of "]

{"sheet":"Part2A Deductible","index":3,"n_rows":42,"n_cols":14,"rows_kept":42,"cut":false,"hidden":false,"merged":[[39,1,39,3],[39,6,39,7],[39,8,39,10],[34,0,34,4],[34,6,34,9],[35,0,35,10],[36,0,36,4],[36,6,36,10],[37,0,37,4],[37,6,37,10],[32,0,32,2],[32,3,32,4],[32,6,32,8],[24,0,24,1],[24,2,24,4],[24,5,24,8],[26,0,27,10],[28,4,28,8],[28,9,28,10],[29,0,29,10],[30,0,30,10],[24,9,24,10],[25,0,25,8],[25,9,25,10],[22,0,22,1],[22,2,22,4],[22,5,22,8],[22,9,22,10],[23,0,23,1],[23,2,23,4],[23,5,23,8],[23,9,23,10],[20,0,20,1],[20,2,20,4],[20,5,20,8],[20,9,20,10],[21,0,21,1],[21,2,21,4],[21,5,21,8],[21,9,21,10],[18,0,18,1],[18,2,18,4],[18,5,18,8],[18,9,18,10],[19,0,19,1],[19,2,19,4],[19,5,19,8],[19,9,19,10],[16,0,16,1],[16,2,16,4],[16,5,16,8],[16,9,16,10],[17,0,17,1],[17,2,17,4],[17,5,17,8],[17,9,17,10],[13,0,13,4],[13,5,13,8],[13,9,13,10],[14,0,14,1],[14,2,15,4],[14,5,15,8],[14,9,15,10],[15,0,15,1],[12,0,12,4],[12,5,12,8],[12,9,12,10],[0,0,0,10],[1,0,1,10],[2,0,2,10],[4,0,4,10],[5,2,5,5],[5,6,5,10],[6,0,6,10],[8,0,8,10],[9,0,9,10],[10,0,10,10],[11,0,11,10]]}
["PART 2.A"]
["PROOF OF PAYMENT OF DEDUCTIBLE AFFIDAVIT"]
["(To be completed by Response Action Contractor)"]
[]
["I,                                            (signature of principal or his designee for the response action contractor) certify"]
["that payments were made to",null,null,null,null,null," (name of response action contractor) in the"]
["amounts specified below, which were integral to the investigation/remediation of the below specified site."]
[]
["A. Name of Site"]
[{"$f":"IF('Part 1'!A20>0,'Part 1'!A20,\"\")","v":""}]
["B. Site Address (Physical address, city)"]
[{"$f":"IF('Part 1'!A24>0,'Part 1'!A24&\",  \"&'Part 1'!E24,\"\")","v":""}]
["C. Parish",null,null,null,null,"D.  Site AI No.",null,null,null,"E. Incident #"]
[{"$f":"IF('Part 1'!G24>0,'Part 1'!G24,\"\")","v":""},null,null,null,null,{"$f":"IF('Part 1'!A22>0,'Part 1'!A22,\"\")","v":""}]
["Invoice No",null,"Date of Payment Received",null,null,"Check No.",null,null,null,"Amount"]
["(As contained in application)",null,null,null,null,null,null,null,null,null,null,null,null,{"$f":"IF(J26>0,1,0)","v":0}]
[]
[]
[]
[]
[]
[]
[]
[]
[]
["Total Deductible Amount Addressed in Affidavit",null,null,null,null,null,null,null,null,{"$f":"SUM(J17:K25)","v":0}]
[{"$f":"IF(OR(C6=\"\",J14=\"\",AND(OR(A17=\"\",C17=\"\",F17=\"\",J17=\"\"),OR(A18=\"\",C18=\"\",F18=\"\",J18=\"\"),OR(A19=\"\",C19=\"\",F19=\"\",J19=\"\"),OR(A20=\"\",C20=\"\",F20=\"\",J20=\"\"),OR(A21=\"\",C21=\"\",F21=\"\",J21=\"\"),OR(A22=\"\",C22=\"\",F22=\"\",J22=\"\"),OR(A23=\"\",C23=\"\",F23=\"\",J23=\"\"),OR(A24=\"\",C24=\"\",F24=\"\",J24=\"\"),OR(A25=\"\",C25=\"\",F25=\"\",J25=\"\"))),\"MISSING INFORMATION\",\"\")","v":"MISSING INFORMATION"}]
[]
["Before me, the undersigned notary public, came and appeared",null,null,null,null,null,null,null,null,"(please print or type the name"]
["shown in first Paragraph), who, being known to me, did execute the foregoing certification affidavit in my presence, and who, being"]
["duly sworn, did state under oath or affirmation that he/she executed said document for the purpose expressed therein."]
[]
["WITNESS my hand and official seal, this",null,null,null,null,"day of,",null,null,null,","]
[]
[null,null,null,null,null,null,"My commission expires"]
["Notary Public (Signature)"]
[]
["Notary Public Name (Printed, typed, or stamped)",null,null,null,null,null,"Notary # or Bar Roll #( if a Louisiana notary)"]
[]
["State of",null,null,null,null,null,"County or Parish of"]
[]
[null,null,null,null,null,null,null," "]

{"sheet":"Part 3","index":4,"n_rows":49,"n_cols":20,"rows_kept":49,"cut":false,"hidden":false,"merged":[[48,1,48,4],[48,6,48,8],[48,9,48,12],[43,0,43,5],[45,0,45,4],[45,6,45,12],[46,0,46,5],[46,6,46,12],[42,0,42,4],[42,6,42,9],[42,10,42,12],[40,0,40,3],[40,4,40,5],[40,7,40,10],[36,0,36,5],[36,6,36,10],[36,11,36,12],[37,0,37,12],[38,0,38,12],[34,11,34,12],[35,0,35,5],[35,6,35,12],[29,0,29,5],[29,6,29,12],[30,0,30,12],[31,0,31,12],[32,0,32,12],[33,0,33,12],[34,0,34,2],[34,3,34,5],[34,6,34,10],[25,0,25,5],[25,6,25,12],[26,0,26,5],[26,6,26,12],[27,0,28,5],[27,6,28,12],[23,0,23,1],[23,2,23,4],[23,6,24,7],[23,8,24,12],[24,0,24,1],[24,2,24,4],[22,0,22,5],[22,6,22,7],[22,8,22,12],[14,0,14,12],[15,0,15,12],[16,0,16,12],[17,0,17,12],[18,0,18,5],[18,6,18,12],[19,0,19,5],[20,0,20,5],[20,6,20,12],[21,0,21,5],[21,6,21,12],[13,0,13,12],[0,0,0,12],[1,0,1,12],[3,0,3,12],[4,0,4,12],[5,0,5,12],[6,0,6,12],[7,0,7,12],[8,0,8,12],[10,0,10,12],[11,0,11,12],[12,0,12,12]]}
["PART 3"]
["RESPONSE ACTION CONTRACTOR CERTIFICATION AFFIDAVIT"]
[]
["        I certify that this program task has been completed in accordance with La. R.S. 30:2194 et seq and La. R.S. 30:2195 et seq."]
[" I have reviewed and certify that all data and documentation submitted as part of this reimbursement application are a true and"]
["correct representation of costs actually incurred as an integral part of site rehabilitation from motor fuel contamination. I also"]
["certify that  reimbursement from the Motor Fuels Underground Storage Tank Trust Fund has not been received on any of the "]
["charges identified in this application.  I agree to reimburse the owner, operator, or the responsible party of the referenced site"]
[" any monies due to him upon reimbursement from the Motor Fuels Underground Storage Tank Trust Fund."]
[]
["      The person responsible for conducting site rehabilitation warrants that he/she has not received any fee, commission,"]
[" percentage, gift, or other consideration as a result of his employment of a person, company, corporation, individual, firm, or "]
["other legal entity for purposes of conducting the site assessment or rehabilitation.  Copies of mileage logs, detailed timesheets"]
[" and RAC equipment rental rates sheets will be maintained for a period of four years following reimbursement for auditing"]
[" purposes and will be readily available upon request by the DEQ or a DEQ contractor."]
["If charges within this application are being applied toward the deductible(s), the following statement must be certified by checking the box below: "]
["       I certify that I have received payment for the appropriate deductible integral to the assessment/remediation of this site.",null,null,null,null,null,null,null,null,null,null,null,null,null,false]
[{"$f":"IF(O17<>'Part 1'!J45,\"FIRST APPLICATION INIDICATION BOXES ON PART 1 AND PART 3 DO NOT MATCH\",\"\")","v":""}]
["A.    Name principal/president of the company responsible for",null,null,null,null,null," H. Company Name"]
["       conducting the site assessment/rehabilitation"]
[]
["B. Mailing Address                                                                           ",null,null,null,null,null," I.  Response Action Contractor Telephone/Telefax Numbers"]
[null,null,null,null,null,null,"Telephone:"]
["City: ",null,"State:",null,null,"Zip: ","Telefax:"]
[]
["C.  Facility Name",null,null,null,null,null,"J.  Agency Interest Number",null,null,null,null,null,null,null,null,null,null,null,null,"  "]
[{"$f":"IF(+'Part 1'!A20=\"\",\"\",'Part 1'!A20)","v":""},null,null,null,null,null,{"$f":"IF(+'Part 1'!A22=\"\",\"\",+'Part 1'!A22)","v":""}]
["D. Signature of the principal/president of the company or his  designee responsible for conducting site assessment/rehabilitation",null,null,null,null,null,"  K.  Federal Tax ID# if applicable"]
[]
[{"$f":"IF(OR(A21=\"\",G21=\"\",A23=\"\",I23=\"\",A25=\"\",A27=\"\",G27=\"\",C25=\"\",F25=\"\",AND(O32=FALSE,O33=FALSE),AND(O35=FALSE,P35=FALSE,Q35=FALSE,R35=FALSE),G36=0),\"MISSING INFORMATION\",\"\")","v":"MISSING INFORMATION"}]
["E. Check appropriate box below.  The contract for work addressed in this application was signed:"]
["        Before August 1, 1995, the owner/operator/responsible party receives reimbursement.",null,null,null,null,null,null,null,null,null,null,null,null,null,false]
["       On or after August 1, 1995, and as required by Act 336 of the 1995 Regular Session, the RAC receives reimbursement",null,null,null,null,null,null,null,null,null,null,null,null,null,false]
["F. Invoices to the owner (responsible party) addressed in this application are dated for the following quarters:  [Check appropriate quarter(s) and indicate year(s)]"]
["      July 1,          - Sept 30,            .",null,null,"      Oct. 1,          - Dec. 31,           .",null,null,"     Jan 1,            - Mar 31,             .",null,null,null,null,"     Apr 1,         - June 30,         .",null,null,{"$f":"'Part 1'!J29","v":false},{"$f":"'Part 1'!J31","v":false},{"$f":"'Part 1'!J33","v":false},{"$f":"'Part 1'!J35","v":false}]
["G. Program Grand Task Total Addressed in Part 1, Part 2 and Part 5:",null,null,null,null,null,{"$f":"'Part 5'!A3","v":0}]
["      Before me, the undersigned notary public, came and appeared",null,null,null,null,null,null,null,null,null,null,"(please print or type the name"]
["shown in D above), who, being known to me, did execute the foregoing certification affidavit in my presence, who, being duly sworn,"]
["did state under oath or affirmation that he/she executed said document for the purpose expressed therein."]
[]
["WITNESS my hand and official seal, this",null,null,null,null,null,"day of,",null,null,null,null,","]
[]
[null,null,null,null,null,null,"My commission expires "]
["Notary Public (Signature)"]
[]
[]
["Notary Public Name (Printed, Typed, or Stamped)",null,null,null,null,null,"                Notary # or Bar Roll #( if a Louisiana notary)"]
[]
["State of",null,null,null,null,null,"County or Parish of"]

{"sheet":"Part 4","index":5,"n_rows":32,"n_cols":17,"rows_kept":32,"cut":false,"hidden":false,"merged":[[30,0,30,1],[30,3,30,4],[30,7,30,9],[31,0,31,5],[31,6,31,9],[28,0,28,1],[28,3,28,4],[28,7,28,9],[29,0,29,1],[29,3,29,4],[29,7,29,9],[26,0,26,1],[26,3,26,4],[26,7,26,9],[27,0,27,1],[27,3,27,4],[27,7,27,9],[24,0,24,1],[24,3,24,4],[24,7,24,9],[25,0,25,1],[25,3,25,4],[25,7,25,9],[22,0,22,1],[22,3,22,4],[22,7,22,9],[23,0,23,1],[23,3,23,4],[23,7,23,9],[20,0,20,1],[20,3,20,4],[20,7,20,9],[21,0,21,1],[21,3,21,4],[21,7,21,9],[18,0,18,1],[18,3,18,4],[18,7,18,9],[19,0,19,1],[19,3,19,4],[19,7,19,9],[16,0,16,1],[16,3,16,4],[16,7,16,9],[17,0,17,1],[17,3,17,4],[17,7,17,9],[14,0,14,1],[14,3,14,4],[14,7,14,9],[15,0,15,1],[15,3,15,4],[15,7,15,9],[12,0,12,1],[12,3,12,4],[12,7,12,9],[13,0,13,1],[13,3,13,4],[13,7,13,9],[9,0,9,1],[9,3,9,4],[9,7,9,9],[11,0,11,1],[11,3,11,4],[11,7,11,9],[7,1,7,4],[7,7,7,8],[8,1,8,6],[8,8,8,9],[6,6,6,9],[5,0,5,9],[0,0,0,9],[1,0,1,9],[2,0,2,9],[3,0,3,9],[4,0,4,9]]}
["PART 4"]
["RAC OR OWNER INVOICE SUMMARY"]
[]
["List in chronological order, all RAC invoices to the owner and all other invoices billed directly to the owner on this sheet. Each application can"]
["not address invoices dated for a period of more than one fiscal year (July 1 - June 30).  Copies of all listed invoices must be attached."]
["Outside invoices/receipts must be attached to the appropriate RAC/Owner Invoice."]
[null,null,null,null,null,null,{"$f":"IF(OR(G8=\"\",J8=\"\",L32>0,AND(N13=0,L32=0)),\"MISSING INFORMATION\",\"\")","v":"MISSING INFORMATION"}]
["Site Name:",{"$f":"IF('Part 1'!A20>0,'Part 1'!A20,\"\")","v":""},null,null,null,"Invoicing Period:",null,"through"]
["Site Address:",{"$f":"IF('Part 1'!A24<>\"\",('Part 1'!A24&\",  \"&'Part 1'!E24&\",  \"&'Part 1'!G24&\" Parish\"),\"\")","v":""},null,null,null,null,null,"AIN:",{"$f":"IF('Part 1'!A22>0,'Part 1'!A22,\"\")","v":""}]
["WORKED PERFORMED           (TIME PERIOD)",null,"INVOICE DATE","COMPANY NAME",null,"INVOICE NO.","AMOUNT","RAC INVOICE DESCRIPTION",null,null,null,"Missing Invoice Info"]
[]
[null,null,null,null,null,null,null,null,null,null,null,{"$f":"IF(OR(AND(A12=\"\",OR(C12>0,D12>0,F12>0,G12>0)), AND(C12=\"\",OR(A12>0,D12>0,F12>0,G12>0)), AND(D12=\"\",OR(A12>0,C12>0,F12>0,G12>0)), AND(F12=\"\",OR(A12>0,C12>0,D12>0,G12>0)), AND(G12=\"\",OR(A12>0,C12>0,D12>0,F12>0))),TRUE,FALSE)","v":false},"part 5",{"$f":"'Part 5'!A3","v":0},{"$f":"ROUND(N12,2)","v":0},null,{"$f":"IF(F12=\"\",\"\",F12&\"; \")","v":""}]
[null,null,null,null,null,null,null,null,null,null,null,false,"part 4",{"$f":"G32","v":0},{"$f":"ROUND(N13,2)","v":0},null,{"$f":"IF(F13=\"\",\"\",F13&\"; \")","v":""}]
[null,null,null,null,null,null,null,null,null,null,null,false,null,null,null,null,""]
[null,null,null,null,null,null,null,null,null,null,null,false,{"$f":"IF(O12=O13,0,1)","v":0},null,null,null,""]
[null,null,null,null,null,null,null,null,null,null,null,false,null,null,null,null,""]
[null,null,null,null,null,null,null,null,null,null,null,false,null,null,null,null,""]
[null,null,null,null,null,null,null,null,null,null,null,false,null,null,null,null,""]
[null,null,null,null,null,null,null,null,null,null,null,false,null,null,null,null,""]
[null,null,null,null,null,null,null,null,null,null,null,false,null,null,null,null,""]
[null,null,null,null,null,null,null,null,null,null,null,false,null,null,null,null,""]
[null,null,null,null,null,null,null,null,null,null,null,false,null,null,null,null,""]
[null,null,null,null,null,null,null,null,null,null,null,false,null,null,null,null,""]
[null,null,null,null,null,null,null,null,null,null,null,false,null,null,null,null,""]
[null,null,null,null,null,null,null,null,null,null,null,false,null,null,null,null,""]
[null,null,null,null,null,null,null,null,null,null,null,false,null,null,null,null,""]
[null,null,null,null,null,null,null,null,null,null,null,false,null,null,null,null,""]
[null,null,null,null,null,null,null,null,null,null,null,false,null,null,null,null,""]
[null,null,null,null,null,null,null,null,null,null,null,false,null,null,null,null,""]
[null,null,null,null,null,null,null,null,null,null,null,false,null,null,null,null,""]
[null,null,null,null,null,null,null,null,null,null,null,false,null,null,null,null,""]
["TOTAL RAC OR OWNER INVOICE SUMMARY",null,null,null,null,null,{"$f":"SUM(G12:G31)","v":0},null,null,null,null,{"$f":"COUNTIF(L12:L31,TRUE)","v":0}]

{"sheet":"Part 5","index":6,"n_rows":29,"n_cols":20,"rows_kept":29,"cut":false,"hidden":false,"merged":[[27,15,28,16],[27,17,27,18],[28,17,28,18],[27,2,28,2],[27,3,28,4],[27,5,28,6],[27,7,28,9],[27,10,28,10],[27,11,28,12],[27,13,28,14],[23,2,23,3],[23,4,23,5],[23,9,23,10],[23,12,23,14],[27,0,28,1],[24,0,24,1],[24,2,24,3],[24,4,24,5],[24,6,24,11],[24,12,24,14],[25,1,25,5],[25,6,26,11],[25,12,26,14],[26,1,26,5],[17,0,17,19],[18,0,18,5],[18,6,19,11],[18,12,19,14],[19,0,19,1],[19,2,19,3],[19,4,19,5],[20,0,20,1],[20,2,20,3],[20,4,20,5],[20,6,23,8],[20,9,20,10],[20,12,20,14],[21,0,21,1],[21,2,21,3],[21,4,21,5],[21,9,21,10],[21,12,21,14],[22,0,22,1],[22,2,22,3],[22,4,22,5],[22,9,22,10],[22,12,22,14],[23,0,23,1],[16,12,16,13],[16,14,16,17],[16,18,16,19],[13,16,13,17],[13,18,13,19],[14,0,15,3],[14,4,14,5],[14,6,14,8],[14,9,14,19],[15,4,15,5],[15,6,15,8],[15,9,15,11],[15,12,15,13],[13,0,13,1],[13,3,13,4],[13,5,13,6],[13,7,13,9],[13,12,13,13],[13,14,13,15],[16,9,16,11],[12,0,12,1],[12,3,12,4],[12,5,12,6],[12,7,12,9],[12,12,12,13],[12,14,12,15],[12,16,12,17],[12,18,12,19],[11,0,11,1],[11,3,11,4],[11,5,11,6],[11,7,11,9],[11,12,11,13],[11,14,11,15],[10,0,10,1],[10,3,10,4],[10,5,10,6],[10,7,10,9],[10,12,10,13],[10,14,10,15],[10,16,10,17],[10,18,10,19],[9,0,9,1],[9,3,9,4],[9,5,9,6],[9,7,9,9],[9,12,9,13],[9,14,9,15],[7,0,7,1],[7,3,7,4],[7,5,7,6],[7,7,7,9],[7,12,7,13],[7,14,7,15],[7,16,7,17],[7,18,7,19],[8,0,8,1],[8,3,8,4],[8,5,8,6],[8,7,8,9],[8,12,8,13],[8,14,8,15],[8,16,8,17],[8,18,8,19],[0,0,0,19],[1,0,1,1],[1,12,1,19],[2,0,3,1],[2,2,2,4],[2,5,2,9],[2,10,2,11],[2,12,2,15],[1,3,1,4],[1,5,1,7],[1,8,1,10],[5,0,5,1],[5,2,6,2],[5,3,6,4],[5,5,6,6],[5,7,6,9],[5,10,6,10],[5,11,6,11],[5,12,6,13],[4,0,4,1],[4,3,4,4],[4,5,4,6],[4,7,4,9],[4,12,4,13],[6,0,6,1],[21,15,26,19],[18,15,20,19],[2,16,2,19],[3,3,3,4],[3,5,3,6],[3,7,3,9],[3,12,3,13],[3,14,3,15],[3,16,3,17],[3,18,3,19],[4,16,4,17],[4,18,4,19],[4,14,4,15],[5,14,6,15],[5,16,6,17],[5,18,6,19],[9,16,9,17],[9,18,9,19],[11,16,11,17],[11,18,11,19],[15,14,15,17],[15,18,15,19],[16,0,16,3],[16,4,16,8]]}
["PART 5 – EVENT SUMMARY SHEET"]
["APPLICATION GRAND TOTAL  ",null,"AIN:",{"$f":"IF('Part 1'!A22>0,'Part 1'!A22,\"\")","v":""},null,"TF #:",null,null,null,null,null,"RAC Name:",{"$f":"IF('Part 3'!G21>0,'Part 3'!G21,\" \")","v":" "}]
[{"$f":"SUM(C14,F14,K14,M14,Q14,)","v":0},null,"1. Emergency/Intital Work",null,null,"2. Investigation Work\n(Field Work)",null,null,null,null,"3.  Interim Monitoring Work",null,"4.  Corrective \nAction Plan Work",null,null,null,"5.  Report \nPreparation Work"]
[null,null,"Charges","DEQ Adjusted Charges",null,"Charges",null,"DEQ Adjusted Charges",null,null,"Charges","DEQ Adjusted Charges","Charges",null,"DEQ Adjusted Charges",null,"Charges",null,"DEQ Adjusted Charges"]
["A.  Personnel",null,{"$f":"+'Personnel Sheet'!H3","v":0},0,null,{"$f":"+'Personnel Sheet'!H4","v":0},null,0,null,null,{"$f":"+'Personnel Sheet'!H5","v":0},0,{"$f":"+'Personnel Sheet'!H6","v":0},null,0,null,{"$f":"+'Personnel Sheet'!H7","v":0},null,0]
["B.  Soil/Water",null,{"$f":"+'Soil-Water Disposal'!I5","v":0},0,null,{"$f":"+'Soil-Water Disposal'!I6","v":0},null,0,null,null,{"$f":"+'Soil-Water Disposal'!I7","v":0},0,{"$f":"+'Soil-Water Disposal'!I8","v":0},null,0]
["     Disposal"]
["C.  Equipment",null,{"$f":"+'Equipment Rent-Purchase'!L6","v":0},0,null,{"$f":"+'Equipment Rent-Purchase'!L7","v":0},null,0,null,null,{"$f":"+'Equipment Rent-Purchase'!L8","v":0},0,{"$f":"+'Equipment Rent-Purchase'!L9","v":0},null,0]
["D.  Travel",null,{"$f":"+Travel!J3+'Hotel & Food'!J4","v":0},0,null,{"$f":"+'Hotel & Food'!J5+Travel!J4","v":0},null,0,null,null,{"$f":"+'Hotel & Food'!J6+Travel!J5","v":0},0,{"$f":"+'Hotel & Food'!J7+Travel!J6","v":0},null,0,null,{"$f":"+'Hotel & Food'!J8+Travel!J7","v":0},null,0]
["E. Transportation",null,{"$f":"+'Transportation&Shipping'!G5","v":0},0,null,{"$f":"+'Transportation&Shipping'!G6","v":0},null,0,null,null,{"$f":"+'Transportation&Shipping'!G7","v":0},0,{"$f":"+'Transportation&Shipping'!G8","v":0},null,0]
["F.  Drilling & \n     P & A",null,{"$f":"+'Drilling-P&A'!I9","v":0},0,null,{"$f":"+'Drilling-P&A'!I10","v":0},null,0,null,null,{"$f":"+'Drilling-P&A'!I11","v":0},0,{"$f":"+'Drilling-P&A'!I12","v":0},null,0]
["G.  Analysis",null,{"$f":"+Analysis!K3","v":0},0,null,{"$f":"+Analysis!K4","v":0},null,0,null,null,{"$f":"+Analysis!K5","v":0},0,{"$f":"+Analysis!K6","v":0},null,0]
["H.  Miscellaneous ",null,{"$f":"+'Miscellaneous 1'!H4+'Miscellaneous 2'!K3+'Miscellaneous 3'!J2","v":0},0,null,{"$f":"+'Miscellaneous 1'!H5+'Miscellaneous 2'!K4+'Miscellaneous 3'!J3+'Miscellaneous 4'!G4","v":0},null,0,null,null,{"$f":"+'Miscellaneous 1'!H6+'Miscellaneous 2'!K5+'Miscellaneous 3'!J4+'Miscellaneous 4'!G5","v":0},0,{"$f":"+'Miscellaneous 1'!H7+'Miscellaneous 2'!K6+'Miscellaneous 3'!J5+'Miscellaneous 4'!G6","v":0},null,0,null,{"$f":"+'Miscellaneous 1'!H8+'Miscellaneous 3'!J6+'Miscellaneous 4'!G7","v":0},null,0]
["Subtotals",null,{"$f":"SUM(C5:C13)","v":0},{"$f":"SUM(D5:D13)","v":0},0,0,0,0,0,0,0,0,0,0,0,0,0,0,0,0]
[{"$f":"IF(OR(E16=\"\",G16=\"\"),\"6. Dates work performed in application: MISSING INFORMATION\",\"6. Dates work performed in application:\")","v":"6. Dates work performed in application: MISSING INFORMATION"},null,null,null,"Beginning",null,"Ending",null,null,"7. Application addresses invoices to the owner dated:   (Select quarter by entering year)"]
[null,null,null,null,null,null,null,null,null,"July 1 – September 30",null,null,{"$f":"IF('Part 1'!E29>0,'Part 1'!E29,\"\")","v":""},null,"January 1 – March 31",null,null,null,{"$f":"IF('Part 1'!E33>0,'Part 1'!E33,\"\")","v":""}]
["8.        DEQ Fiscal Year (July - June)",null,null,null,{"$f":"IF((IF(AND(M16>0,M17>0,S16>0,S17>0),(MAX(IF(M16=\"\",0,M16+1),IF(M17=\"\",,M17+1),S16,S17)),\"\"))=0,\"\",(IF(AND(M16>0,M17>0,S16>0,S17>0),(MAX(IF(M16=\"\",0,M16+1),IF(M17=\"\",,M17+1),S16,S17)),\"\")))","v":""},null,null,null,null,"October 1 – December 31",null,null,{"$f":"IF('Part 1'!E31>0,'Part 1'!E31,\"\")","v":""},null,"April 1 - June 30",null,null,null,{"$f":"IF('Part 1'!E35>0,'Part 1'!E35,\"\")","v":""}]
["The area below is for DEQ Trust Fund use only:"]
["Incident Information:",null,null,null,null,null,"Total Adjusted Charges $",null,null,null,null,null,{"$f":"+D14+H14+L14+O14+S14","v":0},null,null,"DEQ Comments, Notations for\nDeductibles , Treatment Units, & Last Applications"]
["Incident No.",null,"Release Date",null,"Substance"]
[null,null,null,null,null,null,"LDEQ Adjustments",null,null,"Trust Fund No.",null,"CAP  Amount"]
[]
[]
[]
[null,null,null,null,null,null,"Deductible Amount ($)"]
["Reviewer Name",{"$f":"IF('Part 1'!B7<>\"\",'Part 1'!B7,\"\")","v":""},null,null,null,null,"LDEQ  Reimbursement $",null,null,null,null,null,{"$f":"+M19+M22+M23+M24-M25","v":0}]
["Trust Fund Number",{"$f":"IF('Part 1'!B6=\"\",\"\",'Part 1'!B6)","v":""}]
["ICAP\n Charges $",null,null,"ICAP Balance $",null,null,null,"CAP \nCharges $",null,null,null,"(ROG Aprvd.) CAP Balance $",null,null,null,"Payment To:",null,"RAC"]
[null,null,null,null,null,null,null,null,null,null,null,null,null,null,null,null,null,"Owner"]

{"sheet":"Personnel Sheet","index":7,"n_rows":66,"n_cols":17,"rows_kept":66,"cut":false,"hidden":false,"merged":[[9,0,9,5],[8,0,8,5],[42,0,42,5],[64,0,64,6],[65,0,65,6],[30,0,30,6],[31,0,31,6],[39,4,39,5],[2,4,2,6],[3,4,3,6],[4,4,4,6],[5,4,5,6],[6,0,6,1],[6,4,6,6]]}
["PART 5.A",null,null,null,null,null,null,null,null,null,null,{"$f":"+L30+L64","v":0},"Total Print check"]
["PERSONNEL SUPPLEMENTARY SHEET",null,null,null,"Costing Category Summary"]
[null,null,null,null,"Emergency/Initial Work",null,null,{"$f":"SUMIF($A$12:$A$30,E3,$H$12:$H$30)+SUMIF($A$46:$A$64,E3,$H$46:$H$64)","v":0}]
[null,null,null,null,"Investigation Work",null,null,{"$f":"SUMIF($A$12:$A$30,E4,$H$12:$H$30)+SUMIF($A$46:$A$64,E4,$H$46:$H$64)","v":0}]
[null,null,null,null,"Interim Monitoring Work",null,null,{"$f":"SUMIF($A$12:$A$30,E5,$H$12:$H$30)+SUMIF($A$46:$A$64,E5,$H$46:$H$64)","v":0}]
[null,null,null,null,"Corrective Action Plan Work",null,null,{"$f":"SUMIF($A$12:$A$30,E6,$H$12:$H$30)+SUMIF($A$46:$A$64,E6,$H$46:$H$64)","v":0}]
[{"$f":"IF(SUM(O11:O30)>0,\"MISSING INFORMATION\",\"\")","v":""},null,null,null,"Report Preparation Work",null,null,{"$f":"SUMIF($A$12:$A$30,E7,$H$12:$H$30)+SUMIF($A$46:$A$64,E7,$H$46:$H$64)","v":0}]
[]
["1.        Personnel charges for work activities included in unit pricing should not be addressed on this form."]
[]
["Costing Category","Personnel Duties","Employee Name","Hourly Rate","Work Performed\nDate,  Location (field or office) and Description","RAC Invoice No.","No.     HRS","TOTAL",null,null,null,null,null,null,"Test","Max Hours","Adjusted Hours"]
[null,null,null,{"$f":"IF(B12=\"\",\"\",VLOOKUP(B12,Reference!A$9:B$23,2,FALSE))","v":""},null,null,null,{"$f":"IF(B12=\"\",\"\",ROUND((D12*Q12),2))","v":""},null,null,null,null,null,null,{"$f":"IF(B12<>\"\",IF(OR(A12=\"\",C12=\"\",E12=\"\",F12=\"\",G12=\"\"),1,0),0)","v":0},{"$f":"IF(G12>0,VLOOKUP('Personnel Sheet'!B12,Reference!A$9:C$23,3,FALSE),0)","v":0},{"$f":"IF(G12>P12,P12,G12)","v":0}]
[null,null,null,{"$f":"IF(B13=\"\",\"\",VLOOKUP(B13,Reference!A$9:B$23,2,FALSE))","v":""},null,null,null,{"$f":"IF(B13=\"\",\"\",ROUND((D13*Q13),2))","v":""},null,null,null,null,null,null,{"$f":"IF(B13<>\"\",IF(OR(A13=\"\",C13=\"\",E13=\"\",F13=\"\",G13=\"\"),1,0),0)","v":0},{"$f":"IF(G13>0,VLOOKUP('Personnel Sheet'!B13,Reference!A$9:C$23,3,FALSE),0)","v":0},{"$f":"IF(G13>P13,P13,G13)","v":0}]
[null,null,null,{"$f":"IF(B14=\"\",\"\",VLOOKUP(B14,Reference!A$9:B$23,2,FALSE))","v":""},null,null,null,"",null,null,null,null,null,null,0,{"$f":"IF(G14>0,VLOOKUP('Personnel Sheet'!B14,Reference!A$9:C$23,3,FALSE),0)","v":0},0]
[null,null,null,{"$f":"IF(B15=\"\",\"\",VLOOKUP(B15,Reference!A$9:B$23,2,FALSE))","v":""},null,null,null,"",null,null,null,null,null,null,0,{"$f":"IF(G15>0,VLOOKUP('Personnel Sheet'!B15,Reference!A$9:C$23,3,FALSE),0)","v":0},0]
[null,null,null,{"$f":"IF(B16=\"\",\"\",VLOOKUP(B16,Reference!A$9:B$23,2,FALSE))","v":""},null,null,null,"",null,null,null,null,null,null,0,{"$f":"IF(G16>0,VLOOKUP('Personnel Sheet'!B16,Reference!A$9:C$23,3,FALSE),0)","v":0},0]
[null,null,null,{"$f":"IF(B17=\"\",\"\",VLOOKUP(B17,Reference!A$9:B$23,2,FALSE))","v":""},null,null,null,"",null,null,null,null,null,null,0,{"$f":"IF(G17>0,VLOOKUP('Personnel Sheet'!B17,Reference!A$9:C$23,3,FALSE),0)","v":0},0]
[null,null,null,{"$f":"IF(B18=\"\",\"\",VLOOKUP(B18,Reference!A$9:B$23,2,FALSE))","v":""},null,null,null,"",null,null,null,null,null,null,0,{"$f":"IF(G18>0,VLOOKUP('Personnel Sheet'!B18,Reference!A$9:C$23,3,FALSE),0)","v":0},0]
[null,null,null,{"$f":"IF(B19=\"\",\"\",VLOOKUP(B19,Reference!A$9:B$23,2,FALSE))","v":""},null,null,null,"",null,null,null,null,null,null,0,{"$f":"IF(G19>0,VLOOKUP('Personnel Sheet'!B19,Reference!A$9:C$23,3,FALSE),0)","v":0},0]
[null,null,null,{"$f":"IF(B20=\"\",\"\",VLOOKUP(B20,Reference!A$9:B$23,2,FALSE))","v":""},null,null,null,"",null,null,null,null,null,null,0,{"$f":"IF(G20>0,VLOOKUP('Personnel Sheet'!B20,Reference!A$9:C$23,3,FALSE),0)","v":0},0]
[null,null,null,{"$f":"IF(B21=\"\",\"\",VLOOKUP(B21,Reference!A$9:B$23,2,FALSE))","v":""},null,null,null,"",null,null,null,null,null,null,0,{"$f":"IF(G21>0,VLOOKUP('Personnel Sheet'!B21,Reference!A$9:C$23,3,FALSE),0)","v":0},0]
[null,null,null,{"$f":"IF(B22=\"\",\"\",VLOOKUP(B22,Reference!A$9:B$23,2,FALSE))","v":""},null,null,null,"",null,null,null,null,null,null,0,{"$f":"IF(G22>0,VLOOKUP('Personnel Sheet'!B22,Reference!A$9:C$23,3,FALSE),0)","v":0},0]
[null,null,null,{"$f":"IF(B23=\"\",\"\",VLOOKUP(B23,Reference!A$9:B$23,2,FALSE))","v":""},null,null,null,"",null,null,null,null,null,null,0,{"$f":"IF(G23>0,VLOOKUP('Personnel Sheet'!B23,Reference!A$9:C$23,3,FALSE),0)","v":0},0]
[null,null,null,{"$f":"IF(B24=\"\",\"\",VLOOKUP(B24,Reference!A$9:B$23,2,FALSE))","v":""},null,null,null,"",null,null,null,null,null,null,0,{"$f":"IF(G24>0,VLOOKUP('Personnel Sheet'!B24,Reference!A$9:C$23,3,FALSE),0)","v":0},0]
[null,null,null,{"$f":"IF(B25=\"\",\"\",VLOOKUP(B25,Reference!A$9:B$23,2,FALSE))","v":""},null,null,null,"",null,null,null,null,null,null,0,{"$f":"IF(G25>0,VLOOKUP('Personnel Sheet'!B25,Reference!A$9:C$23,3,FALSE),0)","v":0},0]
[null,null,null,{"$f":"IF(B26=\"\",\"\",VLOOKUP(B26,Reference!A$9:B$23,2,FALSE))","v":""},null,null,null,"",null,null,null,null,null,null,0,{"$f":"IF(G26>0,VLOOKUP('Personnel Sheet'!B26,Reference!A$9:C$23,3,FALSE),0)","v":0},0]
[null,null,null,{"$f":"IF(B27=\"\",\"\",VLOOKUP(B27,Reference!A$9:B$23,2,FALSE))","v":""},null,null,null,"",null,null,null,null,null,null,0,{"$f":"IF(G27>0,VLOOKUP('Personnel Sheet'!B27,Reference!A$9:C$23,3,FALSE),0)","v":0},0]
[null,null,null,{"$f":"IF(B28=\"\",\"\",VLOOKUP(B28,Reference!A$9:B$23,2,FALSE))","v":""},null,null,null,"",null,null,null,null,null,null,0,{"$f":"IF(G28>0,VLOOKUP('Personnel Sheet'!B28,Reference!A$9:C$23,3,FALSE),0)","v":0},0]
[null,null,null,{"$f":"IF(B29=\"\",\"\",VLOOKUP(B29,Reference!A$9:B$23,2,FALSE))","v":""},null,null,null,{"$f":"IF(B29=\"\",\"\",ROUND((D29*Q29),2))","v":""},null,null,null,null,null,null,{"$f":"IF(B29<>\"\",IF(OR(A29=\"\",C29=\"\",E29=\"\",F29=\"\",G29=\"\"),1,0),0)","v":0},{"$f":"IF(G29>0,VLOOKUP('Personnel Sheet'!B29,Reference!A$9:C$23,3,FALSE),0)","v":0},{"$f":"IF(G29>P29,P29,G29)","v":0}]
[null,null,null,{"$f":"IF(B30=\"\",\"\",VLOOKUP(B30,Reference!A$9:B$23,2,FALSE))","v":""},null,null,null,"",null,null,null,{"$f":"IF(SUM(H12:H30)>0,1,0)","v":0},"Print check",null,0,{"$f":"IF(G30>0,VLOOKUP('Personnel Sheet'!B30,Reference!A$9:C$23,3,FALSE),0)","v":0},0]
["*Only one individual can perform this duty for a specific time period."]
["**A limited number of hours is allowable for this position. "]
[]
[]
[]
[]
[]
["PART 5.A"]
["PERSONNEL SUPPLEMENTARY SHEET"]
[null,null,null,null,{"$f":"IF(SUM(O46:O64)>0,\"MISSING INFORMATION\",\"\")","v":""}]
[]
[]
["1.        Personnel charges for work activities included in unit pricing should not be addressed on this form."]
[]
["Costing Category","Personnel Duties","Employee Name","Hourly Rate","Work Performed\nDate,  Location (field or office) and Description","RAC Invoice No.","No.     HRS","TOTAL",null,null,null,null,null,null,"Test","Max Hours","Adjusted Hours"]
[null,null,null,{"$f":"IF(B46=\"\",\"\",VLOOKUP(B46,Reference!A$9:B$23,2,FALSE))","v":""},null,null,null,{"$f":"IF(B46=\"\",\"\",ROUND((D46*Q46),2))","v":""},null,null,null,null,null,null,{"$f":"IF(B46<>\"\",IF(OR(A46=\"\",C46=\"\",E46=\"\",F46=\"\",G46=\"\"),1,0),0)","v":0},{"$f":"IF(G46>0,VLOOKUP('Personnel Sheet'!B46,Reference!A$9:C$23,3,FALSE),0)","v":0},{"$f":"IF(G46>P46,P46,G46)","v":0}]
[null,null,null,{"$f":"IF(B47=\"\",\"\",VLOOKUP(B47,Reference!A$9:B$23,2,FALSE))","v":""},null,null,null,{"$f":"IF(B47=\"\",\"\",ROUND((D47*Q47),2))","v":""},null,null,null,null,null,null,{"$f":"IF(B47<>\"\",IF(OR(A47=\"\",C47=\"\",E47=\"\",F47=\"\",G47=\"\"),1,0),0)","v":0},{"$f":"IF(G47>0,VLOOKUP('Personnel Sheet'!B47,Reference!A$9:C$23,3,FALSE),0)","v":0},{"$f":"IF(G47>P47,P47,G47)","v":0}]
[null,null,null,{"$f":"IF(B48=\"\",\"\",VLOOKUP(B48,Reference!A$9:B$23,2,FALSE))","v":""},null,null,null,"",null,null,null,null,null,null,0,{"$f":"IF(G48>0,VLOOKUP('Personnel Sheet'!B48,Reference!A$9:C$23,3,FALSE),0)","v":0},0]
[null,null,null,{"$f":"IF(B49=\"\",\"\",VLOOKUP(B49,Reference!A$9:B$23,2,FALSE))","v":""},null,null,null,"",null,null,null,null,null,null,0,{"$f":"IF(G49>0,VLOOKUP('Personnel Sheet'!B49,Reference!A$9:C$23,3,FALSE),0)","v":0},0]
[null,null,null,{"$f":"IF(B50=\"\",\"\",VLOOKUP(B50,Reference!A$9:B$23,2,FALSE))","v":""},null,null,null,"",null,null,null,null,null,null,0,{"$f":"IF(G50>0,VLOOKUP('Personnel Sheet'!B50,Reference!A$9:C$23,3,FALSE),0)","v":0},0]
[null,null,null,{"$f":"IF(B51=\"\",\"\",VLOOKUP(B51,Reference!A$9:B$23,2,FALSE))","v":""},null,null,null,"",null,null,null,null,null,null,0,{"$f":"IF(G51>0,VLOOKUP('Personnel Sheet'!B51,Reference!A$9:C$23,3,FALSE),0)","v":0},0]
[null,null,null,{"$f":"IF(B52=\"\",\"\",VLOOKUP(B52,Reference!A$9:B$23,2,FALSE))","v":""},null,null,null,"",null,null,null,null,null,null,0,{"$f":"IF(G52>0,VLOOKUP('Personnel Sheet'!B52,Reference!A$9:C$23,3,FALSE),0)","v":0},0]
[null,null,null,{"$f":"IF(B53=\"\",\"\",VLOOKUP(B53,Reference!A$9:B$23,2,FALSE))","v":""},null,null,null,"",null,null,null,null,null,null,0,{"$f":"IF(G53>0,VLOOKUP('Personnel Sheet'!B53,Reference!A$9:C$23,3,FALSE),0)","v":0},0]
[null,null,null,{"$f":"IF(B54=\"\",\"\",VLOOKUP(B54,Reference!A$9:B$23,2,FALSE))","v":""},null,null,null,"",null,null,null,null,null,null,0,{"$f":"IF(G54>0,VLOOKUP('Personnel Sheet'!B54,Reference!A$9:C$23,3,FALSE),0)","v":0},0]
[null,null,null,{"$f":"IF(B55=\"\",\"\",VLOOKUP(B55,Reference!A$9:B$23,2,FALSE))","v":""},null,null,null,"",null,null,null,null,null,null,0,{"$f":"IF(G55>0,VLOOKUP('Personnel Sheet'!B55,Reference!A$9:C$23,3,FALSE),0)","v":0},0]
[null,null,null,{"$f":"IF(B56=\"\",\"\",VLOOKUP(B56,Reference!A$9:B$23,2,FALSE))","v":""},null,null,null,"",null,null,null,null,null,null,0,{"$f":"IF(G56>0,VLOOKUP('Personnel Sheet'!B56,Reference!A$9:C$23,3,FALSE),0)","v":0},0]
[null,null,null,{"$f":"IF(B57=\"\",\"\",VLOOKUP(B57,Reference!A$9:B$23,2,FALSE))","v":""},null,null,null,"",null,null,null,null,null,null,0,{"$f":"IF(G57>0,VLOOKUP('Personnel Sheet'!B57,Reference!A$9:C$23,3,FALSE),0)","v":0},0]
[null,null,null,{"$f":"IF(B58=\"\",\"\",VLOOKUP(B58,Reference!A$9:B$23,2,FALSE))","v":""},null,null,null,"",null,null,null,null,null,null,0,{"$f":"IF(G58>0,VLOOKUP('Personnel Sheet'!B58,Reference!A$9:C$23,3,FALSE),0)","v":0},0]
[null,null,null,{"$f":"IF(B59=\"\",\"\",VLOOKUP(B59,Reference!A$9:B$23,2,FALSE))","v":""},null,null,null,"",null,null,null,null,null,null,0,{"$f":"IF(G59>0,VLOOKUP('Personnel Sheet'!B59,Reference!A$9:C$23,3,FALSE),0)","v":0},0]
[null,null,null,{"$f":"IF(B60=\"\",\"\",VLOOKUP(B60,Reference!A$9:B$23,2,FALSE))","v":""},null,null,null,"",null,null,null,null,null,null,0,{"$f":"IF(G60>0,VLOOKUP('Personnel Sheet'!B60,Reference!A$9:C$23,3,FALSE),0)","v":0},0]
[null,null,null,{"$f":"IF(B61=\"\",\"\",VLOOKUP(B61,Reference!A$9:B$23,2,FALSE))","v":""},null,null,null,"",null,null,null,null,null,null,0,{"$f":"IF(G61>0,VLOOKUP('Personnel Sheet'!B61,Reference!A$9:C$23,3,FALSE),0)","v":0},0]
[null,null,null,{"$f":"IF(B62=\"\",\"\",VLOOKUP(B62,Reference!A$9:B$23,2,FALSE))","v":""},null,null,null,"",null,null,null,null,null,null,0,{"$f":"IF(G62>0,VLOOKUP('Personnel Sheet'!B62,Reference!A$9:C$23,3,FALSE),0)","v":0},0]
[null,null,null,{"$f":"IF(B63=\"\",\"\",VLOOKUP(B63,Reference!A$9:B$23,2,FALSE))","v":""},null,null,null,"",null,null,null,null,null,null,0,{"$f":"IF(G63>0,VLOOKUP('Personnel Sheet'!B63,Reference!A$9:C$23,3,FALSE),0)","v":0},0]
[null,null,null,{"$f":"IF(B64=\"\",\"\",VLOOKUP(B64,Reference!A$9:B$23,2,FALSE))","v":""},null,null,null,"",null,null,null,{"$f":"IF(SUM(H45:H64)>0,1,0)","v":0},"Print check",null,0,{"$f":"IF(G64>0,VLOOKUP('Personnel Sheet'!B64,Reference!A$9:C$23,3,FALSE),0)","v":0},{"$f":"IF(G64>P64,P64,G64)","v":0}]
["*Only one individual can perform this duty for a specific time period."]
["**A limited number of hours is allowable for this position. "]

{"sheet":"Soil-Water Disposal","index":8,"n_rows":67,"n_cols":29,"rows_kept":67,"cut":false,"hidden":false,"merged":[[45,0,46,8],[37,0,37,4],[38,0,38,4],[41,0,41,8],[43,0,44,8],[39,0,40,8],[3,0,3,1],[34,0,34,9],[35,0,35,9],[33,0,33,5],[11,0,11,8],[3,5,3,8],[12,0,12,8],[6,5,6,7],[7,5,7,7],[6,0,6,4],[4,5,4,7],[5,5,5,7],[9,0,9,8],[5,0,5,4],[7,0,8,4]]}
["PART 5.B",null,null,null,null,null,null,null,null,null,null,null,{"$f":"+M33+M67","v":0},"Total Print check"]
["SOIL/WATER DISPOSAL SUPPLEMENTARY SHEET"]
[]
[{"$f":"IF(SUM(S15:S33)>0,\"MISSING INFORMATION\",\"\")","v":""},null,null,null,null,"Costing Category Summary"]
[null,null,null,null,null,"Emergency/Initial Work",null,null,{"$f":"SUMIF($A$15:$A$33,F5,$I$15:$I$33)+SUMIF($A$49:$A$67,F5,$I$49:$I$67)","v":0}]
["1.    The unit rate for purge water disposal for groundwater sampling events is $4.70/gal.",null,null,null,null,"Investigation Work",null,null,{"$f":"SUMIF($A$15:$A$33,F6,$I$15:$I$33)+SUMIF($A$49:$A$67,F6,$I$49:$I$67)","v":0}]
["2.    Addresses, manifests, bills of lading, etc. must be provided for disposal charges.",null,null,null,null,"Interim Monitoring Work",null,null,{"$f":"SUMIF($A$15:$A$33,F7,$I$15:$I$33)+SUMIF($A$49:$A$67,F7,$I$49:$I$67)","v":0}]
["3.    Purge water disposal not associated with groundwater sampling is reimbursed at \n       invoice costs plus 10% markup not to exceed the maximum of $0.57/gal.",null,null,null,null,"Corrective Action Plan Work",null,null,{"$f":"SUMIF($A$15:$A$33,F8,$I$15:$I$33)+SUMIF($A$49:$A$67,F8,$I$49:$I$67)","v":0}]
[]
["4.    RAC markups should not be addressed on this page.  Indicate markups on Part 5.H (1)."]
["5.    Soil drum disposal (not associated with excavation): $650.00 minimum, $260.00 for the first drum, $195.00 each additional drum."]
["6.    For excavation/transportation/disposal unit rates, please refer to the most recent  “Excavation Cost Evaluation Spreadsheet” \n       on http://www.deq.louisiana.gov/trustfund."]
["7.   For cost reductions associated with non-impacted soil and onsite, treated soil, enter the total tonnage removed in the upper section and \n      the appropriate tonnage value in the lower section."]
["Costing Category","Type of Disposal \n(Soil or Water)","Disposal Date","RAC\nInvoice\nNo.","Outside\nInvoice\nNo.","Tons, Drums or\nGallons","Quantity","Cost Per Unit ","TOTAL",null,null,null,null,null,"Soil Cuttings",null,"TONS","DRUMS","Test",null,null,null,null,null,null,null,"TONS","DRUMS","GALLONS"]
[null,null,null,null,null,null,null,null,{"$f":"IF(F15=\"TONS\",AA15*G15,IF(F15=\"DRUMS\",AB15,AC15))","v":0},null,null,null,null,null,"Water",null,"GALLONS",null,{"$f":"IF(B15<>\"\",IF(OR(A15=\"\",C15=\"\",D15=\"\",F15=\"\",G15=\"\"),1,0),0)","v":0},null,null,null,null,null,null,null,{"$f":"IF(AND(B15=\"Excavation\",F15=\"TONS\"),IF(H15>0,H15,VLOOKUP(INT(G15),ExcData!D$18:F$5017,2,FALSE)),IF(AND(B15=\"Soil Cuttings\",F15=\"Tons\"),H15,0))","v":0},{"$f":"IF(F15=\"DRUMS\",IF(IF(G15>1,Reference!B$296+(G15-1)*Reference!B$297,Reference!B$296)<Reference!B$298,Reference!B$298,IF(G15>1,Reference!B$296+(G15-1)*Reference!B$297,Reference!B$296)),0)","v":0},{"$f":"IF(F15=\"GALLONS\",H15*G15,0)","v":0}]
[null,null,null,null,null,null,null,null,{"$f":"IF(F16=\"TONS\",AA16*G16,IF(F16=\"DRUMS\",AB16,AC16))","v":0},null,null,null,null,null,"Excavation",null,"TONS",null,{"$f":"IF(B16<>\"\",IF(OR(A16=\"\",C16=\"\",D16=\"\",F16=\"\",G16=\"\"),1,0),0)","v":0},null,null,null,null,null,null,null,{"$f":"IF(AND(B16=\"Excavation\",F16=\"TONS\"),IF(H16>0,H16,VLOOKUP(INT(G16),ExcData!D$18:F$5017,2,FALSE)),IF(AND(B16=\"Soil Cuttings\",F16=\"Tons\"),H16,0))","v":0},{"$f":"IF(F16=\"DRUMS\",IF(IF(G16>1,Reference!B$296+(G16-1)*Reference!B$297,Reference!B$296)<Reference!B$298,Reference!B$298,IF(G16>1,Reference!B$296+(G16-1)*Reference!B$297,Reference!B$296)),0)","v":0},{"$f":"IF(F16=\"GALLONS\",H16*G16,0)","v":0}]
[null,null,null,null,null,null,null,null,0,null,null,null,null,null,null,null,null,null,0,null,null,null,null,null,null,null,{"$f":"IF(AND(B17=\"Excavation\",F17=\"TONS\"),IF(H17>0,H17,VLOOKUP(INT(G17),ExcData!D$18:F$5017,2,FALSE)),IF(AND(B17=\"Soil Cuttings\",F17=\"Tons\"),H17,0))","v":0},{"$f":"IF(F17=\"DRUMS\",IF(IF(G17>1,Reference!B$296+(G17-1)*Reference!B$297,Reference!B$296)<Reference!B$298,Reference!B$298,IF(G17>1,Reference!B$296+(G17-1)*Reference!B$297,Reference!B$296)),0)","v":0},0]
[null,null,null,null,null,null,null,null,0,null,null,null,null,null,null,null,null,null,0,null,null,null,null,null,null,null,{"$f":"IF(AND(B18=\"Excavation\",F18=\"TONS\"),IF(H18>0,H18,VLOOKUP(INT(G18),ExcData!D$18:F$5017,2,FALSE)),IF(AND(B18=\"Soil Cuttings\",F18=\"Tons\"),H18,0))","v":0},{"$f":"IF(F18=\"DRUMS\",IF(IF(G18>1,Reference!B$296+(G18-1)*Reference!B$297,Reference!B$296)<Reference!B$298,Reference!B$298,IF(G18>1,Reference!B$296+(G18-1)*Reference!B$297,Reference!B$296)),0)","v":0},0]
[null,null,null,null,null,null,null,null,0,null,null,null,null,null,null,null,null,null,0,null,null,null,null,null,null,null,{"$f":"IF(AND(B19=\"Excavation\",F19=\"TONS\"),IF(H19>0,H19,VLOOKUP(INT(G19),ExcData!D$18:F$5017,2,FALSE)),IF(AND(B19=\"Soil Cuttings\",F19=\"Tons\"),H19,0))","v":0},{"$f":"IF(F19=\"DRUMS\",IF(IF(G19>1,Reference!B$296+(G19-1)*Reference!B$297,Reference!B$296)<Reference!B$298,Reference!B$298,IF(G19>1,Reference!B$296+(G19-1)*Reference!B$297,Reference!B$296)),0)","v":0},0]
[null,null,null,null,null,null,null,null,0,null,null,null,null,null,null,null,null,null,0,null,null,null,null,null,null,null,{"$f":"IF(AND(B20=\"Excavation\",F20=\"TONS\"),IF(H20>0,H20,VLOOKUP(INT(G20),ExcData!D$18:F$5017,2,FALSE)),IF(AND(B20=\"Soil Cuttings\",F20=\"Tons\"),H20,0))","v":0},{"$f":"IF(F20=\"DRUMS\",IF(IF(G20>1,Reference!B$296+(G20-1)*Reference!B$297,Reference!B$296)<Reference!B$298,Reference!B$298,IF(G20>1,Reference!B$296+(G20-1)*Reference!B$297,Reference!B$296)),0)","v":0},0]
[null,null,null,null,null,null,null,null,0,null,null,null,null,null,null,null,null,null,0,null,null,null,null,null,null,null,{"$f":"IF(AND(B21=\"Excavation\",F21=\"TONS\"),IF(H21>0,H21,VLOOKUP(INT(G21),ExcData!D$18:F$5017,2,FALSE)),IF(AND(B21=\"Soil Cuttings\",F21=\"Tons\"),H21,0))","v":0},{"$f":"IF(F21=\"DRUMS\",IF(IF(G21>1,Reference!B$296+(G21-1)*Reference!B$297,Reference!B$296)<Reference!B$298,Reference!B$298,IF(G21>1,Reference!B$296+(G21-1)*Reference!B$297,Reference!B$296)),0)","v":0},0]
[null,null,null,null,null,null,null,null,0,null,null,null,null,null,null,null,null,null,0,null,null,null,null,null,null,null,{"$f":"IF(AND(B22=\"Excavation\",F22=\"TONS\"),IF(H22>0,H22,VLOOKUP(INT(G22),ExcData!D$18:F$5017,2,FALSE)),IF(AND(B22=\"Soil Cuttings\",F22=\"Tons\"),H22,0))","v":0},{"$f":"IF(F22=\"DRUMS\",IF(IF(G22>1,Reference!B$296+(G22-1)*Reference!B$297,Reference!B$296)<Reference!B$298,Reference!B$298,IF(G22>1,Reference!B$296+(G22-1)*Reference!B$297,Reference!B$296)),0)","v":0},{"$f":"IF(F22=\"GALLONS\",H22*G22,0)","v":0}]
[null,null,null,null,null,null,null,null,0,null,null,null,null,null,null,null,null,null,0,null,null,null,null,null,null,null,{"$f":"IF(AND(B23=\"Excavation\",F23=\"TONS\"),IF(H23>0,H23,VLOOKUP(INT(G23),ExcData!D$18:F$5017,2,FALSE)),IF(AND(B23=\"Soil Cuttings\",F23=\"Tons\"),H23,0))","v":0},{"$f":"IF(F23=\"DRUMS\",IF(IF(G23>1,Reference!B$296+(G23-1)*Reference!B$297,Reference!B$296)<Reference!B$298,Reference!B$298,IF(G23>1,Reference!B$296+(G23-1)*Reference!B$297,Reference!B$296)),0)","v":0},0]
[null,null,null,null,null,null,null,null,0,null,null,null,null,null,null,null,null,null,0,null,null,null,null,null,null,null,{"$f":"IF(AND(B24=\"Excavation\",F24=\"TONS\"),IF(H24>0,H24,VLOOKUP(INT(G24),ExcData!D$18:F$5017,2,FALSE)),IF(AND(B24=\"Soil Cuttings\",F24=\"Tons\"),H24,0))","v":0},{"$f":"IF(F24=\"DRUMS\",IF(IF(G24>1,Reference!B$296+(G24-1)*Reference!B$297,Reference!B$296)<Reference!B$298,Reference!B$298,IF(G24>1,Reference!B$296+(G24-1)*Reference!B$297,Reference!B$296)),0)","v":0},0]
[null,null,null,null,null,null,null,null,0,null,null,null,null,null,null,null,null,null,0,null,null,null,null,null,null,null,{"$f":"IF(AND(B25=\"Excavation\",F25=\"TONS\"),IF(H25>0,H25,VLOOKUP(INT(G25),ExcData!D$18:F$5017,2,FALSE)),IF(AND(B25=\"Soil Cuttings\",F25=\"Tons\"),H25,0))","v":0},{"$f":"IF(F25=\"DRUMS\",IF(IF(G25>1,Reference!B$296+(G25-1)*Reference!B$297,Reference!B$296)<Reference!B$298,Reference!B$298,IF(G25>1,Reference!B$296+(G25-1)*Reference!B$297,Reference!B$296)),0)","v":0},0]
[null,null,null,null,null,null,null,null,0,null,null,null,null,null,null,null,null,null,0,null,null,null,null,null,null,null,{"$f":"IF(AND(B26=\"Excavation\",F26=\"TONS\"),IF(H26>0,H26,VLOOKUP(INT(G26),ExcData!D$18:F$5017,2,FALSE)),IF(AND(B26=\"Soil Cuttings\",F26=\"Tons\"),H26,0))","v":0},{"$f":"IF(F26=\"DRUMS\",IF(IF(G26>1,Reference!B$296+(G26-1)*Reference!B$297,Reference!B$296)<Reference!B$298,Reference!B$298,IF(G26>1,Reference!B$296+(G26-1)*Reference!B$297,Reference!B$296)),0)","v":0},0]
[null,null,null,null,null,null,null,null,0,null,null,null,null,null,null,null,null,null,0,null,null,null,null,null,null,null,{"$f":"IF(AND(B27=\"Excavation\",F27=\"TONS\"),IF(H27>0,H27,VLOOKUP(INT(G27),ExcData!D$18:F$5017,2,FALSE)),IF(AND(B27=\"Soil Cuttings\",F27=\"Tons\"),H27,0))","v":0},{"$f":"IF(F27=\"DRUMS\",IF(IF(G27>1,Reference!B$296+(G27-1)*Reference!B$297,Reference!B$296)<Reference!B$298,Reference!B$298,IF(G27>1,Reference!B$296+(G27-1)*Reference!B$297,Reference!B$296)),0)","v":0},0]
[null,null,null,null,null,null,null,null,0,null,null,null,null,null,null,null,null,null,0,null,null,null,null,null,null,null,{"$f":"IF(AND(B28=\"Excavation\",F28=\"TONS\"),IF(H28>0,H28,VLOOKUP(INT(G28),ExcData!D$18:F$5017,2,FALSE)),IF(AND(B28=\"Soil Cuttings\",F28=\"Tons\"),H28,0))","v":0},{"$f":"IF(F28=\"DRUMS\",IF(IF(G28>1,Reference!B$296+(G28-1)*Reference!B$297,Reference!B$296)<Reference!B$298,Reference!B$298,IF(G28>1,Reference!B$296+(G28-1)*Reference!B$297,Reference!B$296)),0)","v":0},0]
[null,null,null,null,null,null,null,null,0,null,null,null,null,null,null,null,null,null,0,null,null,null,null,null,null,null,{"$f":"IF(AND(B29=\"Excavation\",F29=\"TONS\"),IF(H29>0,H29,VLOOKUP(INT(G29),ExcData!D$18:F$5017,2,FALSE)),IF(AND(B29=\"Soil Cuttings\",F29=\"Tons\"),H29,0))","v":0},{"$f":"IF(F29=\"DRUMS\",IF(IF(G29>1,Reference!B$296+(G29-1)*Reference!B$297,Reference!B$296)<Reference!B$298,Reference!B$298,IF(G29>1,Reference!B$296+(G29-1)*Reference!B$297,Reference!B$296)),0)","v":0},0]
[null,null,null,null,null,null,null,null,0,null,null,null,null,null,null,null,null,null,0,null,null,null,null,null,null,null,{"$f":"IF(AND(B30=\"Excavation\",F30=\"TONS\"),IF(H30>0,H30,VLOOKUP(INT(G30),ExcData!D$18:F$5017,2,FALSE)),IF(AND(B30=\"Soil Cuttings\",F30=\"Tons\"),H30,0))","v":0},{"$f":"IF(F30=\"DRUMS\",IF(IF(G30>1,Reference!B$296+(G30-1)*Reference!B$297,Reference!B$296)<Reference!B$298,Reference!B$298,IF(G30>1,Reference!B$296+(G30-1)*Reference!B$297,Reference!B$296)),0)","v":0},0]
[null,null,null,null,null,null,null,null,0,null,null,null,null,null,null,null,null,null,0,null,null,null,null,null,null,null,{"$f":"IF(AND(B31=\"Excavation\",F31=\"TONS\"),IF(H31>0,H31,VLOOKUP(INT(G31),ExcData!D$18:F$5017,2,FALSE)),IF(AND(B31=\"Soil Cuttings\",F31=\"Tons\"),H31,0))","v":0},{"$f":"IF(F31=\"DRUMS\",IF(IF(G31>1,Reference!B$296+(G31-1)*Reference!B$297,Reference!B$296)<Reference!B$298,Reference!B$298,IF(G31>1,Reference!B$296+(G31-1)*Reference!B$297,Reference!B$296)),0)","v":0},0]
[null,"Non-Impacted Soil",null,null,null,"TONS",null,-45,{"$f":"IF(A32=\"\",0,IF(G32=\"\",0,G32*H32))","v":0},null,null,null,null,null,null,null,null,null,{"$f":"IF(G32<>\"\",IF(OR(A32=\"\",C32=\"\",D32=\"\"),1,0),0)","v":0}]
[null,"Treated Soil",null,null,null,"TONS",null,-30,{"$f":"IF(A33=\"\",0,IF(G33=\"\",0,G33*H33))","v":0},null,null,null,{"$f":"IF(SUM(I15:I33)>0,1,0)","v":0},"Print check",null,null,null,null,{"$f":"IF(G33<>\"\",IF(OR(A33=\"\",C33=\"\",D33=\"\"),1,0),0)","v":0}]
[]
["PART 5.B"]
["SOIL/WATER DISPOSAL SUPPLEMENTARY SHEET"]
[]
["1.    The unit rate for purge water disposal for groundwater sampling events is $4.70/gal."]
["2.    Addresses, manifests, bills of lading, etc. must be provided for disposal charges."]
["3.    Purge water disposal not associated with groundwater sampling is reimbursed at invoice costs plus 10% markup not to exceed \n       the maximum of $0.57/gal."]
[]
["4.    RAC markups should not be addressed on this page.  Indicate markups on Part 5.H (1)."]
["5.    Soil drum disposal (not associated with excavation): $650.00 minimum, $260.00 for the first drum, $195.00 each additional drum."]
["6.    For excavation/transportation/disposal unit rates, please refer to the most recent  “Excavation Cost Evaluation Spreadsheet” \n       on http://www.deq.louisiana.gov/trustfund."]
[]
["7.   For cost reductions associated with non-impacted soil and onsite, treated soil, enter the total tonnage removed in the upper section and \n      the appropriate tonnage value in the lower section."]
[]
["Costing Category","Type of Disposal \n(Soil or Water)","Disposal Date","RAC\nInvoice\nNo.","Outside\nInvoice\nNo.","Tons, Drums or\nGallons","Quantity","Cost Per Unit","TOTAL",null,null,null,null,null,null,null,null,null,"Test",null,null,null,null,null,null,null,"TONS","DRUMS","GALLONS"]
[null,null,null,null,null,null,null,null,{"$f":"IF(F49=\"TONS\",AA49*G49,IF(F49=\"DRUMS\",AB49,AC49))","v":0},null,null,null,null,null,null,null,null,null,{"$f":"IF(B49<>\"\",IF(OR(A49=\"\",C49=\"\",D49=\"\",F49=\"\",G49=\"\"),1,0),0)","v":0},null,null,null,null,null,null,null,{"$f":"IF(AND(B49=\"Excavation\",F49=\"TONS\"),IF(H49>0,H49,VLOOKUP(INT(G49),ExcData!D$18:F$5017,2,FALSE)),IF(AND(B49=\"Soil Cuttings\",F49=\"Tons\"),H49,0))","v":0},{"$f":"IF(F49=\"DRUMS\",IF(IF(G49>1,Reference!B$296+(G49-1)*Reference!B$297,Reference!B$296)<Reference!B$298,Reference!B$298,IF(G49>1,Reference!B$296+(G49-1)*Reference!B$297,Reference!B$296)),0)","v":0},{"$f":"IF(F49=\"GALLONS\",H49*G49,0)","v":0}]
[null,null,null,null,null,null,null,null,0,null,null,null,null,null,null,null,null,null,{"$f":"IF(B50<>\"\",IF(OR(A50=\"\",C50=\"\",D50=\"\",F50=\"\",G50=\"\"),1,0),0)","v":0},null,null,null,null,null,null,null,{"$f":"IF(AND(B50=\"Excavation\",F50=\"TONS\"),IF(H50>0,H50,VLOOKUP(INT(G50),ExcData!D$18:F$5017,2,FALSE)),IF(AND(B50=\"Soil Cuttings\",F50=\"Tons\"),H50,0))","v":0},{"$f":"IF(F50=\"DRUMS\",IF(IF(G50>1,Reference!B$296+(G50-1)*Reference!B$297,Reference!B$296)<Reference!B$298,Reference!B$298,IF(G50>1,Reference!B$296+(G50-1)*Reference!B$297,Reference!B$296)),0)","v":0},{"$f":"IF(F50=\"GALLONS\",H50*G50,0)","v":0}]
[null,null,null,null,null,null,null,null,0,null,null,null,null,null,null,null,null,null,0,null,null,null,null,null,null,null,{"$f":"IF(AND(B51=\"Excavation\",F51=\"TONS\"),IF(H51>0,H51,VLOOKUP(INT(G51),ExcData!D$18:F$5017,2,FALSE)),IF(AND(B51=\"Soil Cuttings\",F51=\"Tons\"),H51,0))","v":0},{"$f":"IF(F51=\"DRUMS\",IF(IF(G51>1,Reference!B$296+(G51-1)*Reference!B$297,Reference!B$296)<Reference!B$298,Reference!B$298,IF(G51>1,Reference!B$296+(G51-1)*Reference!B$297,Reference!B$296)),0)","v":0},0]
[null,null,null,null,null,null,null,null,0,null,null,null,null,null,null,null,null,null,0,null,null,null,null,null,null,null,{"$f":"IF(AND(B52=\"Excavation\",F52=\"TONS\"),IF(H52>0,H52,VLOOKUP(INT(G52),ExcData!D$18:F$5017,2,FALSE)),IF(AND(B52=\"Soil Cuttings\",F52=\"Tons\"),H52,0))","v":0},{"$f":"IF(F52=\"DRUMS\",IF(IF(G52>1,Reference!B$296+(G52-1)*Reference!B$297,Reference!B$296)<Reference!B$298,Reference!B$298,IF(G52>1,Reference!B$296+(G52-1)*Reference!B$297,Reference!B$296)),0)","v":0},0]
[null,null,null,null,null,null,null,null,0,null,null,null,null,null,null,null,null,null,0,null,null,null,null,null,null,null,{"$f":"IF(AND(B53=\"Excavation\",F53=\"TONS\"),IF(H53>0,H53,VLOOKUP(INT(G53),ExcData!D$18:F$5017,2,FALSE)),IF(AND(B53=\"Soil Cuttings\",F53=\"Tons\"),H53,0))","v":0},{"$f":"IF(F53=\"DRUMS\",IF(IF(G53>1,Reference!B$296+(G53-1)*Reference!B$297,Reference!B$296)<Reference!B$298,Reference!B$298,IF(G53>1,Reference!B$296+(G53-1)*Reference!B$297,Reference!B$296)),0)","v":0},0]
[null,null,null,null,null,null,null,null,0,null,null,null,null,null,null,null,null,null,0,null,null,null,null,null,null,null,{"$f":"IF(AND(B54=\"Excavation\",F54=\"TONS\"),IF(H54>0,H54,VLOOKUP(INT(G54),ExcData!D$18:F$5017,2,FALSE)),IF(AND(B54=\"Soil Cuttings\",F54=\"Tons\"),H54,0))","v":0},{"$f":"IF(F54=\"DRUMS\",IF(IF(G54>1,Reference!B$296+(G54-1)*Reference!B$297,Reference!B$296)<Reference!B$298,Reference!B$298,IF(G54>1,Reference!B$296+(G54-1)*Reference!B$297,Reference!B$296)),0)","v":0},0]
[null,null,null,null,null,null,null,null,0,null,null,null,null,null,null,null,null,null,0,null,null,null,null,null,null,null,{"$f":"IF(AND(B55=\"Excavation\",F55=\"TONS\"),IF(H55>0,H55,VLOOKUP(INT(G55),ExcData!D$18:F$5017,2,FALSE)),IF(AND(B55=\"Soil Cuttings\",F55=\"Tons\"),H55,0))","v":0},{"$f":"IF(F55=\"DRUMS\",IF(IF(G55>1,Reference!B$296+(G55-1)*Reference!B$297,Reference!B$296)<Reference!B$298,Reference!B$298,IF(G55>1,Reference!B$296+(G55-1)*Reference!B$297,Reference!B$296)),0)","v":0},0]
[null,null,null,null,null,null,null,null,0,null,null,null,null,null,null,null,null,null,0,null,null,null,null,null,null,null,{"$f":"IF(AND(B56=\"Excavation\",F56=\"TONS\"),IF(H56>0,H56,VLOOKUP(INT(G56),ExcData!D$18:F$5017,2,FALSE)),IF(AND(B56=\"Soil Cuttings\",F56=\"Tons\"),H56,0))","v":0},{"$f":"IF(F56=\"DRUMS\",IF(IF(G56>1,Reference!B$296+(G56-1)*Reference!B$297,Reference!B$296)<Reference!B$298,Reference!B$298,IF(G56>1,Reference!B$296+(G56-1)*Reference!B$297,Reference!B$296)),0)","v":0},0]
[null,null,null,null,null,null,null,null,0,null,null,null,null,null,null,null,null,null,0,null,null,null,null,null,null,null,{"$f":"IF(AND(B57=\"Excavation\",F57=\"TONS\"),IF(H57>0,H57,VLOOKUP(INT(G57),ExcData!D$18:F$5017,2,FALSE)),IF(AND(B57=\"Soil Cuttings\",F57=\"Tons\"),H57,0))","v":0},{"$f":"IF(F57=\"DRUMS\",IF(IF(G57>1,Reference!B$296+(G57-1)*Reference!B$297,Reference!B$296)<Reference!B$298,Reference!B$298,IF(G57>1,Reference!B$296+(G57-1)*Reference!B$297,Reference!B$296)),0)","v":0},0]
[null,null,null,null,null,null,null,null,0,null,null,null,null,null,null,null,null,null,0,null,null,null,null,null,null,null,{"$f":"IF(AND(B58=\"Excavation\",F58=\"TONS\"),IF(H58>0,H58,VLOOKUP(INT(G58),ExcData!D$18:F$5017,2,FALSE)),IF(AND(B58=\"Soil Cuttings\",F58=\"Tons\"),H58,0))","v":0},{"$f":"IF(F58=\"DRUMS\",IF(IF(G58>1,Reference!B$296+(G58-1)*Reference!B$297,Reference!B$296)<Reference!B$298,Reference!B$298,IF(G58>1,Reference!B$296+(G58-1)*Reference!B$297,Reference!B$296)),0)","v":0},0]
[null,null,null,null,null,null,null,null,0,null,null,null,null,null,null,null,null,null,0,null,null,null,null,null,null,null,{"$f":"IF(AND(B59=\"Excavation\",F59=\"TONS\"),IF(H59>0,H59,VLOOKUP(INT(G59),ExcData!D$18:F$5017,2,FALSE)),IF(AND(B59=\"Soil Cuttings\",F59=\"Tons\"),H59,0))","v":0},{"$f":"IF(F59=\"DRUMS\",IF(IF(G59>1,Reference!B$296+(G59-1)*Reference!B$297,Reference!B$296)<Reference!B$298,Reference!B$298,IF(G59>1,Reference!B$296+(G59-1)*Reference!B$297,Reference!B$296)),0)","v":0},0]
[null,null,null,null,null,null,null,null,0,null,null,null,null,null,null,null,null,null,0,null,null,null,null,null,null,null,{"$f":"IF(AND(B60=\"Excavation\",F60=\"TONS\"),IF(H60>0,H60,VLOOKUP(INT(G60),ExcData!D$18:F$5017,2,FALSE)),IF(AND(B60=\"Soil Cuttings\",F60=\"Tons\"),H60,0))","v":0},{"$f":"IF(F60=\"DRUMS\",IF(IF(G60>1,Reference!B$296+(G60-1)*Reference!B$297,Reference!B$296)<Reference!B$298,Reference!B$298,IF(G60>1,Reference!B$296+(G60-1)*Reference!B$297,Reference!B$296)),0)","v":0},0]
[null,null,null,null,null,null,null,null,0,null,null,null,null,null,null,null,null,null,0,null,null,null,null,null,null,null,{"$f":"IF(AND(B61=\"Excavation\",F61=\"TONS\"),IF(H61>0,H61,VLOOKUP(INT(G61),ExcData!D$18:F$5017,2,FALSE)),IF(AND(B61=\"Soil Cuttings\",F61=\"Tons\"),H61,0))","v":0},{"$f":"IF(F61=\"DRUMS\",IF(IF(G61>1,Reference!B$296+(G61-1)*Reference!B$297,Reference!B$296)<Reference!B$298,Reference!B$298,IF(G61>1,Reference!B$296+(G61-1)*Reference!B$297,Reference!B$296)),0)","v":0},0]
[null,null,null,null,null,null,null,null,0,null,null,null,null,null,null,null,null,null,0,null,null,null,null,null,null,null,{"$f":"IF(AND(B62=\"Excavation\",F62=\"TONS\"),IF(H62>0,H62,VLOOKUP(INT(G62),ExcData!D$18:F$5017,2,FALSE)),IF(AND(B62=\"Soil Cuttings\",F62=\"Tons\"),H62,0))","v":0},{"$f":"IF(F62=\"DRUMS\",IF(IF(G62>1,Reference!B$296+(G62-1)*Reference!B$297,Reference!B$296)<Reference!B$298,Reference!B$298,IF(G62>1,Reference!B$296+(G62-1)*Reference!B$297,Reference!B$296)),0)","v":0},0]
[null,null,null,null,null,null,null,null,0,null,null,null,null,null,null,null,null,null,0,null,null,null,null,null,null,null,{"$f":"IF(AND(B63=\"Excavation\",F63=\"TONS\"),IF(H63>0,H63,VLOOKUP(INT(G63),ExcData!D$18:F$5017,2,FALSE)),IF(AND(B63=\"Soil Cuttings\",F63=\"Tons\"),H63,0))","v":0},{"$f":"IF(F63=\"DRUMS\",IF(IF(G63>1,Reference!B$296+(G63-1)*Reference!B$297,Reference!B$296)<Reference!B$298,Reference!B$298,IF(G63>1,Reference!B$296+(G63-1)*Reference!B$297,Reference!B$296)),0)","v":0},0]
[null,null,null,null,null,null,null,null,0,null,null,null,null,null,null,null,null,null,0,null,null,null,null,null,null,null,{"$f":"IF(AND(B64=\"Excavation\",F64=\"TONS\"),IF(H64>0,H64,VLOOKUP(INT(G64),ExcData!D$18:F$5017,2,FALSE)),IF(AND(B64=\"Soil Cuttings\",F64=\"Tons\"),H64,0))","v":0},{"$f":"IF(F64=\"DRUMS\",IF(IF(G64>1,Reference!B$296+(G64-1)*Reference!B$297,Reference!B$296)<Reference!B$298,Reference!B$298,IF(G64>1,Reference!B$296+(G64-1)*Reference!B$297,Reference!B$296)),0)","v":0},0]
[null,null,null,null,null,null,null,null,0,null,null,null,null,null,null,null,null,null,0,null,null,null,null,null,null,null,{"$f":"IF(AND(B65=\"Excavation\",F65=\"TONS\"),IF(H65>0,H65,VLOOKUP(INT(G65),ExcData!D$18:F$5017,2,FALSE)),IF(AND(B65=\"Soil Cuttings\",F65=\"Tons\"),H65,0))","v":0},{"$f":"IF(F65=\"DRUMS\",IF(IF(G65>1,Reference!B$296+(G65-1)*Reference!B$297,Reference!B$296)<Reference!B$298,Reference!B$298,IF(G65>1,Reference!B$296+(G65-1)*Reference!B$297,Reference!B$296)),0)","v":0},0]
[null,"Non-Impacted Soil",null,null,null,"TONS",null,-45,{"$f":"IF(A66=\"\",0,IF(G66=\"\",0,G66*H66))","v":0},null,null,null,null,null,null,null,null,null,{"$f":"IF(G66<>\"\",IF(OR(A66=\"\",C66=\"\",D66=\"\"),1,0),0)","v":0}]
[null,"Treated Soil",null,null,null,"TONS",null,-30,{"$f":"IF(A67=\"\",0,IF(G67=\"\",0,G67*H67))","v":0},null,null,null,{"$f":"IF(SUM(I49:I67)>0,1,0)","v":0},"Print check",null,null,null,null,{"$f":"IF(G67<>\"\",IF(OR(A67=\"\",C67=\"\",D67=\"\"),1,0),0)","v":0}]

{"sheet":"Equipment Rent-Purchase","index":9,"n_rows":65,"n_cols":19,"rows_kept":65,"cut":false,"hidden":false,"merged":[[8,11,8,12],[8,8,8,10],[4,8,4,12],[5,8,5,10],[6,8,6,10],[7,8,7,10],[5,11,5,12],[6,11,6,12],[7,11,7,12]]}
["PART 5.C",null,null,null,null,null,null,null,null,null,null,null,null,null,null,null,{"$f":"+Q32+Q65","v":0},"Total Print check"]
["EQUIPMENT RENTAL/PURCHASE SUPPLEMENTARY SHEET"]
[]
[null,{"$f":"IF(SUM(S15:S65)>0,\"MISSING INFORMATION\",\"\")","v":""}]
["1.    List all charges for outside rentals, contractor-owned rental equipment, and purchased equipment.",null,null,null,null,null,null,null,"Costing Category Summary"]
["2.    A completed Treatment System Tracking Form (Part 7) & Purchase Agreement Form (Part 8) must be provided for treatment units.",null,null,null,null,null,null,null,"Emergency/Initial Work",null,null,{"$f":"SUMIF(A$15:A$32,I6,M$15:M$32)+SUMIF(A$48:A$65,I6,M$48:M$65)","v":0}]
["3.    Vehicle rental charges are not reimbursable.",null,null,null,null,null,null,null,"Investigation Work",null,null,{"$f":"SUMIF(A$15:A$32,I7,M$15:M$32)+SUMIF(A$48:A$65,I7,M$48:M$65)","v":0}]
["4.    (No. of Units/Time Used At Site) X (Rental Rate) = (Total)",null,null,null,null,null,null,null,"Interim Monitoring Work",null,null,{"$f":"SUMIF(A$15:A$32,I8,M$15:M$32)+SUMIF(A$48:A$65,I8,M$48:M$65)","v":0}]
["5.    Equipment charges for work activities included in unit pricing should not be included on this form.",null,null,null,null,null,null,null,"Corrective Action Plan Work",null,null,{"$f":"SUMIF(A$15:A$32,I9,M$15:M$32)+SUMIF(A$48:A$65,I9,M$48:M$65)","v":0}]
["6.    Rental rates for contractor-owned equipment are listed in Appendix B, Table 2 of the Guidance Document."]
["7.    Weekly rate goes into effect when equipment is used at a site for more than three days in a week (Monday – Sunday) .  Daily rates are based on an 8-hour day.  Equipment rental costs "]
["       for more or less than an 8-hour day must utilize the hourly rate."]
["8.    The ratings for the following equipment must be provided:  air compressor – cfm, backhoe – bucket size, dump truck – yard capacity, trackhoe – horsepower, vacuum truck - horsepower."]
["Costing Category","Equipment","Description","RAC\nInvoice\nNo.","Outside\nInvoice\nNo.","Dates\nEquipment \nUsed","10% Markup Applies \n(Yes/No)","Units","Time Used ","Outside Vendor Rate ($)","RAC Owned Rate ($)","Markup Subtotal ($)","TOTAL \n($)",null,null,null,null,null,"Test"]
[null,null,null,null,null,null,null,null,null,null,{"$f":"IF(B15=\"\",\"\",VLOOKUP(B15,Reference!A$28:E$71,IF(H15=\"Hourly\",2,IF(H15=\"Daily\",3,IF(H15=\"Weekly\",4,5))),FALSE))","v":""},{"$f":"IF(G15=\"Yes\",ROUND(IF(J15=\"\",I15*K15,J15*I15)*0.1,2),0)","v":0},{"$f":"IF(A15=\"\",0,IF(B15=\"\",\"\",IF(J15=\"\",I15*K15,J15*I15)+L15))","v":0},null,null,null,null,null,{"$f":"IF(B15<>\"\",IF(OR(A15=\"\",C15=\"\",F15=\"\",H15=\"\",I15=\"\",CONCATENATE(D15,E15)=\"\"),1,0),0)","v":0}]
[null,null,null,null,null,null,null,null,null,null,{"$f":"IF(B16=\"\",\"\",VLOOKUP(B16,Reference!A$28:E$71,IF(H16=\"Hourly\",2,IF(H16=\"Daily\",3,IF(H16=\"Weekly\",4,5))),FALSE))","v":""},{"$f":"IF(G16=\"Yes\",ROUND(IF(J16=\"\",I16*K16,J16*I16)*0.1,2),0)","v":0},{"$f":"IF(A16=\"\",0,IF(B16=\"\",\"\",IF(J16=\"\",I16*K16,J16*I16)+L16))","v":0},null,null,null,null,null,{"$f":"IF(B16<>\"\",IF(OR(A16=\"\",C16=\"\",F16=\"\",H16=\"\",I16=\"\",CONCATENATE(D16,E16)=\"\"),1,0),0)","v":0}]
[null,null,null,null,null,null,null,null,null,null,{"$f":"IF(B17=\"\",\"\",VLOOKUP(B17,Reference!A$28:E$71,IF(H17=\"Hourly\",2,IF(H17=\"Daily\",3,IF(H17=\"Weekly\",4,5))),FALSE))","v":""},0,0,null,null,null,null,null,0]
[null,null,null,null,null,null,null,null,null,null,{"$f":"IF(B18=\"\",\"\",VLOOKUP(B18,Reference!A$28:E$71,IF(H18=\"Hourly\",2,IF(H18=\"Daily\",3,IF(H18=\"Weekly\",4,5))),FALSE))","v":""},0,0,null,null,null,null,null,0]
[null,null,null,null,null,null,null,null,null,null,{"$f":"IF(B19=\"\",\"\",VLOOKUP(B19,Reference!A$28:E$71,IF(H19=\"Hourly\",2,IF(H19=\"Daily\",3,IF(H19=\"Weekly\",4,5))),FALSE))","v":""},0,0,null,null,null,null,null,0]
[null,null,null,null,null,null,null,null,null,null,{"$f":"IF(B20=\"\",\"\",VLOOKUP(B20,Reference!A$28:E$71,IF(H20=\"Hourly\",2,IF(H20=\"Daily\",3,IF(H20=\"Weekly\",4,5))),FALSE))","v":""},0,0,null,null,null,null,null,0]
[null,null,null,null,null,null,null,null,null,null,{"$f":"IF(B21=\"\",\"\",VLOOKUP(B21,Reference!A$28:E$71,IF(H21=\"Hourly\",2,IF(H21=\"Daily\",3,IF(H21=\"Weekly\",4,5))),FALSE))","v":""},0,0,null,null,null,null,null,0]
[null,null,null,null,null,null,null,null,null,null,{"$f":"IF(B22=\"\",\"\",VLOOKUP(B22,Reference!A$28:E$71,IF(H22=\"Hourly\",2,IF(H22=\"Daily\",3,IF(H22=\"Weekly\",4,5))),FALSE))","v":""},0,0,null,null,null,null,null,0]
[null,null,null,null,null,null,null,null,null,null,{"$f":"IF(B23=\"\",\"\",VLOOKUP(B23,Reference!A$28:E$71,IF(H23=\"Hourly\",2,IF(H23=\"Daily\",3,IF(H23=\"Weekly\",4,5))),FALSE))","v":""},0,0,null,null,null,null,null,0]
[null,null,null,null,null,null,null,null,null,null,{"$f":"IF(B24=\"\",\"\",VLOOKUP(B24,Reference!A$28:E$71,IF(H24=\"Hourly\",2,IF(H24=\"Daily\",3,IF(H24=\"Weekly\",4,5))),FALSE))","v":""},0,0,null,null,null,null,null,0]
[null,null,null,null,null,null,null,null,null,null,{"$f":"IF(B25=\"\",\"\",VLOOKUP(B25,Reference!A$28:E$71,IF(H25=\"Hourly\",2,IF(H25=\"Daily\",3,IF(H25=\"Weekly\",4,5))),FALSE))","v":""},0,0,null,null,null,null,null,0]
[null,null,null,null,null,null,null,null,null,null,{"$f":"IF(B26=\"\",\"\",VLOOKUP(B26,Reference!A$28:E$71,IF(H26=\"Hourly\",2,IF(H26=\"Daily\",3,IF(H26=\"Weekly\",4,5))),FALSE))","v":""},0,0,null,null,null,null,null,0]
[null,null,null,null,null,null,null,null,null,null,{"$f":"IF(B27=\"\",\"\",VLOOKUP(B27,Reference!A$28:E$71,IF(H27=\"Hourly\",2,IF(H27=\"Daily\",3,IF(H27=\"Weekly\",4,5))),FALSE))","v":""},0,0,null,null,null,null,null,0]
[null,null,null,null,null,null,null,null,null,null,{"$f":"IF(B28=\"\",\"\",VLOOKUP(B28,Reference!A$28:E$71,IF(H28=\"Hourly\",2,IF(H28=\"Daily\",3,IF(H28=\"Weekly\",4,5))),FALSE))","v":""},0,0,null,null,null,null,null,0]
[null,null,null,null,null,null,null,null,null,null,{"$f":"IF(B29=\"\",\"\",VLOOKUP(B29,Reference!A$28:E$71,IF(H29=\"Hourly\",2,IF(H29=\"Daily\",3,IF(H29=\"Weekly\",4,5))),FALSE))","v":""},0,0,null,null,null,null,null,0]
[null,null,null,null,null,null,null,null,null,null,{"$f":"IF(B30=\"\",\"\",VLOOKUP(B30,Reference!A$28:E$71,IF(H30=\"Hourly\",2,IF(H30=\"Daily\",3,IF(H30=\"Weekly\",4,5))),FALSE))","v":""},0,0,null,null,null,null,null,0]
[null,null,null,null,null,null,null,null,null,null,{"$f":"IF(B31=\"\",\"\",VLOOKUP(B31,Reference!A$28:E$71,IF(H31=\"Hourly\",2,IF(H31=\"Daily\",3,IF(H31=\"Weekly\",4,5))),FALSE))","v":""},0,0,null,null,null,null,null,0]
[null,null,null,null,null,null,null,null,null,null,{"$f":"IF(B32=\"\",\"\",VLOOKUP(B32,Reference!A$28:E$71,IF(H32=\"Hourly\",2,IF(H32=\"Daily\",3,IF(H32=\"Weekly\",4,5))),FALSE))","v":""},0,0,null,null,null,{"$f":"IF(SUM(M15:M32)>0,1,0)","v":0},"Print check",0]
[]
["PART 5.C"]
["EQUIPMENT RENTAL/PURCHASE SUPPLEMENTARY SHEET"]
[]
["1.    List all charges for outside rentals, contractor-owned rental equipment, and purchased equipment."]
["2.    A completed Treatment System Tracking Form (Part 7) & Purchase Agreement Form (Part 8) must be provided for treatment units."]
["3.    Vehicle rental charges are not reimbursable."]
["4.    (No. of Units/Time Used At Site) X (Rental Rate) = (Total)"]
["5.    Equipment charges for work activities included in unit pricing should not be included on this form."]
["6.    Rental rates for contractor-owned equipment are listed in Appendix B, Table 2 of the Guidance Document."]
["7.    Weekly rate goes into effect when equipment is used at a site for more than three days in a week (Monday – Sunday) .  Daily rates are based on an 8-hour day.  Equipment rental costs "]
["       for more or less than an 8-hour day must utilize the hourly rate."]
["8.    The ratings for the following equipment must be provided:  air compressor – cfm, backhoe – bucket size, dump truck – yard capacity, trackhoe – horsepower, vacuum truck - horsepower."]
[]
["Costing Category","Equipment","Description","RAC\nInvoice\nNo.","Outside\nInvoice\nNo.","Dates\nEquipment \nUsed","10% Markup Applies \n(Yes/No)","Units","Time Used ","Outside Vendor Rate ($)","RAC Owned Rate ($)","Markup Subtotal ($)","TOTAL \n($)",null,null,null,null,null,"Test"]
[null,null,null,null,null,null,null,null,null,null,{"$f":"IF(B48=\"\",\"\",VLOOKUP(B48,Reference!A$28:E$71,IF(H48=\"Hourly\",2,IF(H48=\"Daily\",3,IF(H48=\"Weekly\",4,5))),FALSE))","v":""},{"$f":"IF(G48=\"Yes\",ROUND(IF(J48=\"\",I48*K48,J48*I48)*0.1,2),0)","v":0},{"$f":"IF(A48=\"\",0,IF(B48=\"\",\"\",IF(J48=\"\",I48*K48,J48*I48)+L48))","v":0},null,null,null,null,null,{"$f":"IF(B48<>\"\",IF(OR(A48=\"\",C48=\"\",F48=\"\",H48=\"\",I48=\"\",CONCATENATE(D48,E48)=\"\"),1,0),0)","v":0}]
[null,null,null,null,null,null,null,null,null,null,{"$f":"IF(B49=\"\",\"\",VLOOKUP(B49,Reference!A$28:E$71,IF(H49=\"Hourly\",2,IF(H49=\"Daily\",3,IF(H49=\"Weekly\",4,5))),FALSE))","v":""},{"$f":"IF(G49=\"Yes\",ROUND(IF(J49=\"\",I49*K49,J49*I49)*0.1,2),0)","v":0},{"$f":"IF(A49=\"\",0,IF(B49=\"\",\"\",IF(J49=\"\",I49*K49,J49*I49)+L49))","v":0},null,null,null,null,null,{"$f":"IF(B49<>\"\",IF(OR(A49=\"\",C49=\"\",F49=\"\",H49=\"\",I49=\"\",CONCATENATE(D49,E49)=\"\"),1,0),0)","v":0}]
[null,null,null,null,null,null,null,null,null,null,{"$f":"IF(B50=\"\",\"\",VLOOKUP(B50,Reference!A$28:E$71,IF(H50=\"Hourly\",2,IF(H50=\"Daily\",3,IF(H50=\"Weekly\",4,5))),FALSE))","v":""},0,0,null,null,null,null,null,0]
[null,null,null,null,null,null,null,null,null,null,{"$f":"IF(B51=\"\",\"\",VLOOKUP(B51,Reference!A$28:E$71,IF(H51=\"Hourly\",2,IF(H51=\"Daily\",3,IF(H51=\"Weekly\",4,5))),FALSE))","v":""},0,0,null,null,null,null,null,0]
[null,null,null,null,null,null,null,null,null,null,{"$f":"IF(B52=\"\",\"\",VLOOKUP(B52,Reference!A$28:E$71,IF(H52=\"Hourly\",2,IF(H52=\"Daily\",3,IF(H52=\"Weekly\",4,5))),FALSE))","v":""},0,0,null,null,null,null,null,0]
[null,null,null,null,null,null,null,null,null,null,{"$f":"IF(B53=\"\",\"\",VLOOKUP(B53,Reference!A$28:E$71,IF(H53=\"Hourly\",2,IF(H53=\"Daily\",3,IF(H53=\"Weekly\",4,5))),FALSE))","v":""},0,0,null,null,null,null,null,0]
[null,null,null,null,null,null,null,null,null,null,{"$f":"IF(B54=\"\",\"\",VLOOKUP(B54,Reference!A$28:E$71,IF(H54=\"Hourly\",2,IF(H54=\"Daily\",3,IF(H54=\"Weekly\",4,5))),FALSE))","v":""},0,0,null,null,null,null,null,0]
[null,null,null,null,null,null,null,null,null,null,{"$f":"IF(B55=\"\",\"\",VLOOKUP(B55,Reference!A$28:E$71,IF(H55=\"Hourly\",2,IF(H55=\"Daily\",3,IF(H55=\"Weekly\",4,5))),FALSE))","v":""},0,0,null,null,null,null,null,0]
[null,null,null,null,null,null,null,null,null,null,{"$f":"IF(B56=\"\",\"\",VLOOKUP(B56,Reference!A$28:E$71,IF(H56=\"Hourly\",2,IF(H56=\"Daily\",3,IF(H56=\"Weekly\",4,5))),FALSE))","v":""},0,0,null,null,null,null,null,0]
[null,null,null,null,null,null,null,null,null,null,{"$f":"IF(B57=\"\",\"\",VLOOKUP(B57,Reference!A$28:E$71,IF(H57=\"Hourly\",2,IF(H57=\"Daily\",3,IF(H57=\"Weekly\",4,5))),FALSE))","v":""},0,0,null,null,null,null,null,0]
[null,null,null,null,null,null,null,null,null,null,{"$f":"IF(B58=\"\",\"\",VLOOKUP(B58,Reference!A$28:E$71,IF(H58=\"Hourly\",2,IF(H58=\"Daily\",3,IF(H58=\"Weekly\",4,5))),FALSE))","v":""},0,0,null,null,null,null,null,0]
[null,null,null,null,null,null,null,null,null,null,{"$f":"IF(B59=\"\",\"\",VLOOKUP(B59,Reference!A$28:E$71,IF(H59=\"Hourly\",2,IF(H59=\"Daily\",3,IF(H59=\"Weekly\",4,5))),FALSE))","v":""},0,0,null,null,null,null,null,0]
[null,null,null,null,null,null,null,null,null,null,{"$f":"IF(B60=\"\",\"\",VLOOKUP(B60,Reference!A$28:E$71,IF(H60=\"Hourly\",2,IF(H60=\"Daily\",3,IF(H60=\"Weekly\",4,5))),FALSE))","v":""},0,0,null,null,null,null,null,0]
[null,null,null,null,null,null,null,null,null,null,{"$f":"IF(B61=\"\",\"\",VLOOKUP(B61,Reference!A$28:E$71,IF(H61=\"Hourly\",2,IF(H61=\"Daily\",3,IF(H61=\"Weekly\",4,5))),FALSE))","v":""},0,0,null,null,null,null,null,0]
[null,null,null,null,null,null,null,null,null,null,{"$f":"IF(B62=\"\",\"\",VLOOKUP(B62,Reference!A$28:E$71,IF(H62=\"Hourly\",2,IF(H62=\"Daily\",3,IF(H62=\"Weekly\",4,5))),FALSE))","v":""},0,0,null,null,null,null,null,0]
[null,null,null,null,null,null,null,null,null,null,{"$f":"IF(B63=\"\",\"\",VLOOKUP(B63,Reference!A$28:E$71,IF(H63=\"Hourly\",2,IF(H63=\"Daily\",3,IF(H63=\"Weekly\",4,5))),FALSE))","v":""},0,0,null,null,null,null,null,0]
[null,null,null,null,null,null,null,null,null,null,{"$f":"IF(B64=\"\",\"\",VLOOKUP(B64,Reference!A$28:E$71,IF(H64=\"Hourly\",2,IF(H64=\"Daily\",3,IF(H64=\"Weekly\",4,5))),FALSE))","v":""},0,0,null,null,null,null,null,0]
[null,null,null,null,null,null,null,null,null,null,{"$f":"IF(B65=\"\",\"\",VLOOKUP(B65,Reference!A$28:E$71,IF(H65=\"Hourly\",2,IF(H65=\"Daily\",3,IF(H65=\"Weekly\",4,5))),FALSE))","v":""},0,0,null,null,null,{"$f":"IF(SUM(M48:M65)>0,1,0)","v":0},"Print check",0]

{"sheet":"Hotel & Food","index":10,"n_rows":97,"n_cols":16,"rows_kept":97,"cut":false,"hidden":false,"merged":[[60,0,60,3],[61,0,61,3],[62,0,62,3],[63,0,63,3],[64,0,64,3],[9,0,9,3],[10,0,10,3],[11,0,11,3],[12,0,12,3],[13,0,13,3],[14,0,14,3],[15,0,15,3],[58,0,58,3],[59,0,59,3],[45,0,47,0],[21,2,23,2],[21,3,23,3],[45,2,47,2],[45,3,47,3],[18,0,20,0],[18,2,20,2],[18,3,20,3],[42,0,44,0],[21,0,23,0],[27,2,29,2],[33,6,35,6],[36,6,38,6],[36,2,38,2],[36,3,38,3],[36,4,38,4],[42,2,44,2],[42,3,44,3],[42,4,44,4],[39,6,41,6],[24,0,26,0],[27,0,29,0],[39,0,41,0],[18,7,20,7],[18,8,20,8],[21,8,23,8],[30,0,32,0],[30,2,32,2],[30,3,32,3],[30,4,32,4],[33,0,35,0],[36,0,38,0],[33,2,35,2],[33,3,35,3],[33,4,35,4],[39,4,41,4],[39,5,41,5],[27,6,29,6],[27,3,29,3],[27,4,29,4],[39,2,41,2],[39,3,41,3],[24,2,26,2],[24,3,26,3],[18,4,20,4],[18,6,20,6],[45,9,47,9],[36,7,38,7],[36,8,38,8],[36,9,38,9],[42,9,44,9],[21,7,23,7],[27,9,29,9],[39,7,41,7],[39,8,41,8],[39,9,41,9],[42,7,44,7],[45,8,47,8],[45,7,47,7],[33,7,35,7],[33,8,35,8],[33,9,35,9],[21,9,23,9],[42,8,44,8],[42,5,44,5],[45,4,47,4],[45,6,47,6],[42,6,44,6],[73,6,75,6],[73,7,75,7],[73,8,75,8],[45,5,47,5],[33,5,35,5],[36,5,38,5],[24,7,26,7],[24,8,26,8],[21,4,23,4],[21,6,23,6],[24,4,26,4],[24,6,26,6],[73,9,75,9],[73,0,75,0],[73,2,75,2],[70,7,72,7],[70,8,72,8],[70,9,72,9],[67,0,69,0],[67,2,69,2],[73,3,75,3],[73,4,75,4],[73,5,75,5],[70,0,72,0],[70,2,72,2],[70,3,72,3],[70,4,72,4],[70,5,72,5],[67,6,69,6],[67,7,69,7],[67,8,69,8],[67,9,69,9],[70,6,72,6],[67,3,69,3],[67,4,69,4],[67,5,69,5],[82,4,84,4],[82,5,84,5],[76,0,78,0],[76,2,78,2],[76,3,78,3],[76,4,78,4],[76,5,78,5],[76,6,78,6],[82,6,84,6],[79,6,81,6],[82,7,84,7],[82,8,84,8],[82,9,84,9],[82,0,84,0],[82,2,84,2],[88,0,90,0],[88,2,90,2],[88,3,90,3],[88,4,90,4],[88,5,90,5],[88,6,90,6],[88,7,90,7],[88,8,90,8],[88,9,90,9],[85,0,87,0],[85,2,87,2],[85,3,87,3],[85,4,87,4],[85,5,87,5],[85,6,87,6],[85,7,87,7],[85,8,87,8],[85,9,87,9],[82,3,84,3],[94,0,96,0],[94,2,96,2],[94,3,96,3],[94,4,96,4],[94,5,96,5],[94,6,96,6],[94,7,96,7],[94,8,96,8],[94,9,96,9],[91,6,93,6],[91,7,93,7],[91,8,93,8],[91,9,93,9],[91,0,93,0],[91,2,93,2],[91,3,93,3],[91,4,93,4],[91,5,93,5],[36,15,38,15],[39,15,41,15],[42,15,44,15],[45,15,47,15],[18,15,20,15],[21,15,23,15],[24,15,26,15],[27,15,29,15],[33,15,35,15],[30,15,32,15],[85,15,87,15],[88,15,90,15],[91,15,93,15],[94,15,96,15],[67,15,69,15],[70,15,72,15],[73,15,75,15],[76,15,78,15],[82,15,84,15],[79,15,81,15],[79,7,81,7],[79,8,81,8],[79,9,81,9],[79,0,81,0],[79,2,81,2],[79,3,81,3],[79,4,81,4],[79,5,81,5],[76,7,78,7],[76,8,78,8],[76,9,78,9],[4,5,4,8],[5,5,5,8],[6,5,6,8],[7,5,7,8],[0,7,0,9],[2,5,2,9],[3,5,3,8],[30,5,32,5],[30,6,32,6],[30,7,32,7],[30,8,32,8],[30,9,32,9],[18,5,20,5],[21,5,23,5],[24,5,26,5],[27,5,29,5],[18,9,20,9],[24,9,26,9],[27,7,29,7],[27,8,29,8]]}
["PART 5.D (1)",null,null,null,null,null,null,"LODGING/MEALS",null,null,null,null,null,{"$f":"+N48+N97","v":0},"Total Print check"]
["TRAVEL SUPPLEMENTARY SHEET"]
[null,null,null,null,null,"Costing Category Summary"]
["RATES DESCRIPTION","CURRENT MAXIMUM RATES",null,null,null,"Emergency/Initial Work",null,null,null,{"$f":"SUMIF(A$19:A$48,F4,J$19:J$48)+SUMIF(A$68:A$90,F4,J$68:J$90)","v":0}]
["Meals - Statewide","$40/day ",null,null,null,"Investigation Work",null,null,null,{"$f":"SUMIF(A$19:A$48,F5,J$19:J$48)+SUMIF(A$68:A$90,F5,J$68:J$90)","v":0}]
["Meals - New Orleans","$45/day",{"$f":"IF(SUM(P19:P90)>0,\"MISSING INFORMATION\",\"\")","v":""},null,null,"Interim Monitoring Work",null,null,null,{"$f":"SUMIF(A$19:A$48,F6,J$19:J$48)+SUMIF(A$68:A$90,F6,J$68:J$90)","v":0}]
["Hotel - Statewide","$100/night (plus tax)",null,null,null,"Corrective Action Plan Work",null,null,null,{"$f":"SUMIF(A$19:A$48,F7,J$19:J$48)+SUMIF(A$68:A$90,F7,J$68:J$90)","v":0}]
["Hotel - New Orleans","$150/night (plus tax)",null,null,null,"Report Preparation Work",null,null,null,{"$f":"SUMIF(A$19:A$48,F8,J$19:J$48)+SUMIF(A$68:A$90,F8,J$68:J$90)","v":0}]
[]
["1.   Overnight charges (hotel or meals) are allowed for any activities when it is more cost effective than commuting"]
["2.   Meals are only reimbursable when overnight stay is required."]
["3.   Hotel charges must be accompanied by itemized bill/invoices with the guest name(s) printed by the hotel.. "]
["4.   No RAC markup allowed."]
["5.   Single site visits:  (Hotel Charges) + (Meal Charges) = Total"]
["6.   Multiple site visits:  [(Hotel Charges) + (Meal Charges)] ÷ (No. Of Sites Visited) = Total"]
["7.   Airfares, toll charges, and taxi charges are not reimbursable."]
[]
["Costing Category","Reason for Overnight Stay or Meals  \n(Select all options that apply)","Last Name of Person/s","RAC\nInvoice\nNo.","Trip \nStart Date","Trip Return Date","Hotel\nCharges","Meal\nCharges","No. of\nSites\nVisited","TOTAL",null,null,null,null,null,"Test"]
[null,null,null,null,null,null,null,null,null,{"$f":"ROUND(IF(I19=0,SUM(G19+H19),((G19+H19)/I19)),2)","v":0},null,null,null,null,null,{"$f":"IF((G19+H19)>0,IF(OR(CONCATENATE(B19,B20,B21)=\"\",E19=\"\",D19=\"\",C19=\"\",F19=\"\",A19=\"\"),1,0),0)","v":0}]
[]
[]
[null,null,null,null,null,null,null,null,null,{"$f":"ROUND(IF(I22=0,SUM(G22+H22),((G22+H22)/I22)),2)","v":0},null,null,null,null,null,{"$f":"IF((G22+H22)>0,IF(OR(CONCATENATE(B22,B23,B24)=\"\",E22=\"\",D22=\"\",C22=\"\",F22=\"\",A22=\"\"),1,0),0)","v":0}]
[]
[]
[null,null,null,null,null,null,null,null,null,{"$f":"ROUND(IF(I25=0,SUM(G25+H25),((G25+H25)/I25)),2)","v":0},null,null,null,null,null,{"$f":"IF((G25+H25)>0,IF(OR(CONCATENATE(B25,B26,B27)=\"\",E25=\"\",D25=\"\",C25=\"\",F25=\"\",A25=\"\"),1,0),0)","v":0}]
[]
[]
[null,null,null,null,null,null,null,null,null,{"$f":"ROUND(IF(I28=0,SUM(G28+H28),((G28+H28)/I28)),2)","v":0},null,null,null,null,null,{"$f":"IF((G28+H28)>0,IF(OR(CONCATENATE(B28,B29,B30)=\"\",E28=\"\",D28=\"\",C28=\"\",F28=\"\",A28=\"\"),1,0),0)","v":0}]
[]
[]
[null,null,null,null,null,null,null,null,null,{"$f":"ROUND(IF(I31=0,SUM(G31+H31),((G31+H31)/I31)),2)","v":0},null,null,null,null,null,{"$f":"IF((G31+H31)>0,IF(OR(CONCATENATE(B31,B32,B33)=\"\",E31=\"\",D31=\"\",C31=\"\",F31=\"\",A31=\"\"),1,0),0)","v":0}]
[]
[]
[null,null,null,null,null,null,null,null,null,{"$f":"ROUND(IF(I34=0,SUM(G34+H34),((G34+H34)/I34)),2)","v":0},null,null,null,null,null,{"$f":"IF((G34+H34)>0,IF(OR(CONCATENATE(B34,B35,B36)=\"\",E34=\"\",D34=\"\",C34=\"\",F34=\"\",A34=\"\"),1,0),0)","v":0}]
[]
[]
[null,null,null,null,null,null,null,null,null,{"$f":"ROUND(IF(I37=0,SUM(G37+H37),((G37+H37)/I37)),2)","v":0},null,null,null,null,null,{"$f":"IF((G37+H37)>0,IF(OR(CONCATENATE(B37,B38,B39)=\"\",E37=\"\",D37=\"\",C37=\"\",F37=\"\",A37=\"\"),1,0),0)","v":0}]
[]
[]
[null,null,null,null,null,null,null,null,null,{"$f":"ROUND(IF(I40=0,SUM(G40+H40),((G40+H40)/I40)),2)","v":0},null,null,null,null,null,{"$f":"IF((G40+H40)>0,IF(OR(CONCATENATE(B40,B41,B42)=\"\",E40=\"\",D40=\"\",C40=\"\",F40=\"\",A40=\"\"),1,0),0)","v":0}]
[]
[]
[null,null,null,null,null,null,null,null,null,{"$f":"ROUND(IF(I43=0,SUM(G43+H43),((G43+H43)/I43)),2)","v":0},null,null,null,null,null,{"$f":"IF((G43+H43)>0,IF(OR(CONCATENATE(B43,B44,B45)=\"\",E43=\"\",D43=\"\",C43=\"\",F43=\"\",A43=\"\"),1,0),0)","v":0}]
[]
[]
[null,null,null,null,null,null,null,null,null,{"$f":"ROUND(IF(I46=0,SUM(G46+H46),((G46+H46)/I46)),2)","v":0},null,null,null,null,null,{"$f":"IF((G46+H46)>0,IF(OR(CONCATENATE(B46,B47,B48)=\"\",E46=\"\",D46=\"\",C46=\"\",F46=\"\",A46=\"\"),1,0),0)","v":0}]
[]
[null,null,null,null,null,null,null,null,null,null,null,null,null,{"$f":"IF(SUM(J19:J48)>0,1,0)","v":0},"Print check"]
[]
["PART 5.D (1)",null,null,null,null,null,null,"LODGING/MEALS"]
["TRAVEL SUPPLEMENTARY SHEET"]
[]
["RATES DESCRIPTION","CURRENT MAXIMUM RATES"]
["Meals - Statewide","$40/day "]
["Meals - New Orleans","$45/day"]
["Hotel - Statewide","$100/night (plus tax)"]
["Hotel - New Orleans","$150/night (plus tax)"]
[]
["1.   Overnight charges (hotel or meals) are allowed for any activities when it is more cost effective than commuting"]
["2.   Meals are only reimbursable when overnight stay is required."]
["3.   Hotel charges must be accompanied by itemized bill/invoices with the guest name(s) printed by the hotel.. "]
["4.   No RAC markup allowed."]
["5.   Single site visits:  (Hotel Charges) + (Meal Charges) = Total"]
["6.   Multiple site visits:  [(Hotel Charges) + (Meal Charges)] ÷ (No. Of Sites Visited) = Total"]
["7.   Airfares, toll charges, and taxi charges are not reimbursable."]
[]
["Costing Category","Reason for Overnight Stay or Meals  \n(Select all options that apply)","Last Name of Person/s","RAC\nInvoice\nNo.","Trip \nStart Date","Trip Return Date","Hotel\nCharges","Meal\nCharges","No. of\nSites\nVisited","TOTAL",null,null,null,null,null,"Test"]
[null,null,null,null,null,null,null,null,null,{"$f":"ROUND(IF(I68=0,SUM(G68+H68),((G68+H68)/I68)),2)","v":0},null,null,null,null,null,{"$f":"IF((G68+H68)>0,IF(OR(CONCATENATE(B68,B69,B70)=\"\",E68=\"\",D68=\"\",C68=\"\",F68=\"\",A68=\"\"),1,0),0)","v":0}]
[]
[]
[null,null,null,null,null,null,null,null,null,{"$f":"ROUND(IF(I71=0,SUM(G71+H71),((G71+H71)/I71)),2)","v":0},null,null,null,null,null,{"$f":"IF((G71+H71)>0,IF(OR(CONCATENATE(B71,B72,B73)=\"\",E71=\"\",D71=\"\",C71=\"\",F71=\"\",A71=\"\"),1,0),0)","v":0}]
[]
[]
[null,null,null,null,null,null,null,null,null,{"$f":"ROUND(IF(I74=0,SUM(G74+H74),((G74+H74)/I74)),2)","v":0},null,null,null,null,null,{"$f":"IF((G74+H74)>0,IF(OR(CONCATENATE(B74,B75,B76)=\"\",E74=\"\",D74=\"\",C74=\"\",F74=\"\",A74=\"\"),1,0),0)","v":0}]
[]
[]
[null,null,null,null,null,null,null,null,null,{"$f":"ROUND(IF(I77=0,SUM(G77+H77),((G77+H77)/I77)),2)","v":0},null,null,null,null,null,{"$f":"IF((G77+H77)>0,IF(OR(CONCATENATE(B77,B78,B79)=\"\",E77=\"\",D77=\"\",C77=\"\",F77=\"\",A77=\"\"),1,0),0)","v":0}]
[]
[]
[null,null,null,null,null,null,null,null,null,{"$f":"ROUND(IF(I80=0,SUM(G80+H80),((G80+H80)/I80)),2)","v":0},null,null,null,null,null,{"$f":"IF((G80+H80)>0,IF(OR(CONCATENATE(B80,B81,B82)=\"\",E80=\"\",D80=\"\",C80=\"\",F80=\"\",A80=\"\"),1,0),0)","v":0}]
[]
[]
[null,null,null,null,null,null,null,null,null,{"$f":"ROUND(IF(I83=0,SUM(G83+H83),((G83+H83)/I83)),2)","v":0},null,null,null,null,null,{"$f":"IF((G83+H83)>0,IF(OR(CONCATENATE(B83,B84,B85)=\"\",E83=\"\",D83=\"\",C83=\"\",F83=\"\",A83=\"\"),1,0),0)","v":0}]
[]
[]
[null,null,null,null,null,null,null,null,null,{"$f":"ROUND(IF(I86=0,SUM(G86+H86),((G86+H86)/I86)),2)","v":0},null,null,null,null,null,{"$f":"IF((G86+H86)>0,IF(OR(CONCATENATE(B86,B87,B88)=\"\",E86=\"\",D86=\"\",C86=\"\",F86=\"\",A86=\"\"),1,0),0)","v":0}]
[]
[]
[null,null,null,null,null,null,null,null,null,{"$f":"ROUND(IF(I89=0,SUM(G89+H89),((G89+H89)/I89)),2)","v":0},null,null,null,null,null,{"$f":"IF((G89+H89)>0,IF(OR(CONCATENATE(B89,B90,B91)=\"\",E89=\"\",D89=\"\",C89=\"\",F89=\"\",A89=\"\"),1,0),0)","v":0}]
[]
[]
[null,null,null,null,null,null,null,null,null,{"$f":"ROUND(IF(I92=0,SUM(G92+H92),((G92+H92)/I92)),2)","v":0},null,null,null,null,null,{"$f":"IF((G92+H92)>0,IF(OR(CONCATENATE(B92,B93,B94)=\"\",E92=\"\",D92=\"\",C92=\"\",F92=\"\",A92=\"\"),1,0),0)","v":0}]
[]
[]
[null,null,null,null,null,null,null,null,null,{"$f":"ROUND(IF(I95=0,SUM(G95+H95),((G95+H95)/I95)),2)","v":0},null,null,null,null,null,{"$f":"IF((G95+H95)>0,IF(OR(CONCATENATE(B95,B96,B97)=\"\",E95=\"\",D95=\"\",C95=\"\",F95=\"\",A95=\"\"),1,0),0)","v":0}]
[]
[null,null,null,null,null,null,null,null,null,null,null,null,null,{"$f":"IF(SUM(J68:J97)>0,1,0)","v":0},"Print check"]

{"sheet":"Travel","index":11,"n_rows":148,"n_cols":16,"rows_kept":148,"cut":false,"hidden":false,"merged":[[4,0,4,3],[5,0,5,3],[6,0,6,3],[55,0,55,3],[56,0,56,3],[57,0,57,3],[104,0,104,3],[105,0,105,3],[106,0,106,3],[93,0,95,0],[93,2,95,2],[93,3,95,3],[90,0,92,0],[90,2,92,2],[90,3,92,3],[87,2,89,2],[87,3,89,3],[84,0,86,0],[84,2,86,2],[84,3,86,3],[78,0,80,0],[78,2,80,2],[78,3,80,3],[47,0,49,0],[96,15,98,15],[93,6,95,6],[93,7,95,7],[93,8,95,8],[93,9,95,9],[96,0,98,0],[96,2,98,2],[96,3,98,3],[96,4,98,4],[96,5,98,5],[96,6,98,6],[96,7,98,7],[96,8,98,8],[96,9,98,9],[93,4,95,4],[93,5,95,5],[93,15,95,15],[90,4,92,4],[90,5,92,5],[90,6,92,6],[90,7,92,7],[90,8,92,8],[90,9,92,9],[87,15,89,15],[90,15,92,15],[87,6,89,6],[87,7,89,7],[87,8,89,8],[87,9,89,9],[87,4,89,4],[87,5,89,5],[81,15,83,15],[78,6,80,6],[78,7,80,7],[84,7,86,7],[84,8,86,8],[84,9,86,9],[84,15,86,15],[78,8,80,8],[78,9,80,9],[81,7,83,7],[81,8,83,8],[81,9,83,9],[84,4,86,4],[84,5,86,5],[87,0,89,0],[81,0,83,0],[81,2,83,2],[81,3,83,3],[81,4,83,4],[81,5,83,5],[81,6,83,6],[78,4,80,4],[78,5,80,5],[72,15,74,15],[75,0,77,0],[75,2,77,2],[75,3,77,3],[75,4,77,4],[75,5,77,5],[75,6,77,6],[75,7,77,7],[75,8,77,8],[75,9,77,9],[75,15,77,15],[72,6,74,6],[72,7,74,7],[72,8,74,8],[72,9,74,9],[72,0,74,0],[78,15,80,15],[47,2,49,2],[72,2,74,2],[72,3,74,3],[66,15,68,15],[69,0,71,0],[69,2,71,2],[69,3,71,3],[69,4,71,4],[69,5,71,5],[69,6,71,6],[69,7,71,7],[69,8,71,8],[69,9,71,9],[69,15,71,15],[66,6,68,6],[66,7,68,7],[66,8,68,8],[66,9,68,9],[66,0,68,0],[66,2,68,2],[66,3,68,3],[72,4,74,4],[47,9,49,9],[47,15,49,15],[44,0,46,0],[17,6,19,6],[26,15,28,15],[35,9,37,9],[63,0,65,0],[63,2,65,2],[63,3,65,3],[63,4,65,4],[63,5,65,5],[63,6,65,6],[63,7,65,7],[63,8,65,8],[63,9,65,9],[60,0,62,0],[60,15,62,15],[63,15,65,15],[60,6,62,6],[60,7,62,7],[60,8,62,8],[60,9,62,9],[60,2,62,2],[60,3,62,3],[60,4,62,4],[60,5,62,5],[20,15,22,15],[23,15,25,15],[20,6,22,6],[20,7,22,7],[20,8,22,8],[20,9,22,9],[44,15,46,15],[23,6,25,6],[23,7,25,7],[23,8,25,8],[23,9,25,9],[35,15,37,15],[35,6,37,6],[35,7,37,7],[35,8,37,8],[29,15,31,15],[32,15,34,15],[29,6,31,6],[29,7,31,7],[26,8,28,8],[38,15,40,15],[41,15,43,15],[38,6,40,6],[38,7,40,7],[41,2,43,2],[41,3,43,3],[41,4,43,4],[41,7,43,7],[41,8,43,8],[41,9,43,9],[44,6,46,6],[44,7,46,7],[44,8,46,8],[44,9,46,9],[44,3,46,3],[44,4,46,4],[44,5,46,5],[38,8,40,8],[38,9,40,9],[11,0,13,0],[11,2,13,2],[11,3,13,3],[11,4,13,4],[26,5,28,5],[26,6,28,6],[26,7,28,7],[20,0,22,0],[20,2,22,2],[20,3,22,3],[20,4,22,4],[20,5,22,5],[11,5,13,5],[17,7,19,7],[17,0,19,0],[17,2,19,2],[17,3,19,3],[17,4,19,4],[17,5,19,5],[23,0,25,0],[23,2,25,2],[23,3,25,3],[9,1,10,1],[9,2,10,2],[9,3,10,3],[9,4,10,4],[9,5,10,5],[9,6,9,7],[9,8,10,8],[17,8,19,8],[17,9,19,9],[58,15,59,15],[9,9,10,9],[58,5,59,5],[58,6,58,7],[58,8,59,8],[58,9,59,9],[11,15,13,15],[14,2,16,2],[14,3,16,3],[14,4,16,4],[14,5,16,5],[14,15,16,15],[26,2,28,2],[26,3,28,3],[9,15,10,15],[17,15,19,15],[32,2,34,2],[32,3,34,3],[32,4,34,4],[32,5,34,5],[32,6,34,6],[32,7,34,7],[32,8,34,8],[32,9,34,9],[9,0,10,0],[14,0,16,0],[14,6,16,6],[14,7,16,7],[11,6,13,6],[11,7,13,7],[38,0,40,0],[38,2,40,2],[38,3,40,3],[38,4,40,4],[38,5,40,5],[26,0,28,0],[26,4,28,4],[23,4,25,4],[23,5,25,5],[29,0,31,0],[29,2,31,2],[29,3,31,3],[29,4,31,4],[29,5,31,5],[35,0,37,0],[35,2,37,2],[35,3,37,3],[35,4,37,4],[26,9,28,9],[66,4,68,4],[66,5,68,5],[72,5,74,5],[84,6,86,6],[58,0,59,0],[58,1,59,1],[58,2,59,2],[58,3,59,3],[58,4,59,4],[41,0,43,0],[41,5,43,5],[41,6,43,6],[29,8,31,8],[29,9,31,9],[47,3,49,3],[47,4,49,4],[47,5,49,5],[47,6,49,6],[47,7,49,7],[47,8,49,8],[35,5,37,5],[32,0,34,0],[44,2,46,2],[1,6,1,9],[2,6,2,8],[3,6,3,8],[4,6,4,8],[5,6,5,8],[6,6,6,8],[14,8,16,8],[14,9,16,9],[11,8,13,8],[11,9,13,9],[107,15,108,15],[109,0,111,0],[109,2,111,2],[109,3,111,3],[109,4,111,4],[109,5,111,5],[109,6,111,6],[109,7,111,7],[109,8,111,8],[109,9,111,9],[109,15,111,15],[107,0,108,0],[107,1,108,1],[107,2,108,2],[107,3,108,3],[107,4,108,4],[107,5,108,5],[107,6,107,7],[107,8,108,8],[107,9,108,9],[112,15,114,15],[115,0,117,0],[115,2,117,2],[115,3,117,3],[115,4,117,4],[115,5,117,5],[115,6,117,6],[115,7,117,7],[115,8,117,8],[115,9,117,9],[115,15,117,15],[112,0,114,0],[112,2,114,2],[112,3,114,3],[112,4,114,4],[112,5,114,5],[112,6,114,6],[112,7,114,7],[112,8,114,8],[112,9,114,9],[121,15,123,15],[118,0,120,0],[118,2,120,2],[118,3,120,3],[118,4,120,4],[118,5,120,5],[118,6,120,6],[118,7,120,7],[124,15,126,15],[121,0,123,0],[121,2,123,2],[121,3,123,3],[121,4,123,4],[121,5,123,5],[121,6,123,6],[121,7,123,7],[121,8,123,8],[121,9,123,9],[118,8,120,8],[118,9,120,9],[118,15,120,15],[127,15,129,15],[124,0,126,0],[124,2,126,2],[124,3,126,3],[124,4,126,4],[124,5,126,5],[124,6,126,6],[124,7,126,7],[124,8,126,8],[124,9,126,9],[127,0,129,0],[127,2,129,2],[127,3,129,3],[127,4,129,4],[127,5,129,5],[127,6,129,6],[127,7,129,7],[127,8,129,8],[127,9,129,9],[130,15,132,15],[133,0,135,0],[133,2,135,2],[133,3,135,3],[133,4,135,4],[133,5,135,5],[133,6,135,6],[133,7,135,7],[133,8,135,8],[133,9,135,9],[133,15,135,15],[130,0,132,0],[130,2,132,2],[130,3,132,3],[130,4,132,4],[130,5,132,5],[130,6,132,6],[130,7,132,7],[130,8,132,8],[130,9,132,9],[136,15,138,15],[139,0,141,0],[139,2,141,2],[139,3,141,3],[139,4,141,4],[139,5,141,5],[139,6,141,6],[139,7,141,7],[139,8,141,8],[139,9,141,9],[139,15,141,15],[136,0,138,0],[136,2,138,2],[136,3,138,3],[136,4,138,4],[136,5,138,5],[136,6,138,6],[136,7,138,7],[136,8,138,8],[136,9,138,9],[145,15,147,15],[142,0,144,0],[142,2,144,2],[142,3,144,3],[142,4,144,4],[142,5,144,5],[142,6,144,6],[142,7,144,7],[145,0,147,0],[145,2,147,2],[145,3,147,3],[145,4,147,4],[145,5,147,5],[145,6,147,6],[145,7,147,7],[145,8,147,8],[145,9,147,9],[142,8,144,8],[142,9,144,9],[142,15,144,15]]}
["PART 5.D (2)",null,null,null,null,null,"UNIT PRICE TRAVEL",null,null,null,null,null,null,{"$f":"+N50+N99+N148","v":0},"Total Print check"]
["TRAVEL SUPPLEMENTARY SHEET",null,null,null,null,null,"Costing Category Summary"]
["(The mileage unit price includes costs for fuel and personnel travel time.)",null,null,{"$f":"IF(SUM(P12:P87)>0,\"MISSING INFORMATION\",\"\")","v":""},null,null,"Emergency/Initial Work",null,null,{"$f":"SUMIF(A$12:A$50,G3,J$12:J$50)+SUMIF(A$61:A$99,G3,J$61:J$99)+SUMIF(A$110:A$148,G3,J$110:J$148)","v":0}]
[null,null,null,null,null,null,"Investigation Work",null,null,{"$f":"SUMIF(A$12:A$50,G4,J$12:J$50)+SUMIF(A$61:A$99,G4,J$61:J$99)+SUMIF(A$110:A$148,G4,J$110:J$148)","v":0}]
["1.   When multiple sites are visited in a single day, the total mileage must be divided by the number of sites visited. Total mileage ",null,null,null,null,null,"Interim Monitoring Work",null,null,0]
["       should be rounded UP to a whole number. ",null,null,null,null,null,"Corrective Action Plan Work",null,null,0]
["2.   Travel charges for work activities included in unit pricing should not be addressed on this form.",null,null,null,null,null,"Report Preparation Work",null,null,0]
[]
[]
["Costing Category","Activities Performed \n(Select all options that apply)","Date\nSort By Oldest to Newest","Destination\nShow Beginning,\nInterim, Ending Areas Traveled\n(Ex.:BR, Rayne, Lafayette, BR.)","RAC\nInvoice\nNo.","Total \nMileage","Complete these columns only when multiple site visits occurred",null,"RATE","TOTAL",null,null,null,null,null,"Test"]
[null,null,null,null,null,null,"No. of\nSites\nVisited","Adusted Mileage"]
[null,null,null,null,null,null,null,{"$f":"IF(G12=0,\"\",ROUND(F12/G12,2))","v":""},{"$f":"IF(A12=\"\",0,Reference!B$74)","v":0},{"$f":"ROUND(IF(G12=0,F12*I12,H12*I12),2)","v":0},null,null,null,null,null,{"$f":"IF(F12>0,IF(OR(A12=\"\",CONCATENATE(B12,B13,B14)=\"\",C12=\"\",D12=\"\",E12=\"\"),1,0),0)","v":0}]
[]
[]
[null,null,null,null,null,null,null,{"$f":"IF(G15=0,\"\",ROUND(F15/G15,2))","v":""},{"$f":"IF(A15=\"\",0,Reference!B$74)","v":0},{"$f":"ROUND(IF(G15=0,F15*I15,H15*I15),2)","v":0},null,null,null,null,null,{"$f":"IF(F15>0,IF(OR(A15=\"\",CONCATENATE(B15,B16,B17)=\"\",C15=\"\",D15=\"\",E15=\"\"),1,0),0)","v":0}]
[]
[]
[null,null,null,null,null,null,null,{"$f":"IF(G18=0,\"\",ROUND(F18/G18,2))","v":""},{"$f":"IF(A18=\"\",0,Reference!B$74)","v":0},{"$f":"ROUND(IF(G18=0,F18*I18,H18*I18),2)","v":0},null,null,null,null,null,{"$f":"IF(F18>0,IF(OR(A18=\"\",CONCATENATE(B18,B19,B20)=\"\",C18=\"\",D18=\"\",E18=\"\"),1,0),0)","v":0}]
[]
[]
[null,null,null,null,null,null,null,{"$f":"IF(G21=0,\"\",ROUND(F21/G21,2))","v":""},{"$f":"IF(A21=\"\",0,Reference!B$74)","v":0},{"$f":"ROUND(IF(G21=0,F21*I21,H21*I21),2)","v":0},null,null,null,null,null,{"$f":"IF(F21>0,IF(OR(A21=\"\",CONCATENATE(B21,B22,B23)=\"\",C21=\"\",D21=\"\",E21=\"\"),1,0),0)","v":0}]
[]
[]
[null,null,null,null,null,null,null,{"$f":"IF(G24=0,\"\",ROUND(F24/G24,2))","v":""},{"$f":"IF(A24=\"\",0,Reference!B$74)","v":0},{"$f":"ROUND(IF(G24=0,F24*I24,H24*I24),2)","v":0},null,null,null,null,null,{"$f":"IF(F24>0,IF(OR(A24=\"\",CONCATENATE(B24,B25,B26)=\"\",C24=\"\",D24=\"\",E24=\"\"),1,0),0)","v":0}]
[]
[]
[null,null,null,null,null,null,null,{"$f":"IF(G27=0,\"\",ROUND(F27/G27,2))","v":""},{"$f":"IF(A27=\"\",0,Reference!B$74)","v":0},{"$f":"ROUND(IF(G27=0,F27*I27,H27*I27),2)","v":0},null,null,null,null,null,{"$f":"IF(F27>0,IF(OR(A27=\"\",CONCATENATE(B27,B28,B29)=\"\",C27=\"\",D27=\"\",E27=\"\"),1,0),0)","v":0}]
[]
[]
[null,null,null,null,null,null,null,{"$f":"IF(G30=0,\"\",ROUND(F30/G30,2))","v":""},{"$f":"IF(A30=\"\",0,Reference!B$74)","v":0},{"$f":"ROUND(IF(G30=0,F30*I30,H30*I30),2)","v":0},null,null,null,null,null,{"$f":"IF(F30>0,IF(OR(A30=\"\",CONCATENATE(B30,B31,B32)=\"\",C30=\"\",D30=\"\",E30=\"\"),1,0),0)","v":0}]
[]
[]
[null,null,null,null,null,null,null,{"$f":"IF(G33=0,\"\",ROUND(F33/G33,2))","v":""},{"$f":"IF(A33=\"\",0,Reference!B$74)","v":0},{"$f":"ROUND(IF(G33=0,F33*I33,H33*I33),2)","v":0},null,null,null,null,null,{"$f":"IF(F33>0,IF(OR(A33=\"\",CONCATENATE(B33,B34,B35)=\"\",C33=\"\",D33=\"\",E33=\"\"),1,0),0)","v":0}]
[]
[]
[null,null,null,null,null,null,null,{"$f":"IF(G36=0,\"\",ROUND(F36/G36,2))","v":""},{"$f":"IF(A36=\"\",0,Reference!B$74)","v":0},{"$f":"ROUND(IF(G36=0,F36*I36,H36*I36),2)","v":0},null,null,null,null,null,{"$f":"IF(F36>0,IF(OR(A36=\"\",CONCATENATE(B36,B37,B38)=\"\",C36=\"\",D36=\"\",E36=\"\"),1,0),0)","v":0}]
[]
[]
[null,null,null,null,null,null,null,{"$f":"IF(G39=0,\"\",ROUND(F39/G39,2))","v":""},{"$f":"IF(A39=\"\",0,Reference!B$74)","v":0},{"$f":"ROUND(IF(G39=0,F39*I39,H39*I39),2)","v":0},null,null,null,null,null,{"$f":"IF(F39>0,IF(OR(A39=\"\",CONCATENATE(B39,B40,B41)=\"\",C39=\"\",D39=\"\",E39=\"\"),1,0),0)","v":0}]
[]
[]
[null,null,null,null,null,null,null,{"$f":"IF(G42=0,\"\",ROUND(F42/G42,2))","v":""},{"$f":"IF(A42=\"\",0,Reference!B$74)","v":0},{"$f":"ROUND(IF(G42=0,F42*I42,H42*I42),2)","v":0},null,null,null,null,null,{"$f":"IF(F42>0,IF(OR(A42=\"\",CONCATENATE(B42,B43,B44)=\"\",C42=\"\",D42=\"\",E42=\"\"),1,0),0)","v":0}]
[]
[]
[null,null,null,null,null,null,null,{"$f":"IF(G45=0,\"\",ROUND(F45/G45,2))","v":""},{"$f":"IF(A45=\"\",0,Reference!B$74)","v":0},{"$f":"ROUND(IF(G45=0,F45*I45,H45*I45),2)","v":0},null,null,null,null,null,{"$f":"IF(F45>0,IF(OR(A45=\"\",CONCATENATE(B45,B46,B47)=\"\",C45=\"\",D45=\"\",E45=\"\"),1,0),0)","v":0}]
[]
[]
[null,null,null,null,null,null,null,{"$f":"IF(G48=0,\"\",ROUND(F48/G48,2))","v":""},{"$f":"IF(A48=\"\",0,Reference!B$74)","v":0},{"$f":"ROUND(IF(G48=0,F48*I48,H48*I48),2)","v":0},null,null,null,null,null,{"$f":"IF(F48>0,IF(OR(A48=\"\",CONCATENATE(B48,B49,B50)=\"\",C48=\"\",D48=\"\",E48=\"\"),1,0),0)","v":0}]
[]
[null,null,null,null,null,null,null,null,null,null,null,null,null,{"$f":"IF(SUM(J12:J50)>0,1,0)","v":0},"Print check"]
[]
["PART 5.D (2)",null,null,null,null,null,null,"UNIT PRICE TRAVEL"]
["TRAVEL SUPPLEMENTARY SHEET"]
["(The unit price addresses costs associated with vehicle mileage and employees’ travel time)"]
[]
["1.   When multiple sites are visited in a single day, the total mileage must be divided by the number of sites visited. Total mileage "]
["       should be rounded UP to a whole number. "]
["2.   Travel charges for work activities included in unit pricing should not be addressed on this form."]
["Costing Category","Activities Performed \n(Select all options that apply)","Date\nSort By Oldest to Newest","Destination\nShow Beginning,\nInterim, Ending Areas Traveled\n(Ex.:BR, Rayne, Lafayette, BR.)","RAC\nInvoice\nNo.","Total \nMileage","Complete these columns only when multiple site visits occurred",null,"RATE","TOTAL",null,null,null,null,null,"Test"]
[null,null,null,null,null,null,"No. of\nSites\nVisited","Adusted Mileage"]
[null,null,null,null,null,null,null,{"$f":"IF(G61=0,\"\",ROUND(F61/G61,2))","v":""},{"$f":"IF(A61=\"\",0,Reference!B$74)","v":0},{"$f":"ROUND(IF(G61=0,F61*I61,H61*I61),2)","v":0},null,null,null,null,null,{"$f":"IF(F61>0,IF(OR(A61=\"\",CONCATENATE(B61,B62,B63)=\"\",C61=\"\",D61=\"\",E61=\"\"),1,0),0)","v":0}]
[]
[]
[null,null,null,null,null,null,null,{"$f":"IF(G64=0,\"\",ROUND(F64/G64,2))","v":""},{"$f":"IF(A64=\"\",0,Reference!B$74)","v":0},{"$f":"ROUND(IF(G64=0,F64*I64,H64*I64),2)","v":0},null,null,null,null,null,{"$f":"IF(F64>0,IF(OR(A64=\"\",CONCATENATE(B64,B65,B66)=\"\",C64=\"\",D64=\"\",E64=\"\"),1,0),0)","v":0}]
[]
[]
[null,null,null,null,null,null,null,{"$f":"IF(G67=0,\"\",ROUND(F67/G67,2))","v":""},{"$f":"IF(A67=\"\",0,Reference!B$74)","v":0},{"$f":"ROUND(IF(G67=0,F67*I67,H67*I67),2)","v":0},null,null,null,null,null,{"$f":"IF(F67>0,IF(OR(A67=\"\",CONCATENATE(B67,B68,B69)=\"\",C67=\"\",D67=\"\",E67=\"\"),1,0),0)","v":0}]
[]
[]
[null,null,null,null,null,null,null,{"$f":"IF(G70=0,\"\",ROUND(F70/G70,2))","v":""},{"$f":"IF(A70=\"\",0,Reference!B$74)","v":0},{"$f":"ROUND(IF(G70=0,F70*I70,H70*I70),2)","v":0},null,null,null,null,null,{"$f":"IF(F70>0,IF(OR(A70=\"\",CONCATENATE(B70,B71,B72)=\"\",C70=\"\",D70=\"\",E70=\"\"),1,0),0)","v":0}]
[]
[]
[null,null,null,null,null,null,null,{"$f":"IF(G73=0,\"\",ROUND(F73/G73,2))","v":""},{"$f":"IF(A73=\"\",0,Reference!B$74)","v":0},{"$f":"ROUND(IF(G73=0,F73*I73,H73*I73),2)","v":0},null,null,null,null,null,{"$f":"IF(F73>0,IF(OR(A73=\"\",CONCATENATE(B73,B74,B75)=\"\",C73=\"\",D73=\"\",E73=\"\"),1,0),0)","v":0}]
[]
[]
[null,null,null,null,null,null,null,{"$f":"IF(G76=0,\"\",ROUND(F76/G76,2))","v":""},{"$f":"IF(A76=\"\",0,Reference!B$74)","v":0},{"$f":"ROUND(IF(G76=0,F76*I76,H76*I76),2)","v":0},null,null,null,null,null,{"$f":"IF(F76>0,IF(OR(A76=\"\",CONCATENATE(B76,B77,B78)=\"\",C76=\"\",D76=\"\",E76=\"\"),1,0),0)","v":0}]
[]
[]
[null,null,null,null,null,null,null,{"$f":"IF(G79=0,\"\",ROUND(F79/G79,2))","v":""},{"$f":"IF(A79=\"\",0,Reference!B$74)","v":0},{"$f":"ROUND(IF(G79=0,F79*I79,H79*I79),2)","v":0},null,null,null,null,null,{"$f":"IF(F79>0,IF(OR(A79=\"\",CONCATENATE(B79,B80,B81)=\"\",C79=\"\",D79=\"\",E79=\"\"),1,0),0)","v":0}]
[]
[]
[null,null,null,null,null,null,null,{"$f":"IF(G82=0,\"\",ROUND(F82/G82,2))","v":""},{"$f":"IF(A82=\"\",0,Reference!B$74)","v":0},{"$f":"ROUND(IF(G82=0,F82*I82,H82*I82),2)","v":0},null,null,null,null,null,{"$f":"IF(F82>0,IF(OR(A82=\"\",CONCATENATE(B82,B83,B84)=\"\",C82=\"\",D82=\"\",E82=\"\"),1,0),0)","v":0}]
[]
[]
[null,null,null,null,null,null,null,{"$f":"IF(G85=0,\"\",ROUND(F85/G85,2))","v":""},{"$f":"IF(A85=\"\",0,Reference!B$74)","v":0},{"$f":"ROUND(IF(G85=0,F85*I85,H85*I85),2)","v":0},null,null,null,null,null,{"$f":"IF(F85>0,IF(OR(A85=\"\",CONCATENATE(B85,B86,B87)=\"\",C85=\"\",D85=\"\",E85=\"\"),1,0),0)","v":0}]
[]
[]
[null,null,null,null,null,null,null,{"$f":"IF(G88=0,\"\",ROUND(F88/G88,2))","v":""},{"$f":"IF(A88=\"\",0,Reference!B$74)","v":0},{"$f":"ROUND(IF(G88=0,F88*I88,H88*I88),2)","v":0},null,null,null,null,null,{"$f":"IF(F88>0,IF(OR(A88=\"\",CONCATENATE(B88,B89,B90)=\"\",C88=\"\",D88=\"\",E88=\"\"),1,0),0)","v":0}]
[]
[]
[null,null,null,null,null,null,null,{"$f":"IF(G91=0,\"\",ROUND(F91/G91,2))","v":""},{"$f":"IF(A91=\"\",0,Reference!B$74)","v":0},{"$f":"ROUND(IF(G91=0,F91*I91,H91*I91),2)","v":0},null,null,null,null,null,{"$f":"IF(F91>0,IF(OR(A91=\"\",CONCATENATE(B91,B92,B93)=\"\",C91=\"\",D91=\"\",E91=\"\"),1,0),0)","v":0}]
[]
[]
[null,null,null,null,null,null,null,{"$f":"IF(G94=0,\"\",ROUND(F94/G94,2))","v":""},{"$f":"IF(A94=\"\",0,Reference!B$74)","v":0},{"$f":"ROUND(IF(G94=0,F94*I94,H94*I94),2)","v":0},null,null,null,null,null,{"$f":"IF(F94>0,IF(OR(A94=\"\",CONCATENATE(B94,B95,B96)=\"\",C94=\"\",D94=\"\",E94=\"\"),1,0),0)","v":0}]
[]
[]
[null,null,null,null,null,null,null,{"$f":"IF(G97=0,\"\",ROUND(F97/G97,2))","v":""},{"$f":"IF(A97=\"\",0,Reference!B$74)","v":0},{"$f":"ROUND(IF(G97=0,F97*I97,H97*I97),2)","v":0},null,null,null,null,null,{"$f":"IF(F97>0,IF(OR(A97=\"\",CONCATENATE(B97,B98,B99)=\"\",C97=\"\",D97=\"\",E97=\"\"),1,0),0)","v":0}]
[]
[null,null,null,null,null,null,null,null,null,null,null,null,null,{"$f":"IF(SUM(J61:J99)>0,1,0)","v":0},"Print check"]
[]
["PART 5.D (2)",null,null,null,null,null,null,"UNIT PRICE TRAVEL"]
["TRAVEL SUPPLEMENTARY SHEET"]
["(The unit price addresses costs associated with vehicle mileage and employees’ travel time)"]
[]
["1.   When multiple sites are visited in a single day, the total mileage must be divided by the number of sites visited. Total mileage "]
["       should be rounded UP to a whole number. "]
["2.   Travel charges for work activities included in unit pricing should not be addressed on this form."]
["Costing Category","Activities Performed \n(Select all options that apply)","Date\nSort By Oldest to Newest","Destination\nShow Beginning,\nInterim, Ending Areas Traveled\n(Ex.:BR, Rayne, Lafayette, BR.)","RAC\nInvoice\nNo.","Total \nMileage","Complete these columns only when multiple site visits occurred",null,"RATE","TOTAL",null,null,null,null,null,"Test"]
[null,null,null,null,null,null,"No. of\nSites\nVisited","Adusted Mileage"]
[null,null,null,null,null,null,null,{"$f":"IF(G110=0,\"\",ROUND(F110/G110,2))","v":""},{"$f":"IF(A110=\"\",0,Reference!B$74)","v":0},{"$f":"ROUND(IF(G110=0,F110*I110,H110*I110),2)","v":0},null,null,null,null,null,{"$f":"IF(F110>0,IF(OR(A110=\"\",CONCATENATE(B110,B111,B112)=\"\",C110=\"\",D110=\"\",E110=\"\"),1,0),0)","v":0}]
[]
[]
[null,null,null,null,null,null,null,{"$f":"IF(G113=0,\"\",ROUND(F113/G113,2))","v":""},{"$f":"IF(A113=\"\",0,Reference!B$74)","v":0},{"$f":"ROUND(IF(G113=0,F113*I113,H113*I113),2)","v":0},null,null,null,null,null,{"$f":"IF(F113>0,IF(OR(A113=\"\",CONCATENATE(B113,B114,B115)=\"\",C113=\"\",D113=\"\",E113=\"\"),1,0),0)","v":0}]
[]
[]
[null,null,null,null,null,null,null,{"$f":"IF(G116=0,\"\",ROUND(F116/G116,2))","v":""},{"$f":"IF(A116=\"\",0,Reference!B$74)","v":0},{"$f":"ROUND(IF(G116=0,F116*I116,H116*I116),2)","v":0},null,null,null,null,null,{"$f":"IF(F116>0,IF(OR(A116=\"\",CONCATENATE(B116,B117,B118)=\"\",C116=\"\",D116=\"\",E116=\"\"),1,0),0)","v":0}]
[]
[]
[null,null,null,null,null,null,null,{"$f":"IF(G119=0,\"\",ROUND(F119/G119,2))","v":""},{"$f":"IF(A119=\"\",0,Reference!B$74)","v":0},{"$f":"ROUND(IF(G119=0,F119*I119,H119*I119),2)","v":0},null,null,null,null,null,{"$f":"IF(F119>0,IF(OR(A119=\"\",CONCATENATE(B119,B120,B121)=\"\",C119=\"\",D119=\"\",E119=\"\"),1,0),0)","v":0}]
[]
[]
[null,null,null,null,null,null,null,{"$f":"IF(G122=0,\"\",ROUND(F122/G122,2))","v":""},{"$f":"IF(A122=\"\",0,Reference!B$74)","v":0},{"$f":"ROUND(IF(G122=0,F122*I122,H122*I122),2)","v":0},null,null,null,null,null,{"$f":"IF(F122>0,IF(OR(A122=\"\",CONCATENATE(B122,B123,B124)=\"\",C122=\"\",D122=\"\",E122=\"\"),1,0),0)","v":0}]
[]
[]
[null,null,null,null,null,null,null,{"$f":"IF(G125=0,\"\",ROUND(F125/G125,2))","v":""},{"$f":"IF(A125=\"\",0,Reference!B$74)","v":0},{"$f":"ROUND(IF(G125=0,F125*I125,H125*I125),2)","v":0},null,null,null,null,null,{"$f":"IF(F125>0,IF(OR(A125=\"\",CONCATENATE(B125,B126,B127)=\"\",C125=\"\",D125=\"\",E125=\"\"),1,0),0)","v":0}]
[]
[]
[null,null,null,null,null,null,null,{"$f":"IF(G128=0,\"\",ROUND(F128/G128,2))","v":""},{"$f":"IF(A128=\"\",0,Reference!B$74)","v":0},{"$f":"ROUND(IF(G128=0,F128*I128,H128*I128),2)","v":0},null,null,null,null,null,{"$f":"IF(F128>0,IF(OR(A128=\"\",CONCATENATE(B128,B129,B130)=\"\",C128=\"\",D128=\"\",E128=\"\"),1,0),0)","v":0}]
[]
[]
[null,null,null,null,null,null,null,{"$f":"IF(G131=0,\"\",ROUND(F131/G131,2))","v":""},{"$f":"IF(A131=\"\",0,Reference!B$74)","v":0},{"$f":"ROUND(IF(G131=0,F131*I131,H131*I131),2)","v":0},null,null,null,null,null,{"$f":"IF(F131>0,IF(OR(A131=\"\",CONCATENATE(B131,B132,B133)=\"\",C131=\"\",D131=\"\",E131=\"\"),1,0),0)","v":0}]
[]
[]
[null,null,null,null,null,null,null,{"$f":"IF(G134=0,\"\",ROUND(F134/G134,2))","v":""},{"$f":"IF(A134=\"\",0,Reference!B$74)","v":0},{"$f":"ROUND(IF(G134=0,F134*I134,H134*I134),2)","v":0},null,null,null,null,null,{"$f":"IF(F134>0,IF(OR(A134=\"\",CONCATENATE(B134,B135,B136)=\"\",C134=\"\",D134=\"\",E134=\"\"),1,0),0)","v":0}]
[]
[]
[null,null,null,null,null,null,null,{"$f":"IF(G137=0,\"\",ROUND(F137/G137,2))","v":""},{"$f":"IF(A137=\"\",0,Reference!B$74)","v":0},{"$f":"ROUND(IF(G137=0,F137*I137,H137*I137),2)","v":0},null,null,null,null,null,{"$f":"IF(F137>0,IF(OR(A137=\"\",CONCATENATE(B137,B138,B139)=\"\",C137=\"\",D137=\"\",E137=\"\"),1,0),0)","v":0}]
[]
[]
[null,null,null,null,null,null,null,{"$f":"IF(G140=0,\"\",ROUND(F140/G140,2))","v":""},{"$f":"IF(A140=\"\",0,Reference!B$74)","v":0},{"$f":"ROUND(IF(G140=0,F140*I140,H140*I140),2)","v":0},null,null,null,null,null,{"$f":"IF(F140>0,IF(OR(A140=\"\",CONCATENATE(B140,B141,B142)=\"\",C140=\"\",D140=\"\",E140=\"\"),1,0),0)","v":0}]
[]
[]
[null,null,null,null,null,null,null,{"$f":"IF(G143=0,\"\",ROUND(F143/G143,2))","v":""},{"$f":"IF(A143=\"\",0,Reference!B$74)","v":0},{"$f":"ROUND(IF(G143=0,F143*I143,H143*I143),2)","v":0},null,null,null,null,null,{"$f":"IF(F143>0,IF(OR(A143=\"\",CONCATENATE(B143,B144,B145)=\"\",C143=\"\",D143=\"\",E143=\"\"),1,0),0)","v":0}]
[]
[]
[null,null,null,null,null,null,null,{"$f":"IF(G146=0,\"\",ROUND(F146/G146,2))","v":""},{"$f":"IF(A146=\"\",0,Reference!B$74)","v":0},{"$f":"ROUND(IF(G146=0,F146*I146,H146*I146),2)","v":0},null,null,null,null,null,{"$f":"IF(F146>0,IF(OR(A146=\"\",CONCATENATE(B146,B147,B148)=\"\",C146=\"\",D146=\"\",E146=\"\"),1,0),0)","v":0}]
[]
[null,null,null,null,null,null,null,null,null,null,null,null,null,{"$f":"IF(SUM(J110:J148)>0,1,0)","v":0},"Print check"]

{"sheet":"Transportation&Shipping","index":12,"n_rows":73,"n_cols":14,"rows_kept":73,"cut":false,"hidden":false,"merged":[[6,3,6,5],[7,3,7,5],[6,6,6,7],[7,6,7,7],[3,3,3,7],[4,3,4,5],[5,3,5,5],[4,6,4,7],[5,6,5,7]]}
["PART 5.E",null,null,null,null,null,null,null,null,null,null,{"$f":"+L37+L73","v":0},"Total Print check"]
["TRANSPORTATION/SHIPPING SUPPLEMENTARY SHEET"]
[null,{"$f":"IF(SUM(N13:N73)>0,\"MISSING INFORMATION\",\"\")","v":""}]
[null,null,null,"Costing Category Summary"]
[null,null,null,"Emergency/Initial Work",null,null,{"$f":"SUMIF(A$13:A$37,D5,H$13:H$37)+SUMIF(A$49:A$73,D5,H$49:H$73)","v":0}]
["1.    List shipping charges for contaminated soils and/or water and equipment used for activities other than well drilling, P&A, and geoprobe work.",null,null,"Investigation Work",null,null,{"$f":"SUMIF(A$13:A$37,D6,H$13:H$37)+SUMIF(A$49:A$73,D6,H$49:H$73)","v":0}]
["2.    If a single invoice addresses charges for multiple sites, indicate each site name and the amount charged to each site on the invoice.",null,null,"Interim Monitoring Work",null,null,{"$f":"SUMIF(A$13:A$37,D7,H$13:H$37)+SUMIF(A$49:A$73,D7,H$49:H$73)","v":0}]
["3.    Rush charges not required by DEQ will not be reimbursed.",null,null,"Corrective Action Plan Work",null,null,{"$f":"SUMIF(A$13:A$37,D8,H$13:H$37)+SUMIF(A$49:A$73,D8,H$49:H$73)","v":0}]
["4.    Transportation charges for work activities included in unit pricing should not be addressed on this form."]
[]
[]
["Costing Category","Description of Each Item Shipped","RAC\nInvoice\nNo.","Outside\nInvoice\nNo.","10% Markup Applies \n(Yes/No)","Shipping\n Cost  \n($)","Markup Subtotal\n($)","TOTAL \n($)",null,null,null,null,null,"Test"]
[null,null,null,null,null,null,{"$f":"IF(E13=\"Yes\",H13-F13,0)","v":0},{"$f":"IF(F13<>0,IF(E13=\"Yes\",F13*1.1,F13),0)","v":0},null,null,null,null,null,{"$f":"IF(H13>0,IF(OR(A13=\"\",B13=\"\",C13=\"\",D13=\"\"),1,0),0)","v":0}]
[null,null,null,null,null,null,{"$f":"IF(E14=\"Yes\",H14-F14,0)","v":0},{"$f":"IF(F14<>0,IF(E14=\"Yes\",F14*1.1,F14),0)","v":0},null,null,null,null,null,{"$f":"IF(H14>0,IF(OR(A14=\"\",B14=\"\",C14=\"\",D14=\"\"),1,0),0)","v":0}]
[null,null,null,null,null,null,0,0,null,null,null,null,null,0]
[null,null,null,null,null,null,0,0,null,null,null,null,null,0]
[null,null,null,null,null,null,0,0,null,null,null,null,null,0]
[null,null,null,null,null,null,0,0,null,null,null,null,null,0]
[null,null,null,null,null,null,0,0,null,null,null,null,null,0]
[null,null,null,null,null,null,0,0,null,null,null,null,null,0]
[null,null,null,null,null,null,0,0,null,null,null,null,null,0]
[null,null,null,null,null,null,0,0,null,null,null,null,null,0]
[null,null,null,null,null,null,0,0,null,null,null,null,null,0]
[null,null,null,null,null,null,0,0,null,null,null,null,null,0]
[null,null,null,null,null,null,0,0,null,null,null,null,null,0]
[null,null,null,null,null,null,0,0,null,null,null,null,null,0]
[null,null,null,null,null,null,0,0,null,null,null,null,null,0]
[null,null,null,null,null,null,0,0,null,null,null,null,null,0]
[null,null,null,null,null,null,0,0,null,null,null,null,null,0]
[null,null,null,null,null,null,0,0,null,null,null,null,null,0]
[null,null,null,null,null,null,0,0,null,null,null,null,null,0]
[null,null,null,null,null,null,0,0,null,null,null,null,null,0]
[null,null,null,null,null,null,0,0,null,null,null,null,null,0]
[null,null,null,null,null,null,0,0,null,null,null,null,null,0]
[null,null,null,null,null,null,0,0,null,null,null,null,null,0]
[null,null,null,null,null,null,0,0,null,null,null,null,null,0]
[null,null,null,null,null,null,0,0,null,null,null,{"$f":"IF(SUM(H13:H37)>0,1,0)","v":0},"Print check",0]
[]
["PART 5.E"]
["TRANSPORTATION/SHIPPING SUPPLEMENTARY SHEET"]
[]
["1.    List shipping charges for contaminated soils and/or water and equipment used for activities other than well drilling, P&A, and geoprobe work."]
["2.    If a single invoice addresses charges for multiple sites, indicate each site name and the amount charged to each site on the invoice."]
["3.    Rush charges not required by DEQ will not be reimbursed."]
["4.    Transportation charges for work activities included in unit pricing should not be addressed on this form."]
[]
[]
["Costing Category","Description of Each Item Shipped","RAC\nInvoice\nNo.","Outside\nInvoice\nNo.","10% Markup Applies \n(Yes/No)","Shipping\n Cost  \n($)","Markup Subtotal\n($)","TOTAL \n($)",null,null,null,null,null,"Test"]
[null,null,null,null,null,null,{"$f":"IF(E49=\"Yes\",H49-F49,0)","v":0},{"$f":"IF(F49<>0,IF(E49=\"Yes\",F49*1.1,F49),0)","v":0},null,null,null,null,null,{"$f":"IF(H49>0,IF(OR(A49=\"\",B49=\"\",C49=\"\",D49=\"\"),1,0),0)","v":0}]
[null,null,null,null,null,null,{"$f":"IF(E50=\"Yes\",H50-F50,0)","v":0},0,null,null,null,null,null,{"$f":"IF(H50>0,IF(OR(A50=\"\",B50=\"\",C50=\"\",D50=\"\"),1,0),0)","v":0}]
[null,null,null,null,null,null,0,0,null,null,null,null,null,0]
[null,null,null,null,null,null,0,0,null,null,null,null,null,0]
[null,null,null,null,null,null,0,0,null,null,null,null,null,0]
[null,null,null,null,null,null,0,0,null,null,null,null,null,0]
[null,null,null,null,null,null,0,0,null,null,null,null,null,0]
[null,null,null,null,null,null,0,0,null,null,null,null,null,0]
[null,null,null,null,null,null,0,0,null,null,null,null,null,0]
[null,null,null,null,null,null,0,0,null,null,null,null,null,0]
[null,null,null,null,null,null,0,0,null,null,null,null,null,0]
[null,null,null,null,null,null,0,0,null,null,null,null,null,0]
[null,null,null,null,null,null,0,0,null,null,null,null,null,0]
[null,null,null,null,null,null,0,0,null,null,null,null,null,0]
[null,null,null,null,null,null,0,0,null,null,null,null,null,0]
[null,null,null,null,null,null,0,0,null,null,null,null,null,0]
[null,null,null,null,null,null,0,0,null,null,null,null,null,0]
[null,null,null,null,null,null,0,0,null,null,null,null,null,0]
[null,null,null,null,null,null,0,0,null,null,null,null,null,0]
[null,null,null,null,null,null,0,0,null,null,null,null,null,0]
[null,null,null,null,null,null,0,0,null,null,null,null,null,0]
[null,null,null,null,null,null,0,0,null,null,null,null,null,0]
[null,null,null,null,null,null,0,0,null,null,null,null,null,0]
[null,null,null,null,null,null,0,0,null,null,null,null,null,0]
[null,null,null,null,null,null,0,0,null,null,null,{"$f":"IF(SUM(H49:H73)>0,1,0)","v":0},"Print check",0]

{"sheet":"Drilling-P&A","index":13,"n_rows":79,"n_cols":17,"rows_kept":79,"cut":false,"hidden":false,"merged":[[7,5,7,8],[8,5,8,7],[9,5,9,7],[10,5,10,7],[11,5,11,7],[33,0,33,8],[73,0,73,8],[78,6,78,7],[75,6,75,7],[76,6,76,7],[77,6,77,7],[34,6,34,7],[35,6,35,7],[74,6,74,7],[36,6,36,7],[37,6,37,7],[38,6,38,7]]}
["PART 5.F",null,null,{"$f":"IF(SUM(Q18:Q79)>0,\"MISSING INFORMATION\",\"\")","v":""},null,null,null,null,null,null,null,null,{"$f":"+M39+M79","v":0},"Total Print check"]
["DRILLING/PLUGGING & ABANDONMENT SUPPLEMENTARY SHEET"]
[]
[]
[]
["1.  The per foot rates include all costs associated with drilling or P&A of wells and borings with the exceptions of mileage, mob/demob unit price, analysis, and disposal of cuttings."]
["2.   (Depth of Boring or Well) X (Cost Per Foot) = (Total)"]
["3.   When a boring is converted to a monitoring well, only the monitoring well rate is reimbursable.",null,null,null,null,"Costing Category Summary"]
["4.   Drilling logs, well registrations, and P&A forms must be provided.",null,null,null,null,"Emergency/Initial Work",null,null,{"$f":"SUMIF(A$18:A$39,F9,I$18:I$39)+SUMIF(A$58:A$79,F9,I$58:I$79)","v":0}]
["5.   In the “Activity Type” column, enter one of the following P&A methods:",null,null,null,null,"Investigation Work",null,null,{"$f":"SUMIF(A$18:A$39,F10,I$18:I$39)+SUMIF(A$58:A$79,F10,I$58:I$79)","v":0}]
["                    P&A-1     =  Overdrilling ",null,null,null,null,"Interim Monitoring Work",null,null,{"$f":"SUMIF(A$18:A$39,F11,I$18:I$39)+SUMIF(A$58:A$79,F11,I$58:I$79)","v":0}]
["                    P&A-2     =  Pulling casing/screen and grouting",null,null,null,null,"Corrective Action Plan Work",null,null,{"$f":"SUMIF(A$18:A$39,F12,I$18:I$39)+SUMIF(A$58:A$79,F12,I$58:I$79)","v":0}]
["                    P&A-3     =  Grouting only"]
["6.   If a minimum rate or per-day rate for chemical injection is being charged, indicate the number of events next to the appropriate activity. All well/activity information "]
["      must be documented, excluding the Cost Per Foot Rate and including the dates of chemical injection events."]
[]
["Costing Category","Well/Boring\nIdentification Numbers\n(As shown in technical\nreports to DEQ) ","Date of Activity","Well Type, Activity, and \nDiameter (inches)","RAC\nInvoice\nNo.","Activity Type\n[New well, or P&A \n(1, 2, or 3);\nsee note 5]","Depth \n(feet)","Cost Per\nFoot\nRate ","TOTAL",null,null,null,null,null,"New Well ($/ft)","P&A ($/ft)","Test"]
[null,null,null,null,null,null,null,{"$f":"IF(D18=\"\",0,IF(F18=\"New well\",O18,IF(LEFT(F18,3)=\"P&A\",P18,0)))","v":0},{"$f":"ROUND((G18*H18),2)","v":0},null,null,null,null,null,{"$f":"IF(F18=\"New well\",VLOOKUP('Drilling-P&A'!D18,Reference!A$106:E$117,5,FALSE),0)","v":0},{"$f":"IF(F18=\"P&A-1\",VLOOKUP(D18,Reference!A$106:I$117,7,FALSE),IF(F18=\"P&A-2\",VLOOKUP(D18,Reference!A$106:I$117,8,FALSE),IF(F18=\"P&A-3\",VLOOKUP(D18,Reference!A$106:I$117,9,FALSE),0)))","v":0},{"$f":"IF(D18<>\"\",IF(OR(A18=\"\",B18=\"\",C18=\"\",E18=\"\",F18=\"\",G18=\"\"),1,0),0)","v":0}]
[null,null,null,null,null,null,null,{"$f":"IF(D19=\"\",0,IF(F19=\"New well\",O19,IF(LEFT(F19,3)=\"P&A\",P19,0)))","v":0},{"$f":"ROUND((G19*H19),2)","v":0},null,null,null,null,null,{"$f":"IF(F19=\"New well\",VLOOKUP('Drilling-P&A'!D19,Reference!A$106:E$117,5,FALSE),0)","v":0},{"$f":"IF(F19=\"P&A-1\",VLOOKUP(D19,Reference!A$106:I$117,7,FALSE),IF(F19=\"P&A-2\",VLOOKUP(D19,Reference!A$106:I$117,8,FALSE),IF(F19=\"P&A-3\",VLOOKUP(D19,Reference!A$106:I$117,9,FALSE),0)))","v":0},{"$f":"IF(D19<>\"\",IF(OR(A19=\"\",B19=\"\",C19=\"\",E19=\"\",F19=\"\",G19=\"\"),1,0),0)","v":0}]
[null,null,null,null,null,null,null,0,0,null,null,null,null,null,{"$f":"IF(F20=\"New well\",VLOOKUP('Drilling-P&A'!D20,Reference!A$106:E$117,5,FALSE),0)","v":0},{"$f":"IF(F20=\"P&A-1\",VLOOKUP(D20,Reference!A$106:I$117,7,FALSE),IF(F20=\"P&A-2\",VLOOKUP(D20,Reference!A$106:I$117,8,FALSE),IF(F20=\"P&A-3\",VLOOKUP(D20,Reference!A$106:I$117,9,FALSE),0)))","v":0},0]
[null,null,null,null,null,null,null,0,0,null,null,null,null,null,{"$f":"IF(F21=\"New well\",VLOOKUP('Drilling-P&A'!D21,Reference!A$106:E$117,5,FALSE),0)","v":0},{"$f":"IF(F21=\"P&A-1\",VLOOKUP(D21,Reference!A$106:I$117,7,FALSE),IF(F21=\"P&A-2\",VLOOKUP(D21,Reference!A$106:I$117,8,FALSE),IF(F21=\"P&A-3\",VLOOKUP(D21,Reference!A$106:I$117,9,FALSE),0)))","v":0},0]
[null,null,null,null,null,null,null,0,0,null,null,null,null,null,{"$f":"IF(F22=\"New well\",VLOOKUP('Drilling-P&A'!D22,Reference!A$106:E$117,5,FALSE),0)","v":0},{"$f":"IF(F22=\"P&A-1\",VLOOKUP(D22,Reference!A$106:I$117,7,FALSE),IF(F22=\"P&A-2\",VLOOKUP(D22,Reference!A$106:I$117,8,FALSE),IF(F22=\"P&A-3\",VLOOKUP(D22,Reference!A$106:I$117,9,FALSE),0)))","v":0},0]
[null,null,null,null,null,null,null,0,{"$f":"ROUND((G23*H23),2)","v":0},null,null,null,null,null,{"$f":"IF(F23=\"New well\",VLOOKUP('Drilling-P&A'!D23,Reference!A$106:E$117,5,FALSE),0)","v":0},{"$f":"IF(F23=\"P&A-1\",VLOOKUP(D23,Reference!A$106:I$117,7,FALSE),IF(F23=\"P&A-2\",VLOOKUP(D23,Reference!A$106:I$117,8,FALSE),IF(F23=\"P&A-3\",VLOOKUP(D23,Reference!A$106:I$117,9,FALSE),0)))","v":0},0]
[null,null,null,null,null,null,null,0,{"$f":"ROUND((G24*H24),2)","v":0},null,null,null,null,null,{"$f":"IF(F24=\"New well\",VLOOKUP('Drilling-P&A'!D24,Reference!A$106:E$117,5,FALSE),0)","v":0},{"$f":"IF(F24=\"P&A-1\",VLOOKUP(D24,Reference!A$106:I$117,7,FALSE),IF(F24=\"P&A-2\",VLOOKUP(D24,Reference!A$106:I$117,8,FALSE),IF(F24=\"P&A-3\",VLOOKUP(D24,Reference!A$106:I$117,9,FALSE),0)))","v":0},0]
[null,null,null,null,null,null,null,0,0,null,null,null,null,null,{"$f":"IF(F25=\"New well\",VLOOKUP('Drilling-P&A'!D25,Reference!A$106:E$117,5,FALSE),0)","v":0},{"$f":"IF(F25=\"P&A-1\",VLOOKUP(D25,Reference!A$106:I$117,7,FALSE),IF(F25=\"P&A-2\",VLOOKUP(D25,Reference!A$106:I$117,8,FALSE),IF(F25=\"P&A-3\",VLOOKUP(D25,Reference!A$106:I$117,9,FALSE),0)))","v":0},0]
[null,null,null,null,null,null,null,0,0,null,null,null,null,null,{"$f":"IF(F26=\"New well\",VLOOKUP('Drilling-P&A'!D26,Reference!A$106:E$117,5,FALSE),0)","v":0},{"$f":"IF(F26=\"P&A-1\",VLOOKUP(D26,Reference!A$106:I$117,7,FALSE),IF(F26=\"P&A-2\",VLOOKUP(D26,Reference!A$106:I$117,8,FALSE),IF(F26=\"P&A-3\",VLOOKUP(D26,Reference!A$106:I$117,9,FALSE),0)))","v":0},0]
[null,null,null,null,null,null,null,0,0,null,null,null,null,null,{"$f":"IF(F27=\"New well\",VLOOKUP('Drilling-P&A'!D27,Reference!A$106:E$117,5,FALSE),0)","v":0},{"$f":"IF(F27=\"P&A-1\",VLOOKUP(D27,Reference!A$106:I$117,7,FALSE),IF(F27=\"P&A-2\",VLOOKUP(D27,Reference!A$106:I$117,8,FALSE),IF(F27=\"P&A-3\",VLOOKUP(D27,Reference!A$106:I$117,9,FALSE),0)))","v":0},0]
[null,null,null,null,null,null,null,0,0,null,null,null,null,null,{"$f":"IF(F28=\"New well\",VLOOKUP('Drilling-P&A'!D28,Reference!A$106:E$117,5,FALSE),0)","v":0},{"$f":"IF(F28=\"P&A-1\",VLOOKUP(D28,Reference!A$106:I$117,7,FALSE),IF(F28=\"P&A-2\",VLOOKUP(D28,Reference!A$106:I$117,8,FALSE),IF(F28=\"P&A-3\",VLOOKUP(D28,Reference!A$106:I$117,9,FALSE),0)))","v":0},0]
[null,null,null,null,null,null,null,0,0,null,null,null,null,null,{"$f":"IF(F29=\"New well\",VLOOKUP('Drilling-P&A'!D29,Reference!A$106:E$117,5,FALSE),0)","v":0},{"$f":"IF(F29=\"P&A-1\",VLOOKUP(D29,Reference!A$106:I$117,7,FALSE),IF(F29=\"P&A-2\",VLOOKUP(D29,Reference!A$106:I$117,8,FALSE),IF(F29=\"P&A-3\",VLOOKUP(D29,Reference!A$106:I$117,9,FALSE),0)))","v":0},0]
[null,null,null,null,null,null,null,0,0,null,null,null,null,null,{"$f":"IF(F30=\"New well\",VLOOKUP('Drilling-P&A'!D30,Reference!A$106:E$117,5,FALSE),0)","v":0},{"$f":"IF(F30=\"P&A-1\",VLOOKUP(D30,Reference!A$106:I$117,7,FALSE),IF(F30=\"P&A-2\",VLOOKUP(D30,Reference!A$106:I$117,8,FALSE),IF(F30=\"P&A-3\",VLOOKUP(D30,Reference!A$106:I$117,9,FALSE),0)))","v":0},0]
[null,null,null,null,null,null,null,0,0,null,null,null,null,null,{"$f":"IF(F31=\"New well\",VLOOKUP('Drilling-P&A'!D31,Reference!A$106:E$117,5,FALSE),0)","v":0},{"$f":"IF(F31=\"P&A-1\",VLOOKUP(D31,Reference!A$106:I$117,7,FALSE),IF(F31=\"P&A-2\",VLOOKUP(D31,Reference!A$106:I$117,8,FALSE),IF(F31=\"P&A-3\",VLOOKUP(D31,Reference!A$106:I$117,9,FALSE),0)))","v":0},0]
[null,null,null,null,null,null,null,0,0,null,null,null,null,null,{"$f":"IF(F32=\"New well\",VLOOKUP('Drilling-P&A'!D32,Reference!A$106:E$117,5,FALSE),0)","v":0},{"$f":"IF(F32=\"P&A-1\",VLOOKUP(D32,Reference!A$106:I$117,7,FALSE),IF(F32=\"P&A-2\",VLOOKUP(D32,Reference!A$106:I$117,8,FALSE),IF(F32=\"P&A-3\",VLOOKUP(D32,Reference!A$106:I$117,9,FALSE),0)))","v":0},0]
[null,null,null,null,null,null,null,0,0,null,null,null,null,null,{"$f":"IF(F33=\"New well\",VLOOKUP('Drilling-P&A'!D33,Reference!A$106:E$117,5,FALSE),0)","v":0},{"$f":"IF(F33=\"P&A-1\",VLOOKUP(D33,Reference!A$106:I$117,7,FALSE),IF(F33=\"P&A-2\",VLOOKUP(D33,Reference!A$106:I$117,8,FALSE),IF(F33=\"P&A-3\",VLOOKUP(D33,Reference!A$106:I$117,9,FALSE),0)))","v":0},0]
["MINIMUM APPLIED RATES"]
["Costing Category","Well/Boring\nIdentification Numbers","Date/s of Event","Type of Activity","RAC Invoice #","# of Events",null,null,"TOTAL"]
[null,null,null,null,null,null,null,null,{"$f":"IF(D36=\"\",0,VLOOKUP(D36,Reference!A$120:B$123,2,FALSE))*F36","v":0},null,null,null,null,null,null,null,{"$f":"IF(D36<>\"\",IF(OR(A36=\"\",B36=\"\",C36=\"\",E36=\"\",F36=\"\"),1,0),0)","v":0}]
[null,null,null,null,null,null,null,null,{"$f":"IF(D37=\"\",0,VLOOKUP(D37,Reference!A$120:B$123,2,FALSE))*F37","v":0},null,null,null,null,null,null,null,{"$f":"IF(D37<>\"\",IF(OR(A37=\"\",B37=\"\",C37=\"\",E37=\"\",F37=\"\"),1,0),0)","v":0}]
[null,null,null,null,null,null,null,null,{"$f":"IF(D38=\"\",0,VLOOKUP(D38,Reference!A$120:B$123,2,FALSE))*F38","v":0},null,null,null,null,null,null,null,{"$f":"IF(D38<>\"\",IF(OR(A38=\"\",B38=\"\",C38=\"\",E38=\"\",F38=\"\"),1,0),0)","v":0}]
[null,null,null,null,null,null,null,null,{"$f":"IF(D39=\"\",0,VLOOKUP(D39,Reference!A$120:B$123,2,FALSE))*F39","v":0},null,null,null,{"$f":"IF(SUM(I18:I33,I36:I39)>0,1,0)","v":0},"Print check",null,null,{"$f":"IF(D39<>\"\",IF(OR(A39=\"\",B39=\"\",C39=\"\",E39=\"\",F39=\"\"),1,0),0)","v":0}]
[]
["PART 5.F"]
["DRILLING/PLUGGING & ABANDONMENT SUPPLEMENTARY SHEET"]
[]
["1.  The per foot rates include all costs associated with drilling or P&A of wells and borings with the exceptions of mileage, mob/demob unit price, analysis, and disposal of cuttings."]
["2.   (Depth of Boring or Well) X (Cost Per Foot) = (Total)"]
["3.   When a boring is converted to a monitoring well, only the monitoring well rate is reimbursable."]
["4.   Drilling logs, well registrations, and P&A forms must be provided."]
["5.   In the “Activity Type” column, enter one of the following P&A methods:"]
["                    P&A-1     =  Overdrilling "]
["                    P&A-2     =  Pulling casing/screen and grouting"]
["                    P&A-3     =  Grouting only"]
["6.   If a minimum rate or per-day rate for chemical injection is being charged, indicate the number of events next to the appropriate activity. All well/activity information "]
["      must be documented, excluding the Cost Per Foot Rate and including the dates of chemical injection events."]
[]
[]
[]
["Costing Category","Well/Boring\nIdentification Numbers\n(As shown in technical\nreports to DEQ) ","Date of Activity","Well Type, Activity, and \nDiameter (inches)","RAC\nInvoice\nNo.","Activity Type\n[New well, or P&A \n(1, 2, or 3);\nsee note 5]","Depth \n(feet)","Cost Per\nFoot\nRate ","TOTAL",null,null,null,null,null,"New Well ($/ft)","P&A ($/ft)","Test"]
[null,null,null,null,null,null,null,{"$f":"IF(D58=\"\",0,IF(F58=\"New well\",O58,IF(LEFT(F58,3)=\"P&A\",P58,0)))","v":0},{"$f":"ROUND((G58*H58),2)","v":0},null,null,null,null,null,{"$f":"IF(F58=\"New well\",VLOOKUP('Drilling-P&A'!D58,Reference!A$106:E$117,5,FALSE),0)","v":0},{"$f":"IF(F58=\"P&A-1\",VLOOKUP(D58,Reference!A$106:I$117,7,FALSE),IF(F58=\"P&A-2\",VLOOKUP(D58,Reference!A$106:I$117,8,FALSE),IF(F58=\"P&A-3\",VLOOKUP(D58,Reference!A$106:I$117,9,FALSE),0)))","v":0},{"$f":"IF(D58<>\"\",IF(OR(A58=\"\",B58=\"\",C58=\"\",E58=\"\",F58=\"\",G58=\"\"),1,0),0)","v":0}]
[null,null,null,null,null,null,null,{"$f":"IF(D59=\"\",0,IF(F59=\"New well\",O59,IF(LEFT(F59,3)=\"P&A\",P59,0)))","v":0},{"$f":"ROUND((G59*H59),2)","v":0},null,null,null,null,null,{"$f":"IF(F59=\"New well\",VLOOKUP('Drilling-P&A'!D59,Reference!A$106:E$117,5,FALSE),0)","v":0},{"$f":"IF(F59=\"P&A-1\",VLOOKUP(D59,Reference!A$106:I$117,7,FALSE),IF(F59=\"P&A-2\",VLOOKUP(D59,Reference!A$106:I$117,8,FALSE),IF(F59=\"P&A-3\",VLOOKUP(D59,Reference!A$106:I$117,9,FALSE),0)))","v":0},{"$f":"IF(D59<>\"\",IF(OR(A59=\"\",B59=\"\",C59=\"\",E59=\"\",F59=\"\",G59=\"\"),1,0),0)","v":0}]
[null,null,null,null,null,null,null,0,0,null,null,null,null,null,{"$f":"IF(F60=\"New well\",VLOOKUP('Drilling-P&A'!D60,Reference!A$106:E$117,5,FALSE),0)","v":0},{"$f":"IF(F60=\"P&A-1\",VLOOKUP(D60,Reference!A$106:I$117,7,FALSE),IF(F60=\"P&A-2\",VLOOKUP(D60,Reference!A$106:I$117,8,FALSE),IF(F60=\"P&A-3\",VLOOKUP(D60,Reference!A$106:I$117,9,FALSE),0)))","v":0},0]
[null,null,null,null,null,null,null,0,0,null,null,null,null,null,{"$f":"IF(F61=\"New well\",VLOOKUP('Drilling-P&A'!D61,Reference!A$106:E$117,5,FALSE),0)","v":0},{"$f":"IF(F61=\"P&A-1\",VLOOKUP(D61,Reference!A$106:I$117,7,FALSE),IF(F61=\"P&A-2\",VLOOKUP(D61,Reference!A$106:I$117,8,FALSE),IF(F61=\"P&A-3\",VLOOKUP(D61,Reference!A$106:I$117,9,FALSE),0)))","v":0},0]
[null,null,null,null,null,null,null,0,0,null,null,null,null,null,{"$f":"IF(F62=\"New well\",VLOOKUP('Drilling-P&A'!D62,Reference!A$106:E$117,5,FALSE),0)","v":0},{"$f":"IF(F62=\"P&A-1\",VLOOKUP(D62,Reference!A$106:I$117,7,FALSE),IF(F62=\"P&A-2\",VLOOKUP(D62,Reference!A$106:I$117,8,FALSE),IF(F62=\"P&A-3\",VLOOKUP(D62,Reference!A$106:I$117,9,FALSE),0)))","v":0},0]
[null,null,null,null,null,null,null,0,0,null,null,null,null,null,{"$f":"IF(F63=\"New well\",VLOOKUP('Drilling-P&A'!D63,Reference!A$106:E$117,5,FALSE),0)","v":0},{"$f":"IF(F63=\"P&A-1\",VLOOKUP(D63,Reference!A$106:I$117,7,FALSE),IF(F63=\"P&A-2\",VLOOKUP(D63,Reference!A$106:I$117,8,FALSE),IF(F63=\"P&A-3\",VLOOKUP(D63,Reference!A$106:I$117,9,FALSE),0)))","v":0},0]
[null,null,null,null,null,null,null,0,0,null,null,null,null,null,{"$f":"IF(F64=\"New well\",VLOOKUP('Drilling-P&A'!D64,Reference!A$106:E$117,5,FALSE),0)","v":0},{"$f":"IF(F64=\"P&A-1\",VLOOKUP(D64,Reference!A$106:I$117,7,FALSE),IF(F64=\"P&A-2\",VLOOKUP(D64,Reference!A$106:I$117,8,FALSE),IF(F64=\"P&A-3\",VLOOKUP(D64,Reference!A$106:I$117,9,FALSE),0)))","v":0},0]
[null,null,null,null,null,null,null,0,0,null,null,null,null,null,{"$f":"IF(F65=\"New well\",VLOOKUP('Drilling-P&A'!D65,Reference!A$106:E$117,5,FALSE),0)","v":0},{"$f":"IF(F65=\"P&A-1\",VLOOKUP(D65,Reference!A$106:I$117,7,FALSE),IF(F65=\"P&A-2\",VLOOKUP(D65,Reference!A$106:I$117,8,FALSE),IF(F65=\"P&A-3\",VLOOKUP(D65,Reference!A$106:I$117,9,FALSE),0)))","v":0},0]
[null,null,null,null,null,null,null,0,0,null,null,null,null,null,{"$f":"IF(F66=\"New well\",VLOOKUP('Drilling-P&A'!D66,Reference!A$106:E$117,5,FALSE),0)","v":0},{"$f":"IF(F66=\"P&A-1\",VLOOKUP(D66,Reference!A$106:I$117,7,FALSE),IF(F66=\"P&A-2\",VLOOKUP(D66,Reference!A$106:I$117,8,FALSE),IF(F66=\"P&A-3\",VLOOKUP(D66,Reference!A$106:I$117,9,FALSE),0)))","v":0},0]
[null,null,null,null,null,null,null,0,0,null,null,null,null,null,{"$f":"IF(F67=\"New well\",VLOOKUP('Drilling-P&A'!D67,Reference!A$106:E$117,5,FALSE),0)","v":0},{"$f":"IF(F67=\"P&A-1\",VLOOKUP(D67,Reference!A$106:I$117,7,FALSE),IF(F67=\"P&A-2\",VLOOKUP(D67,Reference!A$106:I$117,8,FALSE),IF(F67=\"P&A-3\",VLOOKUP(D67,Reference!A$106:I$117,9,FALSE),0)))","v":0},0]
[null,null,null,null,null,null,null,0,0,null,null,null,null,null,{"$f":"IF(F68=\"New well\",VLOOKUP('Drilling-P&A'!D68,Reference!A$106:E$117,5,FALSE),0)","v":0},{"$f":"IF(F68=\"P&A-1\",VLOOKUP(D68,Reference!A$106:I$117,7,FALSE),IF(F68=\"P&A-2\",VLOOKUP(D68,Reference!A$106:I$117,8,FALSE),IF(F68=\"P&A-3\",VLOOKUP(D68,Reference!A$106:I$117,9,FALSE),0)))","v":0},0]
[null,null,null,null,null,null,null,0,0,null,null,null,null,null,{"$f":"IF(F69=\"New well\",VLOOKUP('Drilling-P&A'!D69,Reference!A$106:E$117,5,FALSE),0)","v":0},{"$f":"IF(F69=\"P&A-1\",VLOOKUP(D69,Reference!A$106:I$117,7,FALSE),IF(F69=\"P&A-2\",VLOOKUP(D69,Reference!A$106:I$117,8,FALSE),IF(F69=\"P&A-3\",VLOOKUP(D69,Reference!A$106:I$117,9,FALSE),0)))","v":0},0]
[null,null,null,null,null,null,null,0,0,null,null,null,null,null,{"$f":"IF(F70=\"New well\",VLOOKUP('Drilling-P&A'!D70,Reference!A$106:E$117,5,FALSE),0)","v":0},{"$f":"IF(F70=\"P&A-1\",VLOOKUP(D70,Reference!A$106:I$117,7,FALSE),IF(F70=\"P&A-2\",VLOOKUP(D70,Reference!A$106:I$117,8,FALSE),IF(F70=\"P&A-3\",VLOOKUP(D70,Reference!A$106:I$117,9,FALSE),0)))","v":0},0]
[null,null,null,null,null,null,null,0,0,null,null,null,null,null,{"$f":"IF(F71=\"New well\",VLOOKUP('Drilling-P&A'!D71,Reference!A$106:E$117,5,FALSE),0)","v":0},{"$f":"IF(F71=\"P&A-1\",VLOOKUP(D71,Reference!A$106:I$117,7,FALSE),IF(F71=\"P&A-2\",VLOOKUP(D71,Reference!A$106:I$117,8,FALSE),IF(F71=\"P&A-3\",VLOOKUP(D71,Reference!A$106:I$117,9,FALSE),0)))","v":0},0]
[null,null,null,null,null,null,null,0,0,null,null,null,null,null,{"$f":"IF(F72=\"New well\",VLOOKUP('Drilling-P&A'!D72,Reference!A$106:E$117,5,FALSE),0)","v":0},{"$f":"IF(F72=\"P&A-1\",VLOOKUP(D72,Reference!A$106:I$117,7,FALSE),IF(F72=\"P&A-2\",VLOOKUP(D72,Reference!A$106:I$117,8,FALSE),IF(F72=\"P&A-3\",VLOOKUP(D72,Reference!A$106:I$117,9,FALSE),0)))","v":0},0]
[null,null,null,null,null,null,null,0,0,null,null,null,null,null,{"$f":"IF(F73=\"New well\",VLOOKUP('Drilling-P&A'!D73,Reference!A$106:E$117,5,FALSE),0)","v":0},{"$f":"IF(F73=\"P&A-1\",VLOOKUP(D73,Reference!A$106:I$117,7,FALSE),IF(F73=\"P&A-2\",VLOOKUP(D73,Reference!A$106:I$117,8,FALSE),IF(F73=\"P&A-3\",VLOOKUP(D73,Reference!A$106:I$117,9,FALSE),0)))","v":0},0]
["MINIMUM APPLIED RATES"]
["Costing Category","Well/Boring\nIdentification Numbers","Date/s of Event","Type of Activity","RAC Invoice #","# of Events",null,null,"TOTAL"]
[null,null,null,null,null,null,null,null,{"$f":"IF(D76=\"\",0,VLOOKUP(D76,Reference!A$120:B$123,2,FALSE))*F76","v":0},null,null,null,null,null,null,null,{"$f":"IF(D76<>\"\",IF(OR(A76=\"\",B76=\"\",C76=\"\",E76=\"\",F76=\"\"),1,0),0)","v":0}]
[null,null,null,null,null,null,null,null,{"$f":"IF(D77=\"\",0,VLOOKUP(D77,Reference!A$120:B$123,2,FALSE))*F77","v":0},null,null,null,null,null,null,null,{"$f":"IF(D77<>\"\",IF(OR(A77=\"\",B77=\"\",C77=\"\",E77=\"\",F77=\"\"),1,0),0)","v":0}]
[null,null,null,null,null,null,null,null,{"$f":"IF(D78=\"\",0,VLOOKUP(D78,Reference!A$120:B$123,2,FALSE))*F78","v":0},null,null,null,null,null,null,null,0]
[null,null,null,null,null,null,null,null,{"$f":"IF(D79=\"\",0,VLOOKUP(D79,Reference!A$120:B$123,2,FALSE))*F79","v":0},null,null,null,{"$f":"IF(SUM(I58:I73,I76:I79)>0,1,0)","v":0},"Print check",null,null,0]

{"sheet":"Analysis","index":14,"n_rows":102,"n_cols":21,"rows_kept":102,"cut":false,"hidden":false,"merged":[[65,1,65,2],[43,1,43,10],[65,5,65,7],[31,1,31,2],[64,8,64,10],[63,0,63,10],[64,5,64,7],[58,7,58,8],[59,7,59,8],[61,7,61,8],[62,7,62,8],[64,1,64,2],[31,5,31,7],[57,0,57,6],[57,7,57,8],[99,13,100,13],[29,13,30,13],[63,13,64,13],[9,1,9,10],[30,1,30,2],[30,5,30,7],[30,8,30,10],[23,0,23,6],[23,7,23,8],[29,0,29,10],[24,7,24,8],[25,7,25,8],[26,7,26,8],[27,7,27,8],[28,7,28,8],[60,7,60,8],[101,1,101,2],[79,1,79,10],[100,1,100,2],[100,8,100,10],[93,0,93,6],[93,7,93,8],[101,5,101,7],[100,5,100,7],[94,7,94,8],[95,7,95,8],[96,7,96,8],[97,7,97,8],[98,7,98,8],[99,0,99,10]]}
["PART 5.G",null,null,null,null,null,null,null,null,null,null,{"$f":"+L32+L66+L102","v":0},"Total Print check"]
["ANALYSIS SUPPLEMENTARY SHEET",null,null,null,{"$f":"IF(SUM(N12:N102)>0,\"MISSING INFORMATION\",\"\")","v":""},null,"Costing Category Summary"]
[null,null,null,null,null,null,"Emergency/Initial Work",null,null,null,{"$f":"SUMIF(A$12:A$32,G3,K$12:K$32)+SUMIF(A$46:A$66,G3,K$46:K$66)+SUMIF(A$82:A$102,G3,K$82:K$102)","v":0}]
[null,null,null,null,null,null,"Investigation Work",null,null,null,{"$f":"SUMIF(A$12:A$32,G4,K$12:K$32)+SUMIF(A$46:A$66,G4,K$46:K$66)+SUMIF(A$82:A$102,G4,K$82:K$102)","v":0}]
["1.   Refer to Appendix B, Table 4 of the Guidance Document for analysis rates.",null,null,null,null,null,"Interim Monitoring Work",null,null,null,{"$f":"SUMIF(A$12:A$32,G5,K$12:K$32)+SUMIF(A$46:A$66,G5,K$46:K$66)+SUMIF(A$82:A$102,G5,K$82:K$102)","v":0}]
["2.   Purchase of sampling equipment (EnCores, preserved vials, etc.) should be addressed on the Part 5.H (1).",null,null,null,null,null,"Corrective Action Plan Work",null,null,null,{"$f":"SUMIF(A$12:A$32,G6,K$12:K$32)+SUMIF(A$46:A$66,G6,K$46:K$66)+SUMIF(A$82:A$102,G6,K$82:K$102)","v":0}]
["3.   (No. of Test) X (Cost Per Test) = (Total)"]
["4.   Rush charges applied by the laboratory can be added on the same row as the parameter or selected from the parameter dropdown on a separate row. These charges will not be reimbursed without approval. "]
["5.   Markup can be added on the same row as the parameter or selected from the parameter dropdown on a separate row.  If the owner is directly billed for analysis, no markup is allowed."]
[]
["Costing Category","RAC\nInvoice\nNo.","Outside\nInvoice\nNo.","Parameter\n(Ex.:  BTEX, TPH-G, etc.)","Method Used","Medium Analyzed","No. of Tests","Unit Rate - \n($) Per\nTest","Non-Unit Rate-\n($) Per test,\n","Markup or Rush Charges\n($)","TOTAL \n($)",null,null,"Test",null,"Analysis cost + other cost","RAC Mark up","Lab Rush cost",null,"Subtest 1","Subtest 2"]
[null,null,null,null,{"$f":"IF(D12=\"\",\"\",VLOOKUP(D12,Reference!A$127:C$169,3,FALSE))","v":""},null,null,{"$f":"IF(D12=\"\",0,VLOOKUP(D12,Reference!A$127:C$169,2,FALSE))","v":0},0,null,{"$f":"ROUND(IF(D12<>\"\",(+P12),0),2)","v":0},null,null,{"$f":"IF(OR(D12=\"RAC Analysis Markup\",D12=\"Lab Rush Charges\"),U12,T12)","v":0},null,{"$f":"ROUND(IF(OR(D12=\"RAC Analysis Markup\",D12=\"Lab Rush Charges\"),0,IF(D12<>\"\",IF(I12>0,(I12*G12)+J12,(G12*H12)+J12),0)),2)+Q12+R12","v":0},{"$f":"IF(D12=\"RAC Analysis Markup\",J12,0)","v":0},{"$f":"IF(D12=\"Lab Rush Charges\",J12,0)","v":0},null,{"$f":"IF(D12<>\"\",IF(OR(A12=\"\",B12=\"\",C12=\"\",G12=\"\",F12=\"\"),1,0),0)","v":0},{"$f":"IF(D12<>\"\",IF(OR(A12=\"\",B12=\"\",C12=\"\",J12=0),1,0),0)","v":0}]
[null,null,null,null,{"$f":"IF(D13=\"\",\"\",VLOOKUP(D13,Reference!A$127:C$169,3,FALSE))","v":""},null,null,{"$f":"IF(D13=\"\",0,VLOOKUP(D13,Reference!A$127:C$169,2,FALSE))","v":0},0,0,0,null,null,0,null,{"$f":"ROUND(IF(OR(D13=\"RAC Analysis Markup\",D13=\"Lab Rush Charges\"),0,IF(D13<>\"\",IF(I13>0,(I13*G13)+J13,(G13*H13)+J13),0)),2)+Q13+R13","v":0},{"$f":"IF(D13=\"RAC Analysis Markup\",J13,0)","v":0},{"$f":"IF(D13=\"Lab Rush Charges\",J13,0)","v":0},null,0,{"$f":"IF(D13<>\"\",IF(OR(A13=\"\",B13=\"\",C13=\"\",J13=0),1,0),0)","v":0}]
[null,null,null,null,{"$f":"IF(D14=\"\",\"\",VLOOKUP(D14,Reference!A$127:C$169,3,FALSE))","v":""},null,null,{"$f":"IF(D14=\"\",0,VLOOKUP(D14,Reference!A$127:C$169,2,FALSE))","v":0},0,0,0,null,null,0,null,0,0,0,null,0,0]
[null,null,null,null,{"$f":"IF(D15=\"\",\"\",VLOOKUP(D15,Reference!A$127:C$169,3,FALSE))","v":""},null,null,{"$f":"IF(D15=\"\",0,VLOOKUP(D15,Reference!A$127:C$169,2,FALSE))","v":0},0,0,0,null,null,0,null,0,0,0,null,0,0]
[null,null,null,null,{"$f":"IF(D16=\"\",\"\",VLOOKUP(D16,Reference!A$127:C$169,3,FALSE))","v":""},null,null,{"$f":"IF(D16=\"\",0,VLOOKUP(D16,Reference!A$127:C$169,2,FALSE))","v":0},0,0,0,null,null,0,null,0,0,0,null,0,0]
[null,null,null,null,{"$f":"IF(D17=\"\",\"\",VLOOKUP(D17,Reference!A$127:C$169,3,FALSE))","v":""},null,null,{"$f":"IF(D17=\"\",0,VLOOKUP(D17,Reference!A$127:C$169,2,FALSE))","v":0},0,0,0,null,null,0,null,0,0,0,null,0,0]
[null,null,null,null,{"$f":"IF(D18=\"\",\"\",VLOOKUP(D18,Reference!A$127:C$169,3,FALSE))","v":""},null,null,{"$f":"IF(D18=\"\",0,VLOOKUP(D18,Reference!A$127:C$169,2,FALSE))","v":0},0,0,0,null,null,0,null,0,0,0,null,0,0]
[null,null,null,null,{"$f":"IF(D19=\"\",\"\",VLOOKUP(D19,Reference!A$127:C$169,3,FALSE))","v":""},null,null,{"$f":"IF(D19=\"\",0,VLOOKUP(D19,Reference!A$127:C$169,2,FALSE))","v":0},0,0,0,null,null,0,null,0,0,0,null,0,0]
[null,null,null,null,{"$f":"IF(D20=\"\",\"\",VLOOKUP(D20,Reference!A$127:C$169,3,FALSE))","v":""},null,null,{"$f":"IF(D20=\"\",0,VLOOKUP(D20,Reference!A$127:C$169,2,FALSE))","v":0},0,0,0,null,null,0,null,0,0,0,null,0,0]
[null,null,null,null,{"$f":"IF(D21=\"\",\"\",VLOOKUP(D21,Reference!A$127:C$169,3,FALSE))","v":""},null,null,{"$f":"IF(D21=\"\",0,VLOOKUP(D21,Reference!A$127:C$169,2,FALSE))","v":0},0,0,0,null,null,0,null,0,0,0,null,0,0]
[null,null,null,null,{"$f":"IF(D22=\"\",\"\",VLOOKUP(D22,Reference!A$127:C$169,3,FALSE))","v":""},null,null,{"$f":"IF(D22=\"\",0,VLOOKUP(D22,Reference!A$127:C$169,2,FALSE))","v":0},0,0,0,null,null,0,null,0,0,0,null,0,0]
[null,null,null,null,{"$f":"IF(D23=\"\",\"\",VLOOKUP(D23,Reference!A$127:C$169,3,FALSE))","v":""},null,null,{"$f":"IF(D23=\"\",0,VLOOKUP(D23,Reference!A$127:C$169,2,FALSE))","v":0},0,0,0,null,null,0,null,0,0,0,null,0,0]
["USE SPACE BELOW FOR PARAMETERS/METHODS/RATES NOT LISTED/POPULATED ABOVE",null,null,null,null,null,null,"Costs per Test ($)",null,null,"TOTAL ($)"]
[null,null,null,null,null,null,null,null,null,null,{"$f":"ROUND(IF(H25>0,(+P25),0),2)","v":0},null,null,{"$f":"IF(G25>0,IF(OR(A25=\"\",B25=\"\",C25=\"\",E25=\"\",D25=\"\",F25=\"\",H25=\"\"),1,0),0)","v":0},null,{"$f":"ROUND(IF(D25<>\"\",(G25*H25)+J25,0),2)","v":0}]
[null,null,null,null,null,null,null,0,null,0,{"$f":"ROUND(IF(H26>0,(+P26),0),2)","v":0},null,null,{"$f":"IF(G26>0,IF(OR(A26=\"\",B26=\"\",C26=\"\",E26=\"\",D26=\"\",F26=\"\",H26=\"\"),1,0),0)","v":0},null,{"$f":"ROUND(IF(D26<>\"\",(G26*H26)+J26,0),2)","v":0}]
[null,null,null,null,null,null,null,0,null,0,{"$f":"ROUND(IF(H27>0,(+P27),0),2)","v":0},null,null,{"$f":"IF(G27>0,IF(OR(A27=\"\",B27=\"\",C27=\"\",E27=\"\",D27=\"\",F27=\"\",H27=\"\"),1,0),0)","v":0},null,0]
[null,null,null,null,null,null,null,0,null,0,{"$f":"ROUND(IF(H28>0,(+P28),0),2)","v":0},null,null,{"$f":"IF(G28>0,IF(OR(A28=\"\",B28=\"\",C28=\"\",E28=\"\",D28=\"\",F28=\"\",H28=\"\"),1,0),0)","v":0},null,0]
[null,null,null,null,null,null,null,0,null,0,{"$f":"ROUND(IF(H29>0,(+P29),0),2)","v":0},null,null,{"$f":"IF(G29>0,IF(OR(A29=\"\",B29=\"\",C29=\"\",E29=\"\",D29=\"\",F29=\"\",H29=\"\"),1,0),0)","v":0},null,0]
["AQUIFER TESTING EVENTS"]
["Costing Category","RAC Invoice No.",null,"Date of Event","Rate","No. of Wells",null,null,"SUBTOTAL"]
[null,null,null,null,"$1,250.00 - 1st well; $350.00 - each add. well",0,null,null,null,null,{"$f":"ROUND(IF(AND(F32>0,F32=1),Reference!B$172,IF(AND(D32>0,F32>1),Reference!B$172+(F32-1)*Reference!B$173,0)),2)","v":0},{"$f":"IF(SUM(K25:K29,K12:K23,K32)>0,1,0)","v":0},"Print check",{"$f":"IF(F32>0,IF(OR(A32=\"\",B32=\"\",D32=\"\"),1,0),0)","v":0}]
[]
["PART 5.G"]
["ANALYSIS SUPPLEMENTARY SHEET"]
[]
[]
[]
["1.   Refer to Appendix B, Table 4 of the Guidance Document for analysis rates."]
["2.   Purchase of sampling equipment (EnCores, preserved vials, etc.) should be addressed on the Part 5.H (1)."]
["3.   (No. of Test) X (Cost Per Test) = (Total)"]
["4.   Rush charges applied by the laboratory can be added on the same row as the parameter or selected from the parameter dropdown on a separate row. These charges will not be reimbursed without approval. "]
["5.   Markup can be added on the same row as the parameter or selected from the parameter dropdown on a separate row.  If the owner is directly billed for analysis, no markup is allowed."]
[]
["Costing Category","RAC\nInvoice\nNo.","Outside\nInvoice\nNo.","Parameter\n(Ex.:  BTEX, TPH-G, etc.)","Method Used","Medium Analyzed","No. of Tests","Unit Rate - \n($) Per\nTest","Non-Unit Rate-\n($) Per test,\n","Markup or Rush Charges\n($)","TOTAL \n($)",null,null,"Test",null,"Analysis cost","RAC Mark up","Lab Rush cost",null,"Subtest 1","Subtest 2"]
[null,null,null,null,{"$f":"IF(D46=\"\",\"\",VLOOKUP(D46,Reference!A$127:C$169,3,FALSE))","v":""},null,null,{"$f":"IF(D46=\"\",0,VLOOKUP(D46,Reference!A$127:C$169,2,FALSE))","v":0},0,0,{"$f":"ROUND(IF(D46>0,(+P46),0),2)","v":0},null,null,{"$f":"IF(OR(D46=\"RAC Analysis Markup\",D46=\"Lab Rush Charges\"),U46,T46)","v":0},null,{"$f":"ROUND(IF(OR(D46=\"RAC Analysis Markup\",D46=\"Lab Rush Charges\"),0,IF(D46<>\"\",IF(I46>0,(I46*G46)+J46,(G46*H46)+J46),0)),2)+Q46+R46","v":0},{"$f":"IF(D46=\"RAC Analysis Markup\",J46,0)","v":0},{"$f":"IF(D46=\"Lab Rush Charges\",J46,0)","v":0},null,{"$f":"IF(D46<>\"\",IF(OR(A46=\"\",B46=\"\",C46=\"\",G46=\"\",F46=\"\"),1,0),0)","v":0},{"$f":"IF(D46<>\"\",IF(OR(A46=\"\",B46=\"\",C46=\"\",I46=0),1,0),0)","v":0}]
[null,null,null,null,{"$f":"IF(D47=\"\",\"\",VLOOKUP(D47,Reference!A$127:C$169,3,FALSE))","v":""},null,null,{"$f":"IF(D47=\"\",0,VLOOKUP(D47,Reference!A$127:C$169,2,FALSE))","v":0},0,0,0,null,null,0,null,{"$f":"ROUND(IF(OR(D47=\"RAC Analysis Markup\",D47=\"Lab Rush Charges\"),0,IF(D47<>\"\",IF(I47>0,(I47*G47)+J47,(G47*H47)+J47),0)),2)+Q47+R47","v":0},{"$f":"IF(D47=\"RAC Analysis Markup\",J47,0)","v":0},{"$f":"IF(D47=\"Lab Rush Charges\",J47,0)","v":0},null,0,0]
[null,null,null,null,{"$f":"IF(D48=\"\",\"\",VLOOKUP(D48,Reference!A$127:C$169,3,FALSE))","v":""},null,null,{"$f":"IF(D48=\"\",0,VLOOKUP(D48,Reference!A$127:C$169,2,FALSE))","v":0},0,0,0,null,null,0,null,0,0,0,null,0,0]
[null,null,null,null,{"$f":"IF(D49=\"\",\"\",VLOOKUP(D49,Reference!A$127:C$169,3,FALSE))","v":""},null,null,{"$f":"IF(D49=\"\",0,VLOOKUP(D49,Reference!A$127:C$169,2,FALSE))","v":0},0,0,0,null,null,0,null,0,0,0,null,0,0]
[null,null,null,null,{"$f":"IF(D50=\"\",\"\",VLOOKUP(D50,Reference!A$127:C$169,3,FALSE))","v":""},null,null,{"$f":"IF(D50=\"\",0,VLOOKUP(D50,Reference!A$127:C$169,2,FALSE))","v":0},0,0,0,null,null,0,null,0,0,0,null,0,0]
[null,null,null,null,{"$f":"IF(D51=\"\",\"\",VLOOKUP(D51,Reference!A$127:C$169,3,FALSE))","v":""},null,null,{"$f":"IF(D51=\"\",0,VLOOKUP(D51,Reference!A$127:C$169,2,FALSE))","v":0},0,0,0,null,null,0,null,0,0,0,null,0,0]
[null,null,null,null,{"$f":"IF(D52=\"\",\"\",VLOOKUP(D52,Reference!A$127:C$169,3,FALSE))","v":""},null,null,{"$f":"IF(D52=\"\",0,VLOOKUP(D52,Reference!A$127:C$169,2,FALSE))","v":0},0,0,0,null,null,0,null,0,0,0,null,0,0]
[null,null,null,null,{"$f":"IF(D53=\"\",\"\",VLOOKUP(D53,Reference!A$127:C$169,3,FALSE))","v":""},null,null,{"$f":"IF(D53=\"\",0,VLOOKUP(D53,Reference!A$127:C$169,2,FALSE))","v":0},0,0,0,null,null,0,null,0,0,0,null,0,0]
[null,null,null,null,{"$f":"IF(D54=\"\",\"\",VLOOKUP(D54,Reference!A$127:C$169,3,FALSE))","v":""},null,null,{"$f":"IF(D54=\"\",0,VLOOKUP(D54,Reference!A$127:C$169,2,FALSE))","v":0},0,0,0,null,null,0,null,0,0,0,null,0,0]
[null,null,null,null,{"$f":"IF(D55=\"\",\"\",VLOOKUP(D55,Reference!A$127:C$169,3,FALSE))","v":""},null,null,{"$f":"IF(D55=\"\",0,VLOOKUP(D55,Reference!A$127:C$169,2,FALSE))","v":0},0,0,0,null,null,0,null,0,0,0,null,0,0]
[null,null,null,null,{"$f":"IF(D56=\"\",\"\",VLOOKUP(D56,Reference!A$127:C$169,3,FALSE))","v":""},null,null,{"$f":"IF(D56=\"\",0,VLOOKUP(D56,Reference!A$127:C$169,2,FALSE))","v":0},0,0,0,null,null,0,null,0,0,0,null,0,0]
[null,null,null,null,{"$f":"IF(D57=\"\",\"\",VLOOKUP(D57,Reference!A$127:C$169,3,FALSE))","v":""},null,null,{"$f":"IF(D57=\"\",0,VLOOKUP(D57,Reference!A$127:C$169,2,FALSE))","v":0},0,0,0,null,null,0,null,0,0,0,null,0,0]
["USE SPACE BELOW FOR PARAMETERS/METHODS/RATES NOT LISTED/POPULATED ABOVE",null,null,null,null,null,null,"Costs per Test ($)",null,null,"TOTAL ($)"]
["Investigation Work",null,null,null,null,null,null,0,null,0,{"$f":"ROUND(IF(H59>0,(+P59),0),2)","v":0},null,null,{"$f":"IF(G59>0,IF(OR(A59=\"\",B59=\"\",C59=\"\",E59=\"\",D59=\"\",F59=\"\",H59=\"\"),1,0),0)","v":0},null,{"$f":"ROUND(IF(D59<>\"\",(G59*H59)+J59,0),2)","v":0}]
[null,null,null,null,null,null,null,0,null,0,{"$f":"ROUND(IF(H60>0,(+P60),0),2)","v":0},null,null,{"$f":"IF(G60>0,IF(OR(A60=\"\",B60=\"\",C60=\"\",E60=\"\",D60=\"\",F60=\"\",H60=\"\"),1,0),0)","v":0},null,{"$f":"ROUND(IF(D60<>\"\",(G60*H60)+J60,0),2)","v":0}]
[null,null,null,null,null,null,null,0,null,0,{"$f":"ROUND(IF(H61>0,(+P61),0),2)","v":0},null,null,{"$f":"IF(G61>0,IF(OR(A61=\"\",B61=\"\",C61=\"\",E61=\"\",D61=\"\",F61=\"\",H61=\"\"),1,0),0)","v":0},null,0]
[null,null,null,null,null,null,null,0,null,0,{"$f":"ROUND(IF(H62>0,(+P62),0),2)","v":0},null,null,{"$f":"IF(G62>0,IF(OR(A62=\"\",B62=\"\",C62=\"\",E62=\"\",D62=\"\",F62=\"\",H62=\"\"),1,0),0)","v":0},null,0]
[null,null,null,null,null,null,null,0,null,0,{"$f":"ROUND(IF(H63>0,(+P63),0),2)","v":0},null,null,{"$f":"IF(G63>0,IF(OR(A63=\"\",B63=\"\",C63=\"\",E63=\"\",D63=\"\",F63=\"\",H63=\"\"),1,0),0)","v":0},null,0]
["AQUIFER TESTING EVENTS"]
["Costing Category","RAC Invoice No.",null,"Date of Event","Rate","No. of Wells",null,null,"SUBTOTAL"]
[null,null,null,null,"$1,250.00 - 1st well; $350.00 - each add. well",null,null,null,null,null,{"$f":"ROUND(IF(AND(D66>0,F66=1),Reference!B$172,IF(AND(D66>0,F66>1),Reference!B$172+(F66-1)*Reference!B$173,0)),2)","v":0},{"$f":"IF(SUM(K59:K63,K46:K57,K66)>0,1,0)","v":0},"Print check",{"$f":"IF(F66>0,IF(OR(A66=\"\",B66=\"\",D66=\"\"),1,0),0)","v":0}]
[]
[]
[]
["PART 5.G"]
["ANALYSIS SUPPLEMENTARY SHEET"]
[]
[]
[]
["1.   Refer to Appendix B, Table 4 of the Guidance Document for analysis rates."]
["2.   Purchase of sampling equipment (EnCores, preserved vials, etc.) should be addressed on the Part 5.H (1)."]
["3.   (No. of Test) X (Cost Per Test) = (Total)"]
["4.   Rush charges applied by the laboratory can be added on the same row as the parameter or selected from the parameter dropdown on a separate row. These charges will not be reimbursed without approval. "]
["5.   Markup can be added on the same row as the parameter or selected from the parameter dropdown on a separate row.  If the owner is directly billed for analysis, no markup is allowed."]
[]
["Costing Category","RAC\nInvoice\nNo.","Outside\nInvoice\nNo.","Parameter\n(Ex.:  BTEX, TPH-G, etc.)","Method Used","Medium Analyzed","No. of Tests","Unit Rate - \n($) per\nTest","Non-Unit Rate-\n($) per test,\n","Markup or Rush Charges\n($)","TOTAL \n($)",null,null,"Test",null,"Analysis cost","RAC Mark up","Lab Rush cost",null,"Subtest 1","Subtest 2"]
[null,null,null,null,{"$f":"IF(D82=\"\",\"\",VLOOKUP(D82,Reference!A$127:C$169,3,FALSE))","v":""},null,null,{"$f":"IF(D82=\"\",0,VLOOKUP(D82,Reference!A$127:C$169,2,FALSE))","v":0},0,0,{"$f":"ROUND(IF(D82>0,(+P82),0),2)","v":0},null,null,{"$f":"IF(OR(D82=\"RAC Analysis Markup\",D82=\"Lab Rush Charges\"),U82,T82)","v":0},null,{"$f":"ROUND(IF(OR(D82=\"RAC Analysis Markup\",D82=\"Lab Rush Charges\"),0,IF(D82<>\"\",IF(I82>0,(I82*G82)+J82,(G82*H82)+J82),0)),2)+Q82+R82","v":0},{"$f":"IF(D82=\"RAC Analysis Markup\",J82,0)","v":0},{"$f":"IF(D82=\"Lab Rush Charges\",J82,0)","v":0},null,{"$f":"IF(D82<>\"\",IF(OR(A82=\"\",B82=\"\",C82=\"\",G82=\"\",F82=\"\"),1,0),0)","v":0},{"$f":"IF(D82<>\"\",IF(OR(A82=\"\",B82=\"\",C82=\"\",I82=0),1,0),0)","v":0}]
[null,null,null,null,{"$f":"IF(D83=\"\",\"\",VLOOKUP(D83,Reference!A$127:C$169,3,FALSE))","v":""},null,null,{"$f":"IF(D83=\"\",0,VLOOKUP(D83,Reference!A$127:C$169,2,FALSE))","v":0},0,0,0,null,null,0,null,{"$f":"ROUND(IF(OR(D83=\"RAC Analysis Markup\",D83=\"Lab Rush Charges\"),0,IF(D83<>\"\",IF(I83>0,(I83*G83)+J83,(G83*H83)+J83),0)),2)+Q83+R83","v":0},{"$f":"IF(D83=\"RAC Analysis Markup\",J83,0)","v":0},{"$f":"IF(D83=\"Lab Rush Charges\",J83,0)","v":0},null,0,0]
[null,null,null,null,{"$f":"IF(D84=\"\",\"\",VLOOKUP(D84,Reference!A$127:C$169,3,FALSE))","v":""},null,null,{"$f":"IF(D84=\"\",0,VLOOKUP(D84,Reference!A$127:C$169,2,FALSE))","v":0},0,0,0,null,null,0,null,0,0,0,null,0,0]
[null,null,null,null,{"$f":"IF(D85=\"\",\"\",VLOOKUP(D85,Reference!A$127:C$169,3,FALSE))","v":""},null,null,{"$f":"IF(D85=\"\",0,VLOOKUP(D85,Reference!A$127:C$169,2,FALSE))","v":0},0,0,0,null,null,0,null,0,0,0,null,0,0]
[null,null,null,null,{"$f":"IF(D86=\"\",\"\",VLOOKUP(D86,Reference!A$127:C$169,3,FALSE))","v":""},null,null,{"$f":"IF(D86=\"\",0,VLOOKUP(D86,Reference!A$127:C$169,2,FALSE))","v":0},0,0,0,null,null,0,null,0,0,0,null,0,0]
[null,null,null,null,{"$f":"IF(D87=\"\",\"\",VLOOKUP(D87,Reference!A$127:C$169,3,FALSE))","v":""},null,null,{"$f":"IF(D87=\"\",0,VLOOKUP(D87,Reference!A$127:C$169,2,FALSE))","v":0},0,0,0,null,null,0,null,0,0,0,null,0,0]
[null,null,null,null,{"$f":"IF(D88=\"\",\"\",VLOOKUP(D88,Reference!A$127:C$169,3,FALSE))","v":""},null,null,{"$f":"IF(D88=\"\",0,VLOOKUP(D88,Reference!A$127:C$169,2,FALSE))","v":0},0,0,0,null,null,0,null,0,0,0,null,0,0]
[null,null,null,null,{"$f":"IF(D89=\"\",\"\",VLOOKUP(D89,Reference!A$127:C$169,3,FALSE))","v":""},null,null,{"$f":"IF(D89=\"\",0,VLOOKUP(D89,Reference!A$127:C$169,2,FALSE))","v":0},0,0,0,null,null,0,null,0,0,0,null,0,0]
[null,null,null,null,{"$f":"IF(D90=\"\",\"\",VLOOKUP(D90,Reference!A$127:C$169,3,FALSE))","v":""},null,null,{"$f":"IF(D90=\"\",0,VLOOKUP(D90,Reference!A$127:C$169,2,FALSE))","v":0},0,0,0,null,null,0,null,0,0,0,null,0,0]
[null,null,null,null,{"$f":"IF(D91=\"\",\"\",VLOOKUP(D91,Reference!A$127:C$169,3,FALSE))","v":""},null,null,{"$f":"IF(D91=\"\",0,VLOOKUP(D91,Reference!A$127:C$169,2,FALSE))","v":0},0,0,0,null,null,0,null,0,0,0,null,0,0]
[null,null,null,null,{"$f":"IF(D92=\"\",\"\",VLOOKUP(D92,Reference!A$127:C$169,3,FALSE))","v":""},null,null,{"$f":"IF(D92=\"\",0,VLOOKUP(D92,Reference!A$127:C$169,2,FALSE))","v":0},0,0,0,null,null,0,null,0,0,0,null,0,0]
[null,null,null,null,{"$f":"IF(D93=\"\",\"\",VLOOKUP(D93,Reference!A$127:C$169,3,FALSE))","v":""},null,null,{"$f":"IF(D93=\"\",0,VLOOKUP(D93,Reference!A$127:C$169,2,FALSE))","v":0},0,0,0,null,null,0,null,0,0,0,null,0,0]
["USE SPACE BELOW FOR PARAMETERS/METHODS/RATES NOT LISTED/POPULATED ABOVE",null,null,null,null,null,null,"Costs per Test ($)",null,null,"TOTAL ($)"]
[null,null,null,null,null,null,null,0,null,0,{"$f":"ROUND(IF(H95>0,(+P95),0),2)","v":0},null,null,{"$f":"IF(G95>0,IF(OR(A95=\"\",B95=\"\",C95=\"\",E95=\"\",D95=\"\",F95=\"\",H95=\"\"),1,0),0)","v":0},null,{"$f":"ROUND(IF(D95<>\"\",(G95*H95)+J95,0),2)","v":0}]
[null,null,null,null,null,null,null,0,null,0,{"$f":"ROUND(IF(H96>0,(+P96),0),2)","v":0},null,null,{"$f":"IF(G96>0,IF(OR(A96=\"\",B96=\"\",C96=\"\",E96=\"\",D96=\"\",F96=\"\",H96=\"\"),1,0),0)","v":0},null,{"$f":"ROUND(IF(D96<>\"\",(G96*H96)+J96,0),2)","v":0}]
[null,null,null,null,null,null,null,0,null,0,{"$f":"ROUND(IF(H97>0,(+P97),0),2)","v":0},null,null,0,null,0]
[null,null,null,null,null,null,null,0,null,0,{"$f":"ROUND(IF(H98>0,(+P98),0),2)","v":0},null,null,0,null,0]
[null,null,null,null,null,null,null,0,null,0,{"$f":"ROUND(IF(H99>0,(+P99),0),2)","v":0},null,null,0,null,0]
["AQUIFER TESTING EVENTS"]
["Costing Category","RAC Invoice No.",null,"Date of Event","Rate","No. of Wells",null,null,"SUBTOTAL"]
[null,null,null,null,"$1,250.00 - 1st well; $350.00 - each add. well",null,null,null,null,null,{"$f":"ROUND(IF(AND(F102>0,F102=1),Reference!B$172,IF(AND(D102>0,F102>1),Reference!B$172+(F102-1)*Reference!B$173,0)),2)","v":0},{"$f":"IF(SUM(K95:K99,K82:K93,K102)>0,1,0)","v":0},"Print check",{"$f":"IF(F102>0,IF(OR(A102=\"\",B102=\"\",D102=\"\"),1,0),0)","v":0}]

{"sheet":"Miscellaneous 1","index":15,"n_rows":107,"n_cols":14,"rows_kept":107,"cut":false,"hidden":false,"merged":[[7,4,7,6],[2,4,2,7],[3,4,3,6],[4,4,4,6],[5,4,5,6],[6,4,6,6]]}
["PART 5.H (1)",null,null,null,null,null,null,null,null,null,null,{"$f":"+L35+L71+L107","v":0},"Total Print check"]
["MISCELLANEOUS SUPPLEMENTARY SHEET"]
[null,{"$f":"IF(SUM(N11:N107)>0,\"MISSING INFORMATION\",\"\")","v":""},null,null,"Costing Category Summary"]
[null,null,null,null,"Emergency/Initial Work",null,null,{"$f":"SUMIF($A$11:$A$35,$E4,H$11:H$35)+SUMIF($A$46:$A$71,$E4,H$46:H$71)+SUMIF($A$82:$A$107,$E4,H$82:H$107)","v":0}]
["1. All costs not associated with the previous categories must be listed here.",null,null,null,"Investigation Work",null,null,{"$f":"SUMIF(A$11:A$35,E5,H$11:H$35)+SUMIF(A$46:A$71,E5,H$46:H$71)+SUMIF(A$82:A$107,E5,H$82:H$107)","v":0}]
["2. Miscellaneous charges for work activities included in unit pricing should not be ",null,null,null,"Interim Monitoring Work",null,null,{"$f":"SUMIF(A$11:A$35,E6,H$11:H$35)+SUMIF(A$46:A$71,E6,H$46:H$71)+SUMIF(A$82:A$107,E6,H$82:H$107)","v":0}]
["    addressed on this form.",null,null,null,"Corrective Action Plan Work",null,null,{"$f":"SUMIF(A$11:A$35,E7,H$11:H$35)+SUMIF(A$46:A$71,E7,H$46:H$71)+SUMIF(A$82:A$107,E7,H$82:H$107)","v":0}]
["3. All RAC markups not denoted on other pages must be listed on this form.",null,null,null,"Report Preparation Work",null,null,{"$f":"SUMIF(A$11:A$35,E8,H$11:H$35)+SUMIF(A$46:A$71,E8,H$46:H$71)+SUMIF(A$82:A$107,E8,H$82:H$107)","v":0}]
[]
["Costing Category","Description of Each Miscellaneous Item \nand Quantity of Item","RAC\nInvoice\nNo.","Outside\nInvoice\nNo.","Item's Cost\n ($)","10% Markup Applies \n(Yes/No)","Markup Subtotal\n($)","Item's \nTotal Cost",null,null,null,null,null,"Test"]
[null,null,null,null,null,null,{"$f":"IF(F11=\"Yes\",E11*0.1,0)","v":0},{"$f":"ROUND(IF(E11<>\"\",E11+G11,0),2)","v":0},null,null,null,null,null,{"$f":"IF(H11<>0,IF(OR(E11=\"\",C11=\"\",B11=\"\",A11=\"\"),1,0),0)","v":0}]
[null,null,null,null,null,null,{"$f":"IF(F12=\"Yes\",E12*0.1,0)","v":0},{"$f":"ROUND(IF(E12<>\"\",E12+G12,0),2)","v":0},null,null,null,null,null,{"$f":"IF(H12<>0,IF(OR(E12=\"\",C12=\"\",B12=\"\",A12=\"\"),1,0),0)","v":0}]
[null,null,null,null,null,null,0,0,null,null,null,null,null,0]
[null,null,null,null,null,null,0,0,null,null,null,null,null,0]
[null,null,null,null,null,null,0,0,null,null,null,null,null,0]
[null,null,null,null,null,null,0,0,null,null,null,null,null,0]
[null,null,null,null,null,null,0,0,null,null,null,null,null,0]
[null,null,null,null,null,null,0,0,null,null,null,null,null,0]
[null,null,null,null,null,null,0,0,null,null,null,null,null,0]
[null,null,null,null,null,null,0,0,null,null,null,null,null,0]
[null,null,null,null,null,null,0,0,null,null,null,null,null,0]
[null,null,null,null,null,null,0,0,null,null,null,null,null,0]
[null,null,null,null,null,null,0,0,null,null,null,null,null,0]
[null,null,null,null,null,null,0,0,null,null,null,null,null,0]
[null,null,null,null,null,null,0,0,null,null,null,null,null,0]
[null,null,null,null,null,null,0,0,null,null,null,null,null,0]
[null,null,null,null,null,null,0,0,null,null,null,null,null,0]
[null,null,null,null,null,null,0,0,null,null,null,null,null,0]
[null,null,null,null,null,null,0,0,null,null,null,null,null,0]
[null,null,null,null,null,null,0,0,null,null,null,null,null,0]
[null,null,null,null,null,null,0,0,null,null,null,null,null,0]
[null,null,null,null,null,null,0,0,null,null,null,null,null,0]
[null,null,null,null,null,null,0,0,null,null,null,null,null,0]
[null,null,null,null,null,null,0,0,null,null,null,null,null,0]
[null,null,null,null,null,null,0,0,null,null,null,{"$f":"IF(SUM(H11:H35)>0,1,0)","v":0},"Print check",0]
[]
["PART 5.H (1)"]
["MISCELLANEOUS SUPPLEMENTARY SHEET"]
[]
[]
["1. All costs not associated with the previous categories must be listed here."]
["2. Miscellaneous charges for work activities included in unit pricing should not be addressed on this form."]
["3. All RAC markups not denoted on other pages must be listed on this form."]
[]
["Costing Category","Description of Each Miscellaneous Item \nand Quantity of Item","RAC\nInvoice\nNo.","Outside\nInvoice\nNo.","Item's Cost\n ($)","10% Markup Applies \n(Yes/No)","Markup Subtotal\n($)","Item's \nTotal Cost",null,null,null,null,null,"Test"]
[null,null,null,null,null,null,{"$f":"IF(F46=\"Yes\",E46*0.1,0)","v":0},{"$f":"ROUND(IF(E46<>\"\",E46+G46,0),2)","v":0},null,null,null,null,null,{"$f":"IF(H46<>0,IF(OR(E46=\"\",C46=\"\",B46=\"\",A46=\"\"),1,0),0)","v":0}]
[null,null,null,null,null,null,{"$f":"IF(F47=\"Yes\",E47*0.1,0)","v":0},{"$f":"ROUND(IF(E47<>\"\",E47+G47,0),2)","v":0},null,null,null,null,null,{"$f":"IF(H47<>0,IF(OR(E47=\"\",C47=\"\",B47=\"\",A47=\"\"),1,0),0)","v":0}]
[null,null,null,null,null,null,0,0,null,null,null,null,null,0]
[null,null,null,null,null,null,0,0,null,null,null,null,null,0]
[null,null,null,null,null,null,0,0,null,null,null,null,null,0]
[null,null,null,null,null,null,0,0,null,null,null,null,null,0]
[null,null,null,null,null,null,0,0,null,null,null,null,null,0]
[null,null,null,null,null,null,0,0,null,null,null,null,null,0]
[null,null,null,null,null,null,0,0,null,null,null,null,null,0]
[null,null,null,null,null,null,0,0,null,null,null,null,null,0]
[null,null,null,null,null,null,0,0,null,null,null,null,null,0]
[null,null,null,null,null,null,0,0,null,null,null,null,null,0]
[null,null,null,null,null,null,0,0,null,null,null,null,null,0]
[null,null,null,null,null,null,0,0,null,null,null,null,null,0]
[null,null,null,null,null,null,0,0,null,null,null,null,null,0]
[null,null,null,null,null,null,0,0,null,null,null,null,null,0]
[null,null,null,null,null,null,0,0,null,null,null,null,null,0]
[null,null,null,null,null,null,0,0,null,null,null,null,null,0]
[null,null,null,null,null,null,0,0,null,null,null,null,null,0]
[null,null,null,null,null,null,0,0,null,null,null,null,null,0]
[null,null,null,null,null,null,0,0,null,null,null,null,null,0]
[null,null,null,null,null,null,0,0,null,null,null,null,null,0]
[null,null,null,null,null,null,{"$f":"IF(F68=\"Yes\",E68*0.1,0)","v":0},0,null,null,null,null,null,0]
[null,null,null,null,null,null,0,0,null,null,null,null,null,0]
[null,null,null,null,null,null,0,0,null,null,null,null,null,0]
[null,null,null,null,null,null,0,0,null,null,null,{"$f":"IF(SUM(H46:H71)>0,1,0)","v":0},"Print check",0]
[]
["PART 5.H (1)"]
["MISCELLANEOUS SUPPLEMENTARY SHEET"]
[]
[]
["1. All costs not associated with the previous categories must be listed here."]
["2. Miscellaneous charges for work activities included in unit pricing should not be addressed on this form."]
["3. All RAC markups not denoted on other pages must be listed on this form."]
[]
["Costing Category","Description of Each Miscellaneous Item \nand Quantity of Item","RAC\nInvoice\nNo.","Outside\nInvoice\nNo.","Item's Cost\n ($)","10% Markup Applies \n(Yes/No)","Markup Subtotal\n($)","Item's \nTotal Cost",null,null,null,null,null,"Test"]
[null,null,null,null,null,null,{"$f":"IF(F82=\"Yes\",E82*0.1,0)","v":0},{"$f":"ROUND(IF(E82<>\"\",E82+G82,0),2)","v":0},null,null,null,null,null,{"$f":"IF(H82<>0,IF(OR(E82=\"\",C82=\"\",B82=\"\",A82=\"\"),1,0),0)","v":0}]
[null,null,null,null,null,null,{"$f":"IF(F83=\"Yes\",E83*0.1,0)","v":0},{"$f":"ROUND(IF(E83<>\"\",E83+G83,0),2)","v":0},null,null,null,null,null,{"$f":"IF(H83<>0,IF(OR(E83=\"\",C83=\"\",B83=\"\",A83=\"\"),1,0),0)","v":0}]
[null,null,null,null,null,null,0,0,null,null,null,null,null,0]
[null,null,null,null,null,null,0,0,null,null,null,null,null,0]
[null,null,null,null,null,null,0,0,null,null,null,null,null,0]
[null,null,null,null,null,null,0,0,null,null,null,null,null,0]
[null,null,null,null,null,null,0,0,null,null,null,null,null,0]
[null,null,null,null,null,null,0,0,null,null,null,null,null,0]
[null,null,null,null,null,null,0,0,null,null,null,null,null,0]
[null,null,null,null,null,null,0,0,null,null,null,null,null,0]
[null,null,null,null,null,null,0,0,null,null,null,null,null,0]
[null,null,null,null,null,null,0,0,null,null,null,null,null,0]
[null,null,null,null,null,null,0,0,null,null,null,null,null,0]
[null,null,null,null,null,null,0,0,null,null,null,null,null,0]
[null,null,null,null,null,null,0,0,null,null,null,null,null,0]
[null,null,null,null,null,null,0,0,null,null,null,null,null,0]
[null,null,null,null,null,null,0,0,null,null,null,null,null,0]
[null,null,null,null,null,null,0,0,null,null,null,null,null,0]
[null,null,null,null,null,null,0,0,null,null,null,null,null,0]
[null,null,null,null,null,null,0,0,null,null,null,null,null,0]
[null,null,null,null,null,null,0,0,null,null,null,null,null,0]
[null,null,null,null,null,null,0,0,null,null,null,null,null,0]
[null,null,null,null,null,null,0,0,null,null,null,null,null,0]
[null,null,null,null,null,null,0,0,null,null,null,null,null,0]
[null,null,null,null,null,null,{"$f":"IF(F106=\"Yes\",E106*0.1,0)","v":0},0,null,null,null,null,null,0]
[null,null,null,null,null,null,0,0,null,null,null,{"$f":"IF(SUM(H82:H107)>0,1,0)","v":0},"Print check",0]

{"sheet":"Miscellaneous 2","index":16,"n_rows":122,"n_cols":17,"rows_kept":122,"cut":false,"hidden":false,"merged":[[91,4,92,7],[93,4,93,7],[94,4,94,7],[95,4,95,7],[96,4,96,7],[97,4,97,7],[90,1,90,7],[45,0,45,2],[86,0,86,2],[106,10,107,10],[100,10,101,10],[23,4,23,7],[14,4,14,7],[15,4,15,7],[50,3,51,3],[50,4,51,7],[52,4,52,7],[53,4,53,7],[35,2,35,7],[54,4,54,7],[29,3,29,7],[34,2,34,7],[26,3,26,7],[106,3,107,7],[27,3,27,7],[28,3,28,7],[39,1,39,6],[50,9,52,9],[59,1,60,1],[30,9,33,9],[98,4,98,7],[99,4,99,7],[98,9,99,9],[65,0,66,0],[65,8,66,8],[65,9,70,9],[79,2,79,7],[75,9,78,9],[75,2,75,7],[76,2,76,7],[77,2,77,7],[78,2,78,7],[67,3,67,7],[68,3,68,7],[69,3,69,7],[71,1,71,7],[71,9,74,9],[65,1,66,1],[65,2,66,2],[79,9,80,9],[9,3,10,3],[9,4,10,7],[11,4,11,7],[65,10,66,10],[50,10,51,10],[59,10,60,10],[9,10,10,10],[18,8,19,8],[18,10,19,10],[62,4,62,7],[63,4,63,7],[64,4,64,7],[55,4,55,7],[56,4,56,7],[20,4,20,7],[21,4,21,7],[22,4,22,7],[36,2,36,7],[37,2,37,7],[57,4,57,7],[18,9,19,9],[24,10,25,10],[24,3,25,7],[12,4,12,7],[13,4,13,7],[16,4,16,7],[17,4,17,7],[18,3,19,3],[18,4,19,7],[103,4,103,7],[103,9,105,9],[9,16,10,16],[18,16,19,16],[24,16,25,16],[38,16,39,16],[91,2,92,2],[91,10,92,10],[58,4,58,7],[59,9,60,9],[59,3,60,3],[59,4,60,7],[34,9,37,9],[30,1,30,7],[59,2,60,2],[80,1,80,6],[82,0,82,9],[83,0,83,9],[84,0,84,9],[9,1,10,1],[9,2,10,2],[24,1,25,1],[24,2,25,2],[21,9,23,9],[120,16,121,16],[50,16,51,16],[59,16,60,16],[65,16,66,16],[79,16,80,16],[91,16,92,16],[100,16,101,16],[106,16,107,16],[100,0,101,0],[100,1,101,1],[100,2,101,2],[91,8,92,8],[100,8,101,8],[106,9,111,9],[106,0,107,0],[106,1,107,1],[106,2,107,2],[108,3,108,7],[109,3,109,7],[110,3,110,7],[111,3,111,7],[106,8,107,8],[120,9,121,9],[120,8,121,8],[5,7,5,9],[9,9,11,9],[16,9,17,9],[3,1,3,5],[79,8,80,8],[4,0,4,2],[104,4,104,7],[105,4,105,7],[91,3,92,3],[91,9,93,9],[91,1,92,1],[38,8,39,8],[38,2,38,7],[59,8,60,8],[65,3,66,7],[38,9,39,9],[70,3,70,7],[62,9,64,9],[61,4,61,7],[91,0,92,0],[100,3,101,3],[100,4,101,7],[100,9,101,9],[102,4,102,7],[120,2,120,7],[121,1,121,6],[116,9,119,9],[112,1,112,7],[112,9,115,9],[116,2,116,7],[117,2,117,7],[118,2,118,7],[119,2,119,7],[0,0,0,9],[59,0,60,0],[49,1,49,7],[43,0,43,9],[50,0,51,0],[50,1,51,1],[50,2,51,2],[50,8,51,8],[18,1,19,1],[18,2,19,2],[41,0,41,9],[42,0,42,9],[8,1,8,7],[9,8,10,8],[24,8,25,8],[24,9,29,9],[57,9,58,9],[1,7,1,10],[2,7,2,9],[3,7,3,9],[4,7,4,9],[9,0,10,0],[24,0,25,0],[18,0,19,0]]}
["PART 5.H (2)",null,null,null,null,null,null,null,null,null,null,null,null,null,{"$f":"+O40+O81+O122","v":0},"Total Print check"]
["MISCELLANEOUS SUPPLEMENTARY SHEET",null,null,null,null,null,null,"Costing Category Summary"]
["UNIT PRICING FORM",null,null,null,null,null,null,"Emergency/Initial Work",null,null,{"$f":"SUMIF(A$10:A$40,H3,K$10:K$40)+SUMIF(A$51:A$81,H3,K$51:K$81)+SUMIF(A$92:A$122,H3,K$92:K$122)","v":0}]
[null,{"$f":"IF(SUM(Q10:Q122)>0,\"MISSING INFORMATION\",\"\")","v":""},null,null,null,null,null,"Investigation Work",null,null,{"$f":"SUMIF(A$10:A$40,H4,K$10:K$40)+SUMIF(A$51:A$81,H4,K$51:K$81)+SUMIF(A$92:A$122,H4,K$92:K$122)","v":0}]
["Unit pricing for these activities must be utilized.",null,null,null,null,null,null,"Interim Monitoring Work",null,null,{"$f":"SUMIF(A$10:A$40,H5,K$10:K$40)+SUMIF(A$51:A$81,H5,K$51:K$81)+SUMIF(A$92:A$122,H5,K$92:K$122)","v":0}]
[null,null,null,null,null,null,null,"Corrective Action Plan Work",null,null,{"$f":"SUMIF(A$10:A$40,H6,K$10:K$40)+SUMIF(A$51:A$81,H6,K$51:K$81)+SUMIF(A$92:A$122,H6,K$92:K$122)","v":0}]
[]
[]
["Costing Category","Unit Price Activities",null,null,null,null,null,null,"RAC\nInvoice\nNo.","Unit Rates","COST",null,null,null,null,null,"Test"]
["Groundwater Sampling","Event Date","1st Well Count","Addnl Well Count","List wells sampled, separate with a comma"]
[]
[null,null,null,null,null,null,null,null,null,null,{"$f":"ROUND(IF(B12=\"\",0,(C12*Reference!B$176+D12*Reference!C$176)),2)","v":0},null,null,null,null,null,{"$f":"IF(C12>0,IF(OR(A12=\"\",B12=\"\",D12=\"\",E12=\"\",I12=\"\"),1,0),0)","v":0}]
[null,null,null,null,null,null,null,null,null,{"$f":"CONCATENATE(\"$\",Reference!B$176,\".00 - 1st Well for Sample event\")","v":"$655.00 - 1st Well for Sample event"},{"$f":"ROUND(IF(B13=\"\",0,(C13*Reference!B$176+D13*Reference!C$176)),2)","v":0},null,null,null,null,null,{"$f":"IF(C13>0,IF(OR(A13=\"\",B13=\"\",D13=\"\",E13=\"\",I13=\"\"),1,0),0)","v":0}]
[null,null,null,null,null,null,null,null,null,null,{"$f":"ROUND(IF(B14=\"\",0,(C14*Reference!B$176+D14*Reference!C$176)),2)","v":0},null,null,null,null,null,0]
[null,null,null,null,null,null,null,null,null,{"$f":"CONCATENATE(\"$\",Reference!C$176,\".00 -  Additional wells\")","v":"$204.00 -  Additional wells"},{"$f":"ROUND(IF(B15=\"\",0,(C15*Reference!B$176+D15*Reference!C$176)),2)","v":0},null,null,null,null,null,0]
[null,null,null,null,null,null,null,null,null,null,{"$f":"ROUND(IF(B16=\"\",0,(C16*Reference!B$176+D16*Reference!C$176)),2)","v":0},null,null,null,null,null,0]
[null,null,null,null,null,null,null,null,null,null,{"$f":"ROUND(IF(B17=\"\",0,(C17*Reference!B$176+D17*Reference!C$176)),2)","v":0},null,null,null,null,null,0]
[null,null,null,null,null,null,null,null,null,null,{"$f":"ROUND(IF(B18=\"\",0,(C18*Reference!B$176+D18*Reference!C$176)),2)","v":0},null,null,null,null,null,0]
["Free Product Recovery","Event Date","1st Well Count","Addnl Well Count","List wells sampled, separate with a comma",null,null,null,null,{"$f":"CONCATENATE(\"$\",Reference!B$177,\".00 - 1st Well per event\")","v":"$198.00 - 1st Well per event"}]
[]
[null,null,null,null,null,null,null,null,null,{"$f":"CONCATENATE(\"$\",Reference!C$177,\".00 - Additional wells\")","v":"$65.00 - Additional wells"},{"$f":"ROUND(IF(B21=\"\",0,(C21*Reference!B$177+D21*Reference!C$177)),2)","v":0},null,null,null,null,null,{"$f":"IF(C21>0,IF(OR(A21=\"\",B21=\"\",D21=\"\",E21=\"\",I21=\"\"),1,0),0)","v":0}]
[null,null,null,null,null,null,null,null,null,{"$f":"CONCATENATE(\"The $\",Reference!C$177,\".00 rate applies to all wells handbailed on the same date as sampled.\")","v":"The $65.00 rate applies to all wells handbailed on the same date as sampled."},{"$f":"ROUND(IF(B22=\"\",0,(C22*Reference!B$177+D22*Reference!C$177)),2)","v":0},null,null,null,null,null,0]
[null,null,null,null,null,null,null,null,null,null,{"$f":"ROUND(IF(B23=\"\",0,(C23*Reference!B$177+D23*Reference!C$177)),2)","v":0},null,null,null,null,null,0]
[null,null,null,null,null,null,null,null,null,null,{"$f":"ROUND(IF(B24=\"\",0,(C24*Reference!B$177+D24*Reference!C$177)),2)","v":0},null,null,null,null,null,0]
["Gauging Wells","Event Date","Number of Wells","List wells sampled, separate with a comma",null,null,null,null,null,{"$f":"CONCATENATE(\"$\",Reference!B$178,\".00 per well\")","v":"$25.00 per well"}]
[]
[null,null,null,null,null,null,null,null,null,null,{"$f":"ROUND((C27*Reference!B$178),2)","v":0},null,null,null,null,null,{"$f":"IF(C27>0,IF(OR(A27=\"\",B27=\"\",D27=\"\",I27=\"\"),1,0),0)","v":0}]
[null,null,null,null,null,null,null,null,null,null,{"$f":"ROUND((C28*Reference!B$178),2)","v":0},null,null,null,null,null,{"$f":"IF(C28>0,IF(OR(A28=\"\",B28=\"\",D28=\"\",I28=\"\"),1,0),0)","v":0}]
[null,null,null,null,null,null,null,null,null,null,{"$f":"ROUND((C29*Reference!B$178),2)","v":0},null,null,null,null,null,{"$f":"IF(C29>0,IF(OR(A29=\"\",B29=\"\",D29=\"\",I29=\"\"),1,0),0)","v":0}]
[null,null,null,null,null,null,null,null,null,null,{"$f":"ROUND((C30*Reference!B$178),2)","v":0},null,null,null,null,null,{"$f":"IF(C30>0,IF(OR(A30=\"\",B30=\"\",D30=\"\",I30=\"\"),1,0),0)","v":0}]
["Discharge Sampling Events","List dates sampling occurred \n(When additional sampling events are being requested due to an exceedance, a copy of the analytical result documenting the exceedance must be provided.)",null,null,null,null,null,null,null,{"$f":"CONCATENATE(\"$\",Reference!B$179,\".00 per  event\")","v":"$263.00 per  event"}]
[null,null,null,null,null,null,null,null,null,null,{"$f":"ROUND((COUNTA(B32:H32)*Reference!B$179),2)","v":0},null,null,null,null,null,{"$f":"IF(AND(K32>0,OR(I32=\"\",A32=\"\")),1,0)","v":0}]
[null,null,null,null,null,null,null,null,null,null,{"$f":"ROUND((COUNTA(B33:H33)*Reference!B$179),2)","v":0},null,null,null,null,null,{"$f":"IF(AND(K33>0,OR(I33=\"\",A33=\"\")),1,0)","v":0}]
[null,null,null,null,null,null,null,null,null,null,{"$f":"ROUND((COUNTA(B34:H34)*Reference!B$179),2)","v":0},null,null,null,null,null,0]
["Mob/Demob ","Event Date"," Type of event (Drilling, Direct Push, P&A, etc.):",null,null,null,null,null,null,{"$f":"CONCATENATE(\"$\",Reference!B$180,\".00 once per event\")","v":"$320.00 once per event"}]
[null,null,null,null,null,null,null,null,null,null,{"$f":"ROUND((COUNTA(B36)*Reference!B$180),2)","v":0},null,null,null,null,null,{"$f":"IF(B36<>\"\",IF(OR(A36=\"\",C36=\"\",I36=\"\"),1,0),0)","v":0}]
[null,null,null,null,null,null,null,null,null,null,{"$f":"ROUND((COUNTA(B37)*Reference!B$180),2)","v":0},null,null,null,null,null,{"$f":"IF(B37<>\"\",IF(OR(A37=\"\",C37=\"\",I37=\"\"),1,0),0)","v":0}]
[null,null,null,null,null,null,null,null,null,null,{"$f":"ROUND((COUNTA(B38)*Reference!B$180),2)","v":0},null,null,null,null,null,0]
["Obtaining Offsite Access","Description:",null,null,null,null,null,null,null,{"$f":"CONCATENATE(\"$\",Reference!B$181,\".00 per property\")","v":"$459.00 per property"},null,null,null,null,null,null,{"$f":"IF(H40>0,IF(OR(A40=\"\",C39=\"\",I39=\"\"),1,0),0)","v":0}]
[null,"Number of Properties Accessed: ",null,null,null,null,null,null,null,null,{"$f":"H40*Reference!B$181","v":0},null,null,null,{"$f":"IF(SUM(K10:K40)>0,1,0)","v":0},"Print check"]
[]
["PART 5.H (2)"]
["MISCELLANEOUS SUPPLEMENTARY SHEET"]
["UNIT PRICING FORM"]
[]
["Unit pricing for these activities must be utilized."]
[]
[]
[]
["Costing Category","Unit Price Activities",null,null,null,null,null,null,"RAC\nInvoice\nNo.","Unit Rates","COST",null,null,null,null,null,"Test"]
["Groundwater Sampling","Event Date","1st Well Count","Addnl Well Count","List wells sampled, separate with a comma"]
[]
[null,null,null,null,null,null,null,null,null,null,{"$f":"ROUND(IF(B53=\"\",0,(C53*Reference!B$176+D53*Reference!C$176)),2)","v":0},null,null,null,null,null,{"$f":"IF(C53>0,IF(OR(A53=\"\",B53=\"\",D53=\"\",E53=\"\",I53=\"\"),1,0),0)","v":0}]
[null,null,null,null,null,null,null,null,null,{"$f":"CONCATENATE(\"$\",Reference!B$176,\".00 - 1st Well for Sample event\")","v":"$655.00 - 1st Well for Sample event"},{"$f":"ROUND(IF(B54=\"\",0,(C54*Reference!B$176+D54*Reference!C$176)),2)","v":0},null,null,null,null,null,{"$f":"IF(C54>0,IF(OR(A54=\"\",B54=\"\",D54=\"\",E54=\"\",I54=\"\"),1,0),0)","v":0}]
[null,null,null,null,null,null,null,null,null,null,{"$f":"ROUND(IF(B55=\"\",0,(C55*Reference!B$176+D55*Reference!C$176)),2)","v":0},null,null,null,null,null,0]
[null,null,null,null,null,null,null,null,null,{"$f":"CONCATENATE(\"$\",Reference!C$176,\".00 - others\")","v":"$204.00 - others"},{"$f":"ROUND(IF(B56=\"\",0,(C56*Reference!B$176+D56*Reference!C$176)),2)","v":0},null,null,null,null,null,0]
[null,null,null,null,null,null,null,null,null,null,{"$f":"ROUND(IF(B57=\"\",0,(C57*Reference!B$176+D57*Reference!C$176)),2)","v":0},null,null,null,null,null,0]
[null,null,null,null,null,null,null,null,null,null,{"$f":"ROUND(IF(B58=\"\",0,(C58*Reference!B$176+D58*Reference!C$176)),2)","v":0},null,null,null,null,null,0]
[null,null,null,null,null,null,null,null,null,null,{"$f":"ROUND(IF(B59=\"\",0,(C59*Reference!B$176+D59*Reference!C$176)),2)","v":0},null,null,null,null,null,0]
["Free Product Recovery","Event Date","1st Well Count","Addnl Well Count","List wells sampled, separate with a comma",null,null,null,null,{"$f":"CONCATENATE(\"$\",Reference!B$177,\".00 - 1st Well per event\")","v":"$198.00 - 1st Well per event"}]
[]
[null,null,null,null,null,null,null,null,null,{"$f":"CONCATENATE(\"$\",Reference!C$177,\".00 - Others\")","v":"$65.00 - Others"},{"$f":"ROUND(IF(B62=\"\",0,(C62*Reference!B$177+D62*Reference!C$177)),2)","v":0},null,null,null,null,null,{"$f":"IF(C62>0,IF(OR(A62=\"\",B62=\"\",D62=\"\",E62=\"\",I62=\"\"),1,0),0)","v":0}]
[null,null,null,null,null,null,null,null,null,{"$f":"CONCATENATE(\"The $\",Reference!C$177,\".00 rate applies to all wells handbailed on the same date as sampled.\")","v":"The $65.00 rate applies to all wells handbailed on the same date as sampled."},{"$f":"ROUND(IF(B63=\"\",0,(C63*Reference!B$177+D63*Reference!C$177)),2)","v":0},null,null,null,null,null,0]
[null,null,null,null,null,null,null,null,null,null,{"$f":"ROUND(IF(B64=\"\",0,(C64*Reference!B$177+D64*Reference!C$177)),2)","v":0},null,null,null,null,null,0]
[null,null,null,null,null,null,null,null,null,null,{"$f":"ROUND(IF(B65=\"\",0,(C65*Reference!B$177+D65*Reference!C$177)),2)","v":0},null,null,null,null,null,0]
["Gauging Wells","Event Date","Number of Wells","List wells sampled, separate with a comma",null,null,null,null,null,{"$f":"CONCATENATE(\"$\",Reference!B$178,\".00 per well\")","v":"$25.00 per well"}]
[]
[null,null,null,null,null,null,null,null,null,null,{"$f":"ROUND((C68*Reference!B$178),2)","v":0},null,null,null,null,null,{"$f":"IF(C68>0,IF(OR(A68=\"\",B68=\"\",D68=\"\",I68=\"\"),1,0),0)","v":0}]
[null,null,null,null,null,null,null,null,null,null,{"$f":"ROUND((C69*Reference!B$178),2)","v":0},null,null,null,null,null,{"$f":"IF(C69>0,IF(OR(A69=\"\",B69=\"\",D69=\"\",I69=\"\"),1,0),0)","v":0}]
[null,null,null,null,null,null,null,null,null,null,{"$f":"ROUND((C70*Reference!B$178),2)","v":0},null,null,null,null,null,{"$f":"IF(C70>0,IF(OR(A70=\"\",B70=\"\",D70=\"\",I70=\"\"),1,0),0)","v":0}]
[null,null,null,null,null,null,null,null,null,null,{"$f":"ROUND((C71*Reference!B$178),2)","v":0},null,null,null,null,null,{"$f":"IF(C71>0,IF(OR(A71=\"\",B71=\"\",D71=\"\",I71=\"\"),1,0),0)","v":0}]
["Discharge Sampling Events","List dates sampling occurred \n(When additional sampling events are being requested due to an exceedance, a copy of the analytical result documenting the exceedance must be provided.)",null,null,null,null,null,null,null,{"$f":"CONCATENATE(\"$\",Reference!B$179,\".00 per  event\")","v":"$263.00 per  event"}]
[null,null,null,null,null,null,null,null,null,null,{"$f":"ROUND((COUNTA(B73:H73)*Reference!B$179),2)","v":0},null,null,null,null,null,{"$f":"IF(AND(K73>0,OR(I73=\"\",A73=\"\")),1,0)","v":0}]
[null,null,null,null,null,null,null,null,null,null,{"$f":"ROUND((COUNTA(B74:H74)*Reference!B$179),2)","v":0},null,null,null,null,null,{"$f":"IF(AND(K74>0,OR(I74=\"\",A74=\"\")),1,0)","v":0}]
[null,null,null,null,null,null,null,null,null,null,{"$f":"ROUND((COUNTA(B75:H75)*Reference!B$179),2)","v":0},null,null,null,null,null,0]
["Mob/Demob ","Event Date"," Type of event (Drilling, Direct Push, P&A, etc.):",null,null,null,null,null,null,{"$f":"CONCATENATE(\"$\",Reference!B$180,\".00 once per event\")","v":"$320.00 once per event"}]
[null,null,null,null,null,null,null,null,null,null,{"$f":"ROUND((COUNTA(B77)*Reference!B$180),2)","v":0},null,null,null,null,null,{"$f":"IF(B77<>\"\",IF(OR(A77=\"\",C77=\"\",I77=\"\"),1,0),0)","v":0}]
[null,null,null,null,null,null,null,null,null,null,{"$f":"ROUND((COUNTA(B78)*Reference!B$180),2)","v":0},null,null,null,null,null,{"$f":"IF(B78<>\"\",IF(OR(A78=\"\",C78=\"\",I78=\"\"),1,0),0)","v":0}]
[null,null,null,null,null,null,null,null,null,null,{"$f":"ROUND((COUNTA(B79)*Reference!B$180),2)","v":0},null,null,null,null,null,0]
["Obtaining Offsite Access","Description:",null,null,null,null,null,null,null,{"$f":"CONCATENATE(\"$\",Reference!B$181,\".00 per property\")","v":"$459.00 per property"},null,null,null,null,null,null,{"$f":"IF(H81>0,IF(OR(A81=\"\",C80=\"\",I80=\"\"),1,0),0)","v":0}]
[null,"Number of Properties Accessed: ",null,null,null,null,null,null,null,null,{"$f":"H81*Reference!B$181","v":0},null,null,null,{"$f":"IF(SUM(K51:K81)>0,1,0)","v":0},"Print check"]
[]
["PART 5.H (2)"]
["MISCELLANEOUS SUPPLEMENTARY SHEET"]
["UNIT PRICING FORM"]
[]
["Unit pricing for these activities must be utilized."]
[]
[]
[]
["Costing Category","Unit Price Activities",null,null,null,null,null,null,"RAC\nInvoice\nNo.","Unit Rates","COST",null,null,null,null,null,"Test"]
["Groundwater Sampling","Event Date","1st Well Count","Addnl Well Count","List wells sampled, separate with a comma"]
[]
[null,null,null,null,null,null,null,null,null,null,{"$f":"ROUND(IF(B94=\"\",0,(C94*Reference!B$176+D94*Reference!C$176)),2)","v":0},null,null,null,null,null,{"$f":"IF(C94>0,IF(OR(A94=\"\",B94=\"\",D94=\"\",E94=\"\",I94=\"\"),1,0),0)","v":0}]
[null,null,null,null,null,null,null,null,null,{"$f":"CONCATENATE(\"$\",Reference!B$176,\".00 - 1st Well for Sample event\")","v":"$655.00 - 1st Well for Sample event"},{"$f":"ROUND(IF(B95=\"\",0,(C95*Reference!B$176+D95*Reference!C$176)),2)","v":0},null,null,null,null,null,{"$f":"IF(C95>0,IF(OR(A95=\"\",B95=\"\",D95=\"\",E95=\"\",I95=\"\"),1,0),0)","v":0}]
[null,null,null,null,null,null,null,null,null,null,{"$f":"ROUND(IF(B96=\"\",0,(C96*Reference!B$176+D96*Reference!C$176)),2)","v":0},null,null,null,null,null,0]
[null,null,null,null,null,null,null,null,null,{"$f":"CONCATENATE(\"$\",Reference!C$176,\".00 - others\")","v":"$204.00 - others"},{"$f":"ROUND(IF(B97=\"\",0,(C97*Reference!B$176+D97*Reference!C$176)),2)","v":0},null,null,null,null,null,0]
[null,null,null,null,null,null,null,null,null,null,{"$f":"ROUND(IF(B98=\"\",0,(C98*Reference!B$176+D98*Reference!C$176)),2)","v":0},null,null,null,null,null,0]
[null,null,null,null,null,null,null,null,null,null,{"$f":"ROUND(IF(B99=\"\",0,(C99*Reference!B$176+D99*Reference!C$176)),2)","v":0},null,null,null,null,null,0]
[null,null,null,null,null,null,null,null,null,null,{"$f":"ROUND(IF(B100=\"\",0,(C100*Reference!B$176+D100*Reference!C$176)),2)","v":0},null,null,null,null,null,0]
["Free Product Recovery","Event Date","1st Well Count","Addnl Well Count","List wells sampled, separate with a comma",null,null,null,null,{"$f":"CONCATENATE(\"$\",Reference!B$177,\".00 - 1st Well per event\")","v":"$198.00 - 1st Well per event"}]
[]
[null,null,null,null,null,null,null,null,null,{"$f":"CONCATENATE(\"$\",Reference!C$177,\".00 - Others\")","v":"$65.00 - Others"},{"$f":"ROUND(IF(B103=\"\",0,(C103*Reference!B$177+D103*Reference!C$177)),2)","v":0},null,null,null,null,null,{"$f":"IF(C103>0,IF(OR(A103=\"\",B103=\"\",D103=\"\",E103=\"\",I103=\"\"),1,0),0)","v":0}]
[null,null,null,null,null,null,null,null,null,{"$f":"CONCATENATE(\"The $\",Reference!C$177,\".00 rate applies to all wells handbailed on the same date as sampled.\")","v":"The $65.00 rate applies to all wells handbailed on the same date as sampled."},{"$f":"ROUND(IF(B104=\"\",0,(C104*Reference!B$177+D104*Reference!C$177)),2)","v":0},null,null,null,null,null,0]
[null,null,null,null,null,null,null,null,null,null,{"$f":"ROUND(IF(B105=\"\",0,(C105*Reference!B$177+D105*Reference!C$177)),2)","v":0},null,null,null,null,null,0]
[null,null,null,null,null,null,null,null,null,null,{"$f":"ROUND(IF(B106=\"\",0,(C106*Reference!B$177+D106*Reference!C$177)),2)","v":0},null,null,null,null,null,0]
["Gauging Wells","Event Date","Number of Wells","List wells sampled, separate with a comma",null,null,null,null,null,{"$f":"CONCATENATE(\"$\",Reference!B$178,\".00 per well\")","v":"$25.00 per well"}]
[]
[null,null,null,null,null,null,null,null,null,null,{"$f":"ROUND((C109*Reference!B$178),2)","v":0},null,null,null,null,null,{"$f":"IF(C109>0,IF(OR(A109=\"\",B109=\"\",D109=\"\",I109=\"\"),1,0),0)","v":0}]
[null,null,null,null,null,null,null,null,null,null,{"$f":"ROUND((C110*Reference!B$178),2)","v":0},null,null,null,null,null,{"$f":"IF(C110>0,IF(OR(A110=\"\",B110=\"\",D110=\"\",I110=\"\"),1,0),0)","v":0}]
[null,null,null,null,null,null,null,null,null,null,{"$f":"ROUND((C111*Reference!B$178),2)","v":0},null,null,null,null,null,{"$f":"IF(C111>0,IF(OR(A111=\"\",B111=\"\",D111=\"\",I111=\"\"),1,0),0)","v":0}]
[null,null,null,null,null,null,null,null,null,null,{"$f":"ROUND((C112*Reference!B$178),2)","v":0},null,null,null,null,null,{"$f":"IF(C112>0,IF(OR(A112=\"\",B112=\"\",D112=\"\",I112=\"\"),1,0),0)","v":0}]
["Discharge Sampling Events","List dates sampling occurred \n(When additional sampling events are being requested due to an exceedance, a copy of the analytical result documenting the exceedance must be provided.)",null,null,null,null,null,null,null,{"$f":"CONCATENATE(\"$\",Reference!B$179,\".00 per  event\")","v":"$263.00 per  event"}]
[null,null,null,null,null,null,null,null,null,null,{"$f":"ROUND((COUNTA(B114:H114)*Reference!B$179),2)","v":0},null,null,null,null,null,{"$f":"IF(AND(K114>0,OR(I114=\"\",A114=\"\")),1,0)","v":0}]
[null,null,null,null,null,null,null,null,null,null,{"$f":"ROUND((COUNTA(B115:H115)*Reference!B$179),2)","v":0},null,null,null,null,null,{"$f":"IF(AND(K115>0,OR(I115=\"\",A115=\"\")),1,0)","v":0}]
[null,null,null,null,null,null,null,null,null,null,{"$f":"ROUND((COUNTA(B116:H116)*Reference!B$179),2)","v":0},null,null,null,null,null,0]
["Mob/Demob ","Event Date"," Type of event (Drilling, Direct Push, P&A, etc.):",null,null,null,null,null,null,{"$f":"CONCATENATE(\"$\",Reference!B$180,\".00 once per event\")","v":"$320.00 once per event"}]
[null,null,null,null,null,null,null,null,null,null,{"$f":"ROUND((COUNTA(B118)*Reference!B$180),2)","v":0},null,null,null,null,null,{"$f":"IF(B118<>\"\",IF(OR(A118=\"\",C118=\"\",I118=\"\"),1,0),0)","v":0}]
[null,null,null,null,null,null,null,null,null,null,{"$f":"ROUND((COUNTA(B119)*Reference!B$180),2)","v":0},null,null,null,null,null,{"$f":"IF(B119<>\"\",IF(OR(A119=\"\",C119=\"\",I119=\"\"),1,0),0)","v":0}]
[null,null,null,null,null,null,null,null,null,null,{"$f":"ROUND((COUNTA(B120)*Reference!B$180),2)","v":0},null,null,null,null,null,0]
["Obtaining Offsite Access","Description:",null,null,null,null,null,null,null,{"$f":"CONCATENATE(\"$\",Reference!B$181,\".00 per property\")","v":"$459.00 per property"},null,null,null,null,null,null,{"$f":"IF(H122>0,IF(OR(A122=\"\",C121=\"\",I121=\"\"),1,0),0)","v":0}]
[null,"Number of Properties Accessed: ",null,null,null,null,null,null,null,null,{"$f":"H122*Reference!B$181","v":0},null,null,null,{"$f":"IF(SUM(K92:K122)>0,1,0)","v":0},"Print check"]

{"sheet":"Miscellaneous 3","index":17,"n_rows":133,"n_cols":17,"rows_kept":133,"cut":false,"hidden":false,"merged":[[4,0,4,2],[74,16,75,16],[17,16,19,16],[23,16,24,16],[28,16,29,16],[38,16,39,16],[61,16,63,16],[30,16,31,16],[32,16,33,16],[25,2,25,5],[26,2,26,5],[27,2,27,5],[34,4,34,7],[35,4,35,7],[36,1,36,2],[37,1,37,2],[36,3,36,7],[37,3,37,7],[20,2,20,5],[21,2,21,5],[22,2,22,5],[61,1,63,1],[61,2,63,5],[61,6,63,6],[82,16,83,16],[76,16,77,16],[105,16,107,16],[111,16,112,16],[116,16,117,16],[126,16,127,16],[116,1,117,2],[116,4,117,7],[94,0,94,5],[126,10,127,10],[105,0,107,0],[105,8,107,8],[105,9,110,9],[104,2,104,4],[104,5,104,6],[105,7,107,7],[99,5,99,7],[100,1,100,4],[100,5,100,7],[101,9,102,9],[103,9,104,9],[95,1,95,7],[96,1,96,4],[116,10,117,10],[116,0,117,0],[116,3,117,3],[111,8,112,8],[111,9,112,9],[111,0,112,0],[111,10,112,10],[113,9,114,9],[111,7,115,7],[111,1,112,1],[109,2,109,5],[110,2,110,5],[130,6,130,7],[131,6,131,7],[128,1,128,3],[116,8,117,8],[116,9,121,9],[124,9,125,9],[126,1,127,3],[126,4,127,4],[126,5,127,5],[126,8,127,8],[126,9,132,9],[132,1,132,3],[129,1,129,3],[130,1,130,3],[132,6,132,7],[129,6,129,7],[131,1,131,3],[122,9,123,9],[96,9,100,9],[97,1,97,4],[97,5,97,7],[98,1,98,4],[98,5,98,7],[99,1,99,4],[38,6,39,7],[40,6,40,7],[41,6,41,7],[42,6,42,7],[43,6,43,7],[44,6,44,7],[43,1,43,3],[38,4,39,4],[38,1,39,3],[40,1,40,3],[88,6,88,7],[69,2,69,5],[70,2,70,5],[71,2,71,5],[67,9,68,9],[85,1,85,3],[86,1,86,3],[56,1,56,4],[82,10,83,10],[84,1,84,3],[72,8,73,8],[72,9,77,9],[72,10,73,10],[78,9,79,9],[78,1,78,2],[78,4,78,7],[79,1,79,2],[79,4,79,7],[74,10,75,10],[76,10,77,10],[80,9,81,9],[82,8,83,8],[82,9,88,9],[88,1,88,3],[80,1,80,2],[80,3,80,7],[81,1,81,2],[81,3,81,7],[82,6,83,7],[84,6,84,7],[85,6,85,7],[86,6,86,7],[30,1,31,2],[32,1,33,2],[44,1,44,3],[38,5,39,5],[50,0,50,5],[32,0,33,0],[30,0,31,0],[38,0,39,0],[82,0,83,0],[82,1,83,3],[82,4,83,4],[82,5,83,5],[61,0,63,0],[76,0,77,0],[76,1,77,2],[76,3,77,3],[13,9,14,9],[16,2,16,4],[16,5,16,6],[15,9,16,9],[17,9,22,9],[17,8,19,8],[9,1,9,4],[10,1,10,4],[11,1,11,4],[12,1,12,4],[8,9,12,9],[0,6,0,9],[1,6,1,8],[2,6,2,8],[3,6,3,8],[4,6,4,8],[5,6,5,8],[25,9,26,9],[28,0,29,0],[28,9,33,9],[28,3,29,3],[28,8,29,8],[23,7,27,7],[17,0,19,0],[17,1,19,1],[23,1,24,1],[28,1,29,2],[28,4,29,7],[17,2,19,5],[17,6,19,6],[17,7,19,7],[23,2,24,5],[32,8,33,8],[23,0,24,0],[23,8,24,8],[7,1,7,7],[23,10,24,10],[38,10,39,10],[52,9,56,9],[53,1,53,4],[53,5,53,7],[54,1,54,4],[54,5,54,7],[55,1,55,4],[55,5,55,7],[38,9,44,9],[32,3,33,3],[30,8,31,8],[41,1,41,3],[42,1,42,3],[8,1,8,4],[8,5,8,7],[9,5,9,7],[34,9,35,9],[36,9,37,9],[23,9,24,9],[10,5,10,7],[11,5,11,7],[12,5,12,7],[69,9,70,9],[67,7,71,7],[67,6,68,6],[67,10,68,10],[59,9,60,9],[67,16,68,16],[72,16,73,16],[23,6,24,6],[30,10,31,10],[32,10,33,10],[61,9,66,9],[28,10,29,10],[38,8,39,8],[57,9,58,9],[61,7,63,7],[56,5,56,7],[51,1,51,7],[52,1,52,4],[52,5,52,7],[60,2,60,4],[60,5,60,6],[34,1,34,2],[35,1,35,2],[30,3,31,3],[61,8,63,8],[64,2,64,5],[65,2,65,5],[66,2,66,5],[72,0,73,0],[72,3,73,3],[67,8,68,8],[72,1,73,2],[72,4,73,7],[76,8,77,8],[67,0,68,0],[67,1,68,1],[67,2,68,5],[118,0,119,0],[118,1,119,2],[118,3,119,3],[118,8,119,8],[74,0,75,0],[74,1,75,2],[74,3,75,3],[74,8,75,8],[87,1,87,3],[96,5,96,7],[111,2,112,5],[111,6,112,6],[113,2,113,5],[114,2,114,5],[115,2,115,5],[105,1,107,1],[105,2,107,5],[87,6,87,7],[105,6,107,6],[108,2,108,5],[118,16,119,16],[120,0,121,0],[120,1,121,2],[120,3,121,3],[120,8,121,8],[120,10,121,10],[120,16,121,16],[128,6,128,7],[126,0,127,0],[122,1,122,2],[122,4,122,7],[123,1,123,2],[123,4,123,7],[124,1,124,2],[124,3,124,7],[125,1,125,2],[125,3,125,7],[126,6,127,7],[118,10,119,10]]}
["PART 5.H(3)",null,null,null,null,null,"Costing Category Summary",null,null,null,null,null,null,null,{"$f":"+O45+O89+O133","v":0},"Total Print check"]
["MISCELLANEOUS SUPPLEMENTARY SHEET",null,null,null,null,null,"Emergency/Initial Work",null,null,{"$f":"SUMIF(A$10:A$45,G2,K$10:K$45)+SUMIF(A$54:A$89,G2,K$54:K$89)+SUMIF(A$98:A$133,G2,K$98:K$133)","v":0}]
["UNIT PRICING FORM",null,null,null,null,null,"Investigation Work",null,null,{"$f":"SUMIF(A$10:A$45,G3,K$10:K$45)+SUMIF(A$54:A$89,G3,K$54:K$89)+SUMIF(A$98:A$133,G3,K$98:K$133)","v":0}]
[null,null,null,null,null,null,"Interim Monitoring Work",null,null,{"$f":"SUMIF(A$10:A$45,G4,K$10:K$45)+SUMIF(A$54:A$89,G4,K$54:K$89)+SUMIF(A$98:A$133,G4,K$98:K$133)","v":0}]
["Unit pricing for these activities must be utilized.",null,null,null,null,null,"Corrective Action Plan Work",null,null,{"$f":"SUMIF(A$10:A$45,G5,K$10:K$45)+SUMIF(A$54:A$89,G5,K$54:K$89)+SUMIF(A$98:A$133,G5,K$98:K$133)","v":0}]
["    * - Cost Control Guidance Document",null,null,null,null,null,"Report Preparation Work",null,null,{"$f":"SUMIF(A$10:A$45,G6,K$10:K$45)+SUMIF(A$54:A$89,G6,K$54:K$89)+SUMIF(A$98:A$133,G6,K$98:K$133)","v":0}]
[]
["Costing Category","Unit Price Activities",null,null,null,null,null,null,"RAC\nInvoice No.","Unit Rates","COST",null,null,null,null,null,"Test"]
["Bid Package Preparation Section:","Description of Bid Package:",null,null,null,"Value of Work:",null,null,null,"See page 53 of the 2022 CCGD* for rate descriptions\n\nProvide Bid Summary with RAC Invoice."]
[null,null,null,null,null,null,null,null,null,null,{"$f":"ROUND(IF(B10>0,IF(B10=Reference!$A$186,INDEX(Reference!$B$186:$D$190,MATCH(B10,Reference!$A$186:$A$190,0),MATCH(F10,Reference!$B$185:$D$185,0)),VLOOKUP(B10,Reference!$A$187:$B$190,2,FALSE)),0),2)","v":0},null,null,null,null,null,{"$f":"IF(B10<>\"\",IF(OR(A10=\"\",I10=\"\"),1,0),0)","v":0}]
[null,null,null,null,null,null,null,null,null,null,{"$f":"ROUND(IF(B11>0,IF(B11=Reference!$A$186,INDEX(Reference!$B$186:$D$190,MATCH(B11,Reference!$A$186:$A$190,0),MATCH(F11,Reference!$B$185:$D$185,0)),VLOOKUP(B11,Reference!$A$187:$B$190,2,FALSE)),0),2)","v":0},null,null,null,null,null,{"$f":"IF(B11<>\"\",IF(OR(A11=\"\",I11=\"\"),1,0),0)","v":0}]
[null,null,null,null,null,null,null,null,null,null,{"$f":"ROUND(IF(B12>0,IF(B12=Reference!$A$186,INDEX(Reference!$B$186:$D$190,MATCH(B12,Reference!$A$186:$A$190,0),MATCH(F12,Reference!$B$185:$D$185,0)),VLOOKUP(B12,Reference!$A$187:$B$190,2,FALSE)),0),2)","v":0},null,null,null,null,null,{"$f":"IF(B12<>\"\",IF(OR(A12=\"\",I12=\"\"),1,0),0)","v":0}]
[null,null,null,null,null,null,null,null,null,null,{"$f":"ROUND(IF(B13>0,IF(B13=Reference!$A$186,INDEX(Reference!$B$186:$D$190,MATCH(B13,Reference!$A$186:$A$190,0),MATCH(F13,Reference!$B$185:$D$185,0)),VLOOKUP(B13,Reference!$A$187:$B$190,2,FALSE)),0),2)","v":0},null,null,null,null,null,{"$f":"IF(B13<>\"\",IF(OR(A13=\"\",I13=\"\"),1,0),0)","v":0}]
["Treatment System Design/Engineering/Planning and Treatment System Installation Design/Engineering/Planning",null,null,null,null,null,null,null,null,{"$f":"CONCATENATE(\"$\",Reference!B$214,\" per activity\")","v":"$5242 per activity"}]
[null,null,null,null,null,null,"Yes/No",null,null,null,{"$f":"ROUND(IF(H15=\"Yes\",VLOOKUP(\"System Design and Planning\",Reference!A$214:B$218,2),0),2)","v":0},null,null,null,null,null,{"$f":"IF(H15<>\"\",IF(OR(I15=\"\",A15=\"\"),1,0),0)","v":0}]
["Permit Application Development and Submittal (select from lists)",null,null,null,null,null,null,null,null,"See page 66 of the 2022 \nCCGD* for rate descripitions"]
[null,"Air Permit:",null,null,null,"Water Permit:",null,null,null,null,{"$f":"SUM(IF(C17>0,VLOOKUP(C17,Reference!A$193:$B$195,2,FALSE),0)+IF(H17>0,VLOOKUP(H17,Reference!$A$193:$B$195,2,FALSE),0))","v":0},null,null,null,null,null,{"$f":"IF(K16>0,IF(OR(I17=\"\",A17=\"\"),1,0),0)","v":0}]
["Groundwater Monitoring Reports","Report Type","Report Period",null,null,null,"Treatement System (Yes/No)","Initial or \nSubsequent",null,"See pages 60-61 of the \n2022 CCGD* for rate descriptions"]
[]
[]
["Corrective Action Plan Work",null,null,null,null,null,null,null,null,null,{"$f":"IF(B21=\"\",0,VLOOKUP(CONCATENATE(B21,G21,H21),Reference!D$199:E$210,2,FALSE))","v":0},null,null,null,null,null,{"$f":"IF(B21<>\"\",IF(OR(A21=\"\",C21=\"\",G21=\"\",H21=\"\",I21=\"\"),1,0),0)","v":0}]
[null,null,null,null,null,null,null,null,null,null,{"$f":"IF(B22=\"\",0,VLOOKUP(CONCATENATE(B22,G22,H22),Reference!D$199:E$210,2,FALSE))","v":0},null,null,null,null,null,{"$f":"IF(B22<>\"\",IF(OR(A22=\"\",C22=\"\",G22=\"\",H22=\"\",I22=\"\"),1,0),0)","v":0}]
[null,null,null,null,null,null,null,null,null,null,{"$f":"IF(B23=\"\",0,VLOOKUP(CONCATENATE(B23,G23,H23),Reference!D$199:E$210,2,FALSE))","v":0},null,null,null,null,null,{"$f":"IF(B23<>\"\",IF(OR(A23=\"\",C23=\"\",G23=\"\",H23=\"\",I23=\"\"),1,0),0)","v":0}]
["Discharge Monitoring Report","Permit #","Report Period",null,null,null,"Discharge (Yes/No)","Include State or Municipal/\nParish Quarterly  reports",null,{"$f":"CONCATENATE(\"$\",Reference!B$302,\".00 per report\")","v":"$250.00 per report"}]
[]
[null,null,null,null,null,null,null,null,null,{"$f":"CONCATENATE(\"($\",Reference!B$303,\".00 for No Discharge)\")","v":"($87.00 for No Discharge)"},{"$f":"IF(B26<>\"\",IF(G26=\"Yes\",Reference!B$302,Reference!B$303),0)","v":0},null,null,null,null,null,{"$f":"IF(K26>0,IF(OR(A26=\"\",B26=\"\",C26=\"\",G26=\"\",I26=\"\"),1,0),0)","v":0}]
[null,null,null,null,null,null,null,null,null,null,{"$f":"IF(B27<>\"\",IF(G27=\"Yes\",Reference!B$302,Reference!B$303),0)","v":0},null,null,null,null,null,{"$f":"IF(K27>0,IF(OR(A27=\"\",B27=\"\",C27=\"\",G27=\"\",I27=\"\"),1,0),0)","v":0}]
[null,null,null,null,null,null,null,null,null,null,{"$f":"IF(B28<>\"\",IF(G28=\"Yes\",Reference!B$302,Reference!B$303),0)","v":0},null,null,null,null,null,{"$f":"IF(K28>0,IF(OR(A28=\"\",B28=\"\",C28=\"\",G28=\"\",I28=\"\"),1,0),0)","v":0}]
["Treatment Unit O&M ","Remed. Status / \nUnit Type / Frequency",null,"Add. Units","Enter the Dates of the O&M Events",null,null,null,null,"See page 65 of the 2022 CCGD* for rate descriptions"]
[]
[null,null,null,null,null,null,null,null,null,null,{"$f":"IF(B31=\"\",0,(VLOOKUP(B31,Reference!$D$221:$E$232,2,FALSE)+IF(D31=\"\",0,D31)*Reference!$B$235)*(COUNT(E31:H32)))","v":0},null,null,null,null,null,{"$f":"IF(B31<>\"\",IF(OR(A31=\"\",D31=\"\",COUNT(E31:H32)=0,I31=\"\"),1,0),0)","v":0}]
[]
[null,null,null,null,null,null,null,null,null,null,{"$f":"IF(B33=\"\",0,(VLOOKUP(B33,Reference!$D$221:$E$232,2,FALSE)+IF(D33=\"\",0,D33)*Reference!$B$235)*(COUNT(E33:H34)))","v":0},null,null,null,null,null,{"$f":"IF(B33<>\"\",IF(OR(A33=\"\",D33=\"\",COUNT(E33:H34)=0,I33=\"\"),1,0),0)","v":0}]
[]
["Oil Changes","# of Events",null,"Unit HP","Dates of Events",null,null,null,null,{"$f":"CONCATENATE(\"$\",Reference!B$236,\".00 per event\",\" & $\",Reference!B$237,\".00 for units GT 40 HP\")","v":"$3136.00 per event & $560.00 for units GT 40 HP"}]
[null,null,null,null,null,null,null,null,null,null,{"$f":"B36*(Reference!B$236+IF('Miscellaneous 3'!D36=\"> 40\",Reference!B$237,0))","v":0},null,null,null,null,null,{"$f":"IF(K36>0,IF(OR(A36=\"\",D36=\"\",E36=\"\",I36=\"\"),1,0),0)","v":0}]
["Stripperator Cleaning","# of Events",null,"Dates of Events",null,null,null,null,null,{"$f":"CONCATENATE(\"$\",Reference!B$238,\".00 per event\")","v":"$1008.00 per event"}]
[null,null,null,null,null,null,null,null,null,null,{"$f":"B38*(Reference!B$238)","v":0},null,null,null,null,null,{"$f":"IF(K38>0,IF(OR(A38=\"\",D38=\"\",I38=\"\"),1,0),0)","v":0}]
["Vac. Events Report","Event/Report Type",null,null,"1st Event (Yes/No)","Planned Event","Date of Event",null,null,"See page 73-75 of the 2022 CCGD* for rate descriptions"]
[]
[null,null,null,null,null,null,null,null,null,null,{"$f":"IF(COUNT(G41)=0,0,IF(E41=\"NA\",0,VLOOKUP(B41,Reference!$A$242:$D$244,IF('Miscellaneous 3'!E41=\"Yes\",2,3),FALSE))+(IF(F41=\"No\",0,VLOOKUP(B41,Reference!$A$242:$D$244,4,FALSE))))","v":0},null,null,null,null,null,{"$f":"IF(K41>0,IF(OR(A41=\"\",B41=\"\",E41=\"\",F41=\"\",G41=\"\",I41=\"\"),1,0),0)","v":0}]
[null,null,null,null,null,null,null,null,null,null,{"$f":"IF(COUNT(G42)=0,0,IF(E42=\"NA\",0,VLOOKUP(B42,Reference!$A$242:$D$244,IF('Miscellaneous 3'!E42=\"Yes\",2,3),FALSE))+(IF(F42=\"No\",0,VLOOKUP(B42,Reference!$A$242:$D$244,4,FALSE))))","v":0},null,null,null,null,null,{"$f":"IF(K42>0,IF(OR(A42=\"\",B42=\"\",E42=\"\",F42=\"\",G42=\"\",I42=\"\"),1,0),0)","v":0}]
[null,null,null,null,null,null,null,null,null,null,{"$f":"IF(COUNT(G43)=0,0,IF(E43=\"NA\",0,VLOOKUP(B43,Reference!$A$242:$D$244,IF('Miscellaneous 3'!E43=\"Yes\",2,3),FALSE))+(IF(F43=\"No\",0,VLOOKUP(B43,Reference!$A$242:$D$244,4,FALSE))))","v":0},null,null,null,null,null,{"$f":"IF(K43>0,IF(OR(A43=\"\",B43=\"\",E43=\"\",F43=\"\",G43=\"\",I43=\"\"),1,0),0)","v":0}]
[null,null,null,null,null,null,null,null,null,null,{"$f":"IF(COUNT(G44)=0,0,IF(E44=\"NA\",0,VLOOKUP(B44,Reference!$A$242:$D$244,IF('Miscellaneous 3'!E44=\"Yes\",2,3),FALSE))+(IF(F44=\"No\",0,VLOOKUP(B44,Reference!$A$242:$D$244,4,FALSE))))","v":0},null,null,null,null,null,0]
[null,null,null,null,null,null,null,null,null,null,{"$f":"IF(COUNT(G45)=0,0,IF(E45=\"NA\",0,VLOOKUP(B45,Reference!$A$242:$D$244,IF('Miscellaneous 3'!E45=\"Yes\",2,3),FALSE))+(IF(F45=\"No\",0,VLOOKUP(B45,Reference!$A$242:$D$244,4,FALSE))))","v":0},null,null,null,{"$f":"IF(SUM(K9:K45)>0,1,0)","v":0},"Print check",0]
[]
["PART 5.H(3)"]
["MISCELLANEOUS SUPPLEMENTARY SHEET"]
["UNIT PRICING FORM"]
[]
["Unit pricing for these activities must be utilized.",null,null,null,null,null,null,null,"    * - Cost Control Guidance Document"]
["Costing Category","Unit Price Activities",null,null,null,null,null,null,"RAC\nInvoice No.","Unit Rates","COST",null,null,null,null,null,"Test"]
["Bid Package Preparation:","Description of Bid Package:",null,null,null,"Value of Work:",null,null,null,"See page 53 of the 2022 CCGD* for rate descriptions\n\nProvide Bid Summary with RAC Invoice."]
[null,null,null,null,null,null,null,null,null,null,{"$f":"ROUND(IF(B54>0,IF(B54=Reference!$A$186,INDEX(Reference!$B$186:$D$190,MATCH(B54,Reference!$A$186:$A$190,0),MATCH(F54,Reference!$B$185:$D$185,0)),VLOOKUP(B54,Reference!$A$187:$B$190,2,FALSE)),0),2)","v":0},null,null,null,null,null,{"$f":"IF(B54<>\"\",IF(OR(A54=\"\",I54=\"\"),1,0),0)","v":0}]
[null,null,null,null,null,null,null,null,null,null,{"$f":"ROUND(IF(B55>0,IF(B55=Reference!$A$186,INDEX(Reference!$B$186:$D$190,MATCH(B55,Reference!$A$186:$A$190,0),MATCH(F55,Reference!$B$185:$D$185,0)),VLOOKUP(B55,Reference!$A$187:$B$190,2,FALSE)),0),2)","v":0},null,null,null,null,null,{"$f":"IF(B55<>\"\",IF(OR(A55=\"\",I55=\"\"),1,0),0)","v":0}]
[null,null,null,null,null,null,null,null,null,null,{"$f":"ROUND(IF(B56>0,IF(B56=Reference!$A$186,INDEX(Reference!$B$186:$D$190,MATCH(B56,Reference!$A$186:$A$190,0),MATCH(F56,Reference!$B$185:$D$185,0)),VLOOKUP(B56,Reference!$A$187:$B$190,2,FALSE)),0),2)","v":0},null,null,null,null,null,{"$f":"IF(B56<>\"\",IF(OR(A56=\"\",I56=\"\"),1,0),0)","v":0}]
[null,null,null,null,null,null,null,null,null,null,{"$f":"ROUND(IF(B57>0,IF(B57=Reference!$A$186,INDEX(Reference!$B$186:$D$190,MATCH(B57,Reference!$A$186:$A$190,0),MATCH(F57,Reference!$B$185:$D$185,0)),VLOOKUP(B57,Reference!$A$187:$B$190,2,FALSE)),0),2)","v":0},null,null,null,null,null,{"$f":"IF(B57<>\"\",IF(OR(A57=\"\",I57=\"\"),1,0),0)","v":0}]
["Treatment System Design/Engineering/Planning and Treatment System Installation Design/Engineering/Planning",null,null,null,null,null,null,null,null,{"$f":"CONCATENATE(\"$\",Reference!B$214,\".00 per activity\")","v":"$5242.00 per activity"}]
[null,null,null,null,null,null,"Yes/No",null,null,null,{"$f":"ROUND(IF(H59=\"Yes\",VLOOKUP(\"System Design and Planning\",Reference!A$214:B$218,2),0),2)","v":0},null,null,null,null,null,{"$f":"IF(H59<>\"\",IF(OR(I59=\"\",A59=\"\"),1,0),0)","v":0}]
["Permit Application Development and Submittal (select from lists)",null,null,null,null,null,null,null,null,"See page 66 of the 2022 \nCCGD* for rate descripitions"]
[null,"Air Permit:",null,null,null,"Water Permit:",null,null,null,null,{"$f":"SUM(IF(C61>0,VLOOKUP(C61,Reference!A$193:$B$195,2,FALSE),0)+IF(H61>0,VLOOKUP(H61,Reference!$A$193:$B$195,2,FALSE),0))","v":0},null,null,null,null,null,{"$f":"IF(K60>0,IF(OR(I61=\"\",A61=\"\"),1,0),0)","v":0}]
["Groundwater Monitoring Reports","Report Type","Report Period",null,null,null,"Treatement System (Yes/No)","Initial or \nSubsequent",null,"See pages 60-61 of the \n2022 CCGD* for rate descriptions"]
[]
[]
[null,null,null,null,null,null,null,null,null,null,{"$f":"IF(B65=\"\",0,VLOOKUP(CONCATENATE(B65,G65,H65),Reference!D$199:E$210,2,FALSE))","v":0},null,null,null,null,null,{"$f":"IF(B65<>\"\",IF(OR(A65=\"\",C65=\"\",G65=\"\",H65=\"\",I65=\"\"),1,0),0)","v":0}]
[null,null,null,null,null,null,null,null,null,null,{"$f":"IF(B66=\"\",0,VLOOKUP(CONCATENATE(B66,G66,H66),Reference!D$199:E$210,2,FALSE))","v":0},null,null,null,null,null,{"$f":"IF(B66<>\"\",IF(OR(A66=\"\",C66=\"\",G66=\"\",H66=\"\",I66=\"\"),1,0),0)","v":0}]
[null,null,null,null,null,null,null,null,null,null,{"$f":"IF(B67=\"\",0,VLOOKUP(CONCATENATE(B67,G67,H67),Reference!D$199:E$210,2,FALSE))","v":0},null,null,null,null,null,{"$f":"IF(B67<>\"\",IF(OR(A67=\"\",C67=\"\",G67=\"\",H67=\"\",I67=\"\"),1,0),0)","v":0}]
["Discharge Monitoring Report","Permit #","Report Period",null,null,null,"Discharge (Yes/No)","Include State or Municipal/\nParish Quarterly  reports",null,{"$f":"CONCATENATE(\"$\",Reference!B$302,\".00 per report\")","v":"$250.00 per report"}]
[]
[null,null,null,null,null,null,null,null,null,{"$f":"CONCATENATE(\"($\",Reference!B$303,\".00 for No Discharge)\")","v":"($87.00 for No Discharge)"},{"$f":"IF(B70<>\"\",IF(G70=\"Yes\",Reference!B$302,Reference!B$303),0)","v":0},null,null,null,null,null,{"$f":"IF(K70>0,IF(OR(A70=\"\",B70=\"\",C70=\"\",G70=\"\",I70=\"\"),1,0),0)","v":0}]
[null,null,null,null,null,null,null,null,null,null,{"$f":"IF(B71<>\"\",IF(G71=\"Yes\",Reference!B$302,Reference!B$303),0)","v":0},null,null,null,null,null,{"$f":"IF(K71>0,IF(OR(A71=\"\",B71=\"\",C71=\"\",G71=\"\",I71=\"\"),1,0),0)","v":0}]
[null,null,null,null,null,null,null,null,null,null,{"$f":"IF(B72<>\"\",IF(G72=\"Yes\",Reference!B$302,Reference!B$303),0)","v":0},null,null,null,null,null,{"$f":"IF(K72>0,IF(OR(A72=\"\",B72=\"\",C72=\"\",G72=\"\",I72=\"\"),1,0),0)","v":0}]
["Treatment Unit O&M ","Remed. Status / \nUnit Type / Frequency",null,"Add. Units","Enter the Dates of the O&M Events",null,null,null,null,"See page 65 of the 2022 CCGD* for rate descriptions"]
[]
[null,null,null,null,null,null,null,null,null,null,{"$f":"IF(B75=\"\",0,(VLOOKUP(B75,Reference!$D$221:$E$232,2,FALSE)+IF(D75=\"\",0,D75)*Reference!$B$235)*(COUNT(E75:H76)))","v":0},null,null,null,null,null,{"$f":"IF(B75<>\"\",IF(OR(A75=\"\",D75=\"\",COUNT(E75:H76)=0,I75=\"\"),1,0),0)","v":0}]
[]
[null,null,null,null,null,null,null,null,null,null,{"$f":"IF(B77=\"\",0,(VLOOKUP(B77,Reference!$D$221:$E$232,2,FALSE)+IF(D77=\"\",0,D77)*Reference!$B$235)*(COUNT(E77:H78)))","v":0},null,null,null,null,null,{"$f":"IF(B77<>\"\",IF(OR(A77=\"\",D77=\"\",COUNT(E77:H78)=0,I77=\"\"),1,0),0)","v":0}]
[]
["Oil Changes","# of Events",null,"Unit HP","Dates of Events",null,null,null,null,{"$f":"CONCATENATE(\"$\",Reference!B$236,\".00 per event\",\" & $\",Reference!B$237,\".00 for units GT 40 HP\")","v":"$3136.00 per event & $560.00 for units GT 40 HP"}]
[null,null,null,null,null,null,null,null,null,null,{"$f":"B80*(Reference!B$236+IF('Miscellaneous 3'!D80=\"> 40\",Reference!B$237,0))","v":0},null,null,null,null,null,{"$f":"IF(K80>0,IF(OR(A80=\"\",D80=\"\",E80=\"\",I80=\"\"),1,0),0)","v":0}]
["Stripperator Cleaning","# of Events",null,"Dates of Events",null,null,null,null,null,{"$f":"CONCATENATE(\"$\",Reference!B$238,\".00 per event\")","v":"$1008.00 per event"}]
[null,null,null,null,null,null,null,null,null,null,{"$f":"B82*(Reference!B$238)","v":0},null,null,null,null,null,{"$f":"IF(K82>0,IF(OR(A82=\"\",D82=\"\",I82=\"\"),1,0),0)","v":0}]
["Vac. Events Report","Event/Report Type",null,null,"1st Event (Yes/No)","Planned Event","Date of Event",null,null,"See page 73-75 of the 2022 CCGD* for rate descriptions"]
[]
[null,null,null,null,null,null,null,null,null,null,{"$f":"IF(COUNT(G85)=0,0,IF(E85=\"NA\",0,VLOOKUP(B85,Reference!$A$242:$D$244,IF('Miscellaneous 3'!E85=\"Yes\",2,3),FALSE))+(IF(F85=\"No\",0,VLOOKUP(B85,Reference!$A$242:$D$244,4,FALSE))))","v":0},null,null,null,null,null,{"$f":"IF(K85>0,IF(OR(A85=\"\",B85=\"\",E85=\"\",F85=\"\",G85=\"\",I85=\"\"),1,0),0)","v":0}]
[null,null,null,null,null,null,null,null,null,null,{"$f":"IF(COUNT(G86)=0,0,IF(E86=\"NA\",0,VLOOKUP(B86,Reference!$A$242:$D$244,IF('Miscellaneous 3'!E86=\"Yes\",2,3),FALSE))+(IF(F86=\"No\",0,VLOOKUP(B86,Reference!$A$242:$D$244,4,FALSE))))","v":0},null,null,null,null,null,{"$f":"IF(K86>0,IF(OR(A86=\"\",B86=\"\",E86=\"\",F86=\"\",G86=\"\",I86=\"\"),1,0),0)","v":0}]
[null,null,null,null,null,null,null,null,null,null,{"$f":"IF(COUNT(G87)=0,0,IF(E87=\"NA\",0,VLOOKUP(B87,Reference!$A$242:$D$244,IF('Miscellaneous 3'!E87=\"Yes\",2,3),FALSE))+(IF(F87=\"No\",0,VLOOKUP(B87,Reference!$A$242:$D$244,4,FALSE))))","v":0},null,null,null,null,null,{"$f":"IF(K87>0,IF(OR(A87=\"\",B87=\"\",E87=\"\",F87=\"\",G87=\"\",I87=\"\"),1,0),0)","v":0}]
[null,null,null,null,null,null,null,null,null,null,{"$f":"IF(COUNT(G88)=0,0,IF(E88=\"NA\",0,VLOOKUP(B88,Reference!$A$242:$D$244,IF('Miscellaneous 3'!E88=\"Yes\",2,3),FALSE))+(IF(F88=\"No\",0,VLOOKUP(B88,Reference!$A$242:$D$244,4,FALSE))))","v":0},null,null,null,null,null,0]
[null,null,null,null,null,null,null,null,null,null,{"$f":"IF(COUNT(G89)=0,0,IF(E89=\"NA\",0,VLOOKUP(B89,Reference!$A$242:$D$244,IF('Miscellaneous 3'!E89=\"Yes\",2,3),FALSE))+(IF(F89=\"No\",0,VLOOKUP(B89,Reference!$A$242:$D$244,4,FALSE))))","v":0},null,null,null,{"$f":"IF(SUM(K53:K89)>0,1,0)","v":0},"Print check",0]
[]
["PART 5.H(3)"]
["MISCELLANEOUS SUPPLEMENTARY SHEET"]
["UNIT PRICING FORM"]
[]
[" Unit pricing for these activities is mandatory.",null,null,null,null,null,null,null,"    * - Cost Control Guidance Document"]
["Costing Category","Unit Price Activities",null,null,null,null,null,null,"RAC\nInvoice No.","Unit Rates","COST",null,null,null,null,null,"Test"]
["Bid Package Preparation:","Description of Bid Package:",null,null,null,"Value of Work:",null,null,null,"See page 53 of the 2022 CCGD* for rate descriptions\n\nProvide Bid Summary with RAC Invoice."]
[null,null,null,null,null,null,null,null,null,null,{"$f":"ROUND(IF(B98>0,IF(B98=Reference!$A$186,INDEX(Reference!$B$186:$D$190,MATCH(B98,Reference!$A$186:$A$190,0),MATCH(F98,Reference!$B$185:$D$185,0)),VLOOKUP(B98,Reference!$A$187:$B$190,2,FALSE)),0),2)","v":0},null,null,null,null,null,{"$f":"IF(B98<>\"\",IF(OR(A98=\"\",I98=\"\"),1,0),0)","v":0}]
[null,null,null,null,null,null,null,null,null,null,{"$f":"ROUND(IF(B99>0,IF(B99=Reference!$A$186,INDEX(Reference!$B$186:$D$190,MATCH(B99,Reference!$A$186:$A$190,0),MATCH(F99,Reference!$B$185:$D$185,0)),VLOOKUP(B99,Reference!$A$187:$B$190,2,FALSE)),0),2)","v":0},null,null,null,null,null,{"$f":"IF(B99<>\"\",IF(OR(A99=\"\",I99=\"\"),1,0),0)","v":0}]
[null,null,null,null,null,null,null,null,null,null,{"$f":"ROUND(IF(B100>0,IF(B100=Reference!$A$186,INDEX(Reference!$B$186:$D$190,MATCH(B100,Reference!$A$186:$A$190,0),MATCH(F100,Reference!$B$185:$D$185,0)),VLOOKUP(B100,Reference!$A$187:$B$190,2,FALSE)),0),2)","v":0},null,null,null,null,null,{"$f":"IF(B100<>\"\",IF(OR(A100=\"\",I100=\"\"),1,0),0)","v":0}]
[null,null,null,null,null,null,null,null,null,null,{"$f":"ROUND(IF(B101>0,IF(B101=Reference!$A$186,INDEX(Reference!$B$186:$D$190,MATCH(B101,Reference!$A$186:$A$190,0),MATCH(F101,Reference!$B$185:$D$185,0)),VLOOKUP(B101,Reference!$A$187:$B$190,2,FALSE)),0),2)","v":0},null,null,null,null,null,{"$f":"IF(B101<>\"\",IF(OR(A101=\"\",I101=\"\"),1,0),0)","v":0}]
["Treatment System Design/Engineering/Planning and Treatment System Installation Design/Engineering/Planning",null,null,null,null,null,null,null,null,{"$f":"CONCATENATE(\"$\",Reference!B$214,\".00 per activity\")","v":"$5242.00 per activity"}]
[null,null,null,null,null,null,"Yes/No",null,null,null,{"$f":"ROUND(IF(H103=\"Yes\",VLOOKUP(\"System Design and Planning\",Reference!A$214:B$218,2),0),2)","v":0},null,null,null,null,null,{"$f":"IF(H103<>\"\",IF(OR(I103=\"\",A103=\"\"),1,0),0)","v":0}]
["Permit Application Development and Submittal (select from lists)",null,null,null,null,null,null,null,null,"See page 66 of the 2022 \nCCGD* for rate descripitions"]
[null,"Air Permit:",null,null,null,"Water Permit:",null,null,null,null,{"$f":"SUM(IF(C105>0,VLOOKUP(C105,Reference!A$193:$B$195,2,FALSE),0)+IF(H105>0,VLOOKUP(H105,Reference!$A$193:$B$195,2,FALSE),0))","v":0},null,null,null,null,null,{"$f":"IF(K104>0,IF(OR(I105=\"\",A105=\"\"),1,0),0)","v":0}]
["Groundwater Monitoring Reports","Report Type","Report Period",null,null,null,"Treatement System (Yes/No)","Initial or \nSubsequent",null,"See pages 60-61 of the \n2022 CCGD* for rate descriptions"]
[]
[]
[null,null,null,null,null,null,null,null,null,null,{"$f":"IF(B109=\"\",0,VLOOKUP(CONCATENATE(B109,G109,H109),Reference!D$199:E$210,2,FALSE))","v":0},null,null,null,null,null,{"$f":"IF(B109<>\"\",IF(OR(A109=\"\",C109=\"\",G109=\"\",H109=\"\",I109=\"\"),1,0),0)","v":0}]
[null,null,null,null,null,null,null,null,null,null,{"$f":"IF(B110=\"\",0,VLOOKUP(CONCATENATE(B110,G110,H110),Reference!D$199:E$210,2,FALSE))","v":0},null,null,null,null,null,{"$f":"IF(B110<>\"\",IF(OR(A110=\"\",C110=\"\",G110=\"\",H110=\"\",I110=\"\"),1,0),0)","v":0}]
[null,null,null,null,null,null,null,null,null,null,{"$f":"IF(B111=\"\",0,VLOOKUP(CONCATENATE(B111,G111,H111),Reference!D$199:E$210,2,FALSE))","v":0},null,null,null,null,null,{"$f":"IF(B111<>\"\",IF(OR(A111=\"\",C111=\"\",G111=\"\",H111=\"\",I111=\"\"),1,0),0)","v":0}]
["Discharge Monitoring Report","Permit #","Report Period",null,null,null,"Discharge (Yes/No)","Include State or Municipal/\nParish Quarterly  reports",null,{"$f":"CONCATENATE(\"$\",Reference!B$302,\".00 per report\")","v":"$250.00 per report"}]
[]
[null,null,null,null,null,null,null,null,null,{"$f":"CONCATENATE(\"($\",Reference!B$303,\".00 for No Discharge)\")","v":"($87.00 for No Discharge)"},{"$f":"IF(B114<>\"\",IF(G114=\"Yes\",Reference!B$302,Reference!B$303),0)","v":0},null,null,null,null,null,{"$f":"IF(K114>0,IF(OR(A114=\"\",B114=\"\",C114=\"\",G114=\"\",I114=\"\"),1,0),0)","v":0}]
[null,null,null,null,null,null,null,null,null,null,{"$f":"IF(B115<>\"\",IF(G115=\"Yes\",Reference!B$302,Reference!B$303),0)","v":0},null,null,null,null,null,{"$f":"IF(K115>0,IF(OR(A115=\"\",B115=\"\",C115=\"\",G115=\"\",I115=\"\"),1,0),0)","v":0}]
[null,null,null,null,null,null,null,null,null,null,{"$f":"IF(B116<>\"\",IF(G116=\"Yes\",Reference!B$302,Reference!B$303),0)","v":0},null,null,null,null,null,{"$f":"IF(K116>0,IF(OR(A116=\"\",B116=\"\",C116=\"\",G116=\"\",I116=\"\"),1,0),0)","v":0}]
["Treatment Unit O&M ","Remed. Status / \nUnit Type / Frequency",null,"Add. Units","Enter the Dates of the O&M Events",null,null,null,null,"See page 65 of the 2022 CCGD* for rate descriptions"]
[]
[null,null,null,null,null,null,null,null,null,null,{"$f":"IF(B119=\"\",0,(VLOOKUP(B119,Reference!$D$221:$E$232,2,FALSE)+IF(D119=\"\",0,D119)*Reference!$B$235)*(COUNT(E119:H120)))","v":0},null,null,null,null,null,{"$f":"IF(B119<>\"\",IF(OR(A119=\"\",D119=\"\",COUNT(E119:H120)=0,I119=\"\"),1,0),0)","v":0}]
[]
[null,null,null,null,null,null,null,null,null,null,{"$f":"IF(B121=\"\",0,(VLOOKUP(B121,Reference!$D$221:$E$232,2,FALSE)+IF(D121=\"\",0,D121)*Reference!$B$235)*(COUNT(E121:H122)))","v":0},null,null,null,null,null,{"$f":"IF(B121<>\"\",IF(OR(A121=\"\",D121=\"\",COUNT(E121:H122)=0,I121=\"\"),1,0),0)","v":0}]
[]
["Oil Changes","# of Events",null,"Unit HP","Dates of Events",null,null,null,null,{"$f":"CONCATENATE(\"$\",Reference!B$236,\".00 per event\",\" & $\",Reference!B$237,\".00 for units GT 40 HP\")","v":"$3136.00 per event & $560.00 for units GT 40 HP"}]
[null,null,null,null,null,null,null,null,null,null,{"$f":"B124*(Reference!B$236+IF('Miscellaneous 3'!D124=\"> 40\",Reference!B$237,0))","v":0},null,null,null,null,null,{"$f":"IF(K124>0,IF(OR(A124=\"\",D124=\"\",E124=\"\",I124=\"\"),1,0),0)","v":0}]
["Stripperator Cleaning","# of Events",null,"Dates of Events",null,null,null,null,null,{"$f":"CONCATENATE(\"$\",Reference!B$238,\".00 per event\")","v":"$1008.00 per event"}]
[null,null,null,null,null,null,null,null,null,null,{"$f":"B126*(Reference!B$238)","v":0},null,null,null,null,null,{"$f":"IF(K126>0,IF(OR(A126=\"\",D126=\"\",I126=\"\"),1,0),0)","v":0}]
["Vac. Events Report","Event/Report Type",null,null,"1st Event (Yes/No)","Planned Event","Date of Event",null,null,"See page 73-75 of the 2022 CCGD* for rate descriptions"]
[]
[null,null,null,null,null,null,null,null,null,null,{"$f":"IF(COUNT(G129)=0,0,IF(E129=\"NA\",0,VLOOKUP(B129,Reference!$A$242:$D$244,IF('Miscellaneous 3'!E129=\"Yes\",2,3),FALSE))+(IF(F129=\"No\",0,VLOOKUP(B129,Reference!$A$242:$D$244,4,FALSE))))","v":0},null,null,null,null,null,{"$f":"IF(K129>0,IF(OR(A129=\"\",B129=\"\",E129=\"\",F129=\"\",G129=\"\",I129=\"\"),1,0),0)","v":0}]
[null,null,null,null,null,null,null,null,null,null,{"$f":"IF(COUNT(G131)=0,0,IF(E130=\"NA\",0,VLOOKUP(B130,Reference!$A$242:$D$244,IF('Miscellaneous 3'!E130=\"Yes\",2,3),FALSE))+(IF(F130=\"No\",0,VLOOKUP(B130,Reference!$A$242:$D$244,4,FALSE))))","v":0},null,null,null,null,null,{"$f":"IF(K130>0,IF(OR(A130=\"\",B130=\"\",E130=\"\",F130=\"\",G130=\"\",I130=\"\"),1,0),0)","v":0}]
[null,null,null,null,null,null,null,null,null,null,{"$f":"IF(COUNT(#REF!)=0,0,IF(E131=\"NA\",0,VLOOKUP(B131,Reference!$A$242:$D$244,IF('Miscellaneous 3'!E131=\"Yes\",2,3),FALSE))+(IF(F131=\"No\",0,VLOOKUP(B131,Reference!$A$242:$D$244,4,FALSE))))","v":0},null,null,null,null,null,{"$f":"IF(K131>0,IF(OR(A131=\"\",B131=\"\",E131=\"\",F131=\"\",G131=\"\",I131=\"\"),1,0),0)","v":0}]
[null,null,null,null,null,null,null,null,null,null,{"$f":"IF(COUNT(G132)=0,0,IF(E132=\"NA\",0,VLOOKUP(B132,Reference!$A$242:$D$244,IF('Miscellaneous 3'!E132=\"Yes\",2,3),FALSE))+(IF(F132=\"No\",0,VLOOKUP(B132,Reference!$A$242:$D$244,4,FALSE))))","v":0},null,null,null,null,null,0]
[null,null,null,null,null,null,null,null,null,null,{"$f":"IF(COUNT(G133)=0,0,IF(E133=\"NA\",0,VLOOKUP(B133,Reference!$A$242:$D$244,IF('Miscellaneous 3'!E133=\"Yes\",2,3),FALSE))+(IF(F133=\"No\",0,VLOOKUP(B133,Reference!$A$242:$D$244,4,FALSE))))","v":0},null,null,null,{"$f":"IF(SUM(K97:K133)>0,1,0)","v":0},"Print check",0]

{"sheet":"Miscellaneous 4","index":18,"n_rows":41,"n_cols":21,"rows_kept":41,"cut":false,"hidden":false,"merged":[[26,20,27,20],[38,20,40,20],[40,3,40,4],[38,0,39,0],[26,6,31,6],[26,7,27,7],[38,7,39,7],[36,1,36,4],[38,6,40,6],[40,1,40,2],[26,5,27,5],[35,1,35,3],[32,6,35,6],[36,6,37,6],[26,0,26,4],[32,0,32,4],[19,6,20,6],[10,0,10,4],[22,1,22,3],[23,1,23,3],[24,1,24,3],[21,6,25,6],[10,6,14,6],[17,6,18,6],[0,4,0,7],[2,4,2,5],[1,4,1,5],[10,7,11,7],[15,0,15,4],[15,6,16,6],[11,2,11,3],[12,2,12,3],[13,2,13,3],[14,2,14,3],[34,1,34,3],[3,4,3,5],[4,4,4,5],[5,4,5,5],[6,4,6,5],[16,2,16,3],[17,2,17,3],[18,2,18,3],[9,1,9,4],[8,0,8,2],[33,1,33,3],[21,0,21,4],[19,0,19,4],[25,1,25,3]]}
["PART 5.H (4)",null,null,null,"Costing Category Summary"]
["MISCELLANEOUS SUPPLEMENTARY SHEET",null,null,null,"Category",null,"Page Totals","Part 5.H totals"]
["UNIT PRICING FORM",null,null,null,"Emergency/Initial Work",null,{"$f":"SUMIF($A$11:$A$41,E3,$H$11:$H$41)","v":0},{"$f":"+G3+'Miscellaneous 3'!J2+'Miscellaneous 2'!K3+'Miscellaneous 1'!H4","v":0}]
[null,null,null,null,"Investigation Work",null,{"$f":"SUMIF($A$11:$A$41,E4,$H$11:$H$41)","v":0},{"$f":"+G4+'Miscellaneous 3'!J3+'Miscellaneous 2'!K4+'Miscellaneous 1'!H5","v":0}]
[{"$f":"IF(SUM(U11:U42)>0,\"MISSING INFORMATION\",\"\")","v":""},null,null,null,"Interim Monitoring Work",null,0,{"$f":"+G5+'Miscellaneous 3'!J4+'Miscellaneous 2'!K5+'Miscellaneous 1'!H6","v":0}]
[null,null,null,null,"Corrective Action Plan Work",null,0,{"$f":"+G6+'Miscellaneous 3'!J5+'Miscellaneous 2'!K6+'Miscellaneous 1'!H7","v":0}]
[null,null,null,null,"Report Preparation Work",null,0,{"$f":"+G7+'Miscellaneous 3'!J6+'Miscellaneous 1'!H8","v":0}]
[]
["Unit pricing for these activities must be utilized.",null,null,null,"* - Cost Control Guidance Document"]
["Costing Category","Unit Price Activities",null,null,null,"RAC\nInvoice\nNo.","Unit Rates","COST",null,null,null,null,null,null,null,null,null,null,null,null,"Test"]
["Corrective Action Plan ",null,null,null,null,null," See page 54 of the \n2022 CCGD* \nfor rate descriptions"]
[null," Date of Work Plan","CAP Category",null,"Budget Amount"]
[null,null,null,null,null,null,null,{"$f":"ROUND(IF(OR(AND(B13>0,C13>0,E13>0),AND(B13>0,C13=Reference!A248)),IF(OR(C13=Reference!$A$252,C13=Reference!$A$254,C13=Reference!$A$255),IF(E13*VLOOKUP(C13,Reference!$A$247:$C$255,2,FALSE)>VLOOKUP(C13,Reference!$A$247:$C$255,3,FALSE),VLOOKUP(C13,Reference!$A$247:$C$255,3,FALSE),E13*VLOOKUP(C13,Reference!$A$247:$C$255,2,FALSE)),VLOOKUP(C13,Reference!$A$247:$C$255,2,FALSE)),0),2)","v":0},null,null,null,null,null,null,null,null,null,null,null,null,{"$f":"IF(C13<>\"\",IF(OR(A13=\"\",B13=\"\",E13=\"\",F13=\"\"),1,0),0)","v":0}]
[null,null,null,null,null,null,null,{"$f":"ROUND(IF(OR(AND(B14>0,C14>0,E14>0),AND(B14>0,C14=Reference!A249)),IF(OR(C14=Reference!$A$252,C14=Reference!$A$254,C14=Reference!$A$255),IF(E14*VLOOKUP(C14,Reference!$A$247:$C$255,2,FALSE)>VLOOKUP(C14,Reference!$A$247:$C$255,3,FALSE),VLOOKUP(C14,Reference!$A$247:$C$255,3,FALSE),E14*VLOOKUP(C14,Reference!$A$247:$C$255,2,FALSE)),VLOOKUP(C14,Reference!$A$247:$C$255,2,FALSE)),0),2)","v":0},null,null,null,null,null,null,null,null,null,null,null,null,{"$f":"IF(C14<>\"\",IF(OR(A14=\"\",B14=\"\",E14=\"\",F14=\"\"),1,0),0)","v":0}]
[null,null,null,null,null,null,null,{"$f":"ROUND(IF(OR(AND(B15>0,C15>0,E15>0),AND(B15>0,C15=Reference!A250)),IF(OR(C15=Reference!$A$252,C15=Reference!$A$254,C15=Reference!$A$255),IF(E15*VLOOKUP(C15,Reference!$A$247:$C$255,2,FALSE)>VLOOKUP(C15,Reference!$A$247:$C$255,3,FALSE),VLOOKUP(C15,Reference!$A$247:$C$255,3,FALSE),E15*VLOOKUP(C15,Reference!$A$247:$C$255,2,FALSE)),VLOOKUP(C15,Reference!$A$247:$C$255,2,FALSE)),0),2)","v":0},null,null,null,null,null,null,null,null,null,null,null,null,{"$f":"IF(C15<>\"\",IF(OR(A15=\"\",B15=\"\",E15=\"\",F15=\"\"),1,0),0)","v":0}]
["Plugging & Abandonment Workplan or Reports",null,null,null,null,null,{"$f":"CONCATENATE(\"$\",Reference!B$261,\".00 per work plan \")","v":"$116.00 per work plan "}]
[null,"Report Type","Description of event",null,"Date of Report"]
[null,null,null,null,null,null,{"$f":"CONCATENATE(\"$\",Reference!B$260,\".00 per report\")","v":"$840.00 per report"},{"$f":"ROUND(IF(AND(B18<>\"\",E18>0),VLOOKUP(B18,Reference!A$260:B$261,2,FALSE),0),2)","v":0},null,null,null,null,null,null,null,null,null,null,null,null,{"$f":"IF(B18<>\"\",IF(OR(A18=\"\",C18=\"\",E18=\"\",F18=\"\"),1,0),0)","v":0}]
[null,null,null,null,null,null,null,{"$f":"ROUND(IF(AND(B19<>\"\",E19>0),VLOOKUP(B19,Reference!A$260:B$261,2,FALSE),0),2)","v":0},null,null,null,null,null,null,null,null,null,null,null,null,{"$f":"IF(B19<>\"\",IF(OR(A19=\"\",C19=\"\",E19=\"\",F19=\"\"),1,0),0)","v":0}]
["Remediation Oversight Group Meeting Preparation and Attendance",null,null,null,null,null,{"$f":"CONCATENATE(\"$\",Reference!B$215,\".00 per activity\")","v":"$786.00 per activity"}]
[null,null,null,"Date of Meeting:",null,null,null,{"$f":"ROUND(IF(E21<>\"\",VLOOKUP(A21,Reference!A$214:B$217,2),0),2)","v":0},null,null,null,null,null,null,null,null,null,null,null,null,{"$f":"IF(E21<>\"\",IF(OR(A21=\"\",F21=\"\"),1,0),0)","v":0}]
["Risk Evaluation/Corrective Action Report",null,null,null,null,null," See page 69 of the \n2022 CCGD*\nfor rate descriptions"]
[null," Description of RECAP Report:",null,null," Date of Report:"]
[null,null,null,null,null,null,null,{"$f":"ROUND(IF(AND(B24<>\"\",E24>0),VLOOKUP(B24,Reference!A$265:B$271,2,FALSE),0),2)","v":0},null,null,null,null,null,null,null,null,null,null,null,null,{"$f":"IF(B24<>\"\",IF(OR(A24=\"\",E24=\"\",F24=\"\"),1,0),0)","v":0}]
[null,null,null,null,null,null,null,{"$f":"ROUND(IF(AND(B25<>\"\",E25>0),VLOOKUP(B25,Reference!A$265:B$271,2,FALSE),0),2)","v":0},null,null,null,null,null,null,null,null,null,null,null,null,{"$f":"IF(B25<>\"\",IF(OR(A25=\"\",E25=\"\",F25=\"\"),1,0),0)","v":0}]
[null,null,null,null,null,null,null,{"$f":"ROUND(IF(AND(B26<>\"\",E26>0),VLOOKUP(B26,Reference!A$265:B$271,2,FALSE),0),2)","v":0},null,null,null,null,null,null,null,null,null,null,null,null,{"$f":"IF(B26<>\"\",IF(OR(A26=\"\",E26=\"\",F26=\"\"),1,0),0)","v":0}]
["Site Investigation and/or Soil Confirmation Workplans/Reports",null,null,null,null,null," See pages 70 and 71 of the \n2022 CCGD* \nfor rate descriptions"]
[null," Date of Report/Workplan:","Report/Workplan Type","Date of Team Leader approval","Budget Value:",null,null,null,null,null,null,null,null,null,null,null,null,"$ calculation"]
[null,null,null,null,null,null,null,{"$f":"ROUND(IF(AND(B29>0,C29<>\"\",E29>0),IF(R29<VLOOKUP(C29,Reference!A$275:D$278,3,FALSE),VLOOKUP(C29,Reference!A$275:D$278,3,FALSE),IF(R29>VLOOKUP(C29,Reference!A$275:D$278,4,FALSE),VLOOKUP(C29,Reference!A$275:D$278,4,FALSE),R29))),2)","v":0},null,null,null,null,null,null,null,null,null,{"$f":"IF(AND(B29>0,C29<>\"\",E29>0),VLOOKUP(C29,Reference!A$275:D$278,2,FALSE)*'Miscellaneous 4'!E29,0)","v":0},null,null,{"$f":"IF(C29<>\"\",IF(OR(A29=\"\",B29=\"\",D29=\"\",E29=\"\",F29=\"\"),1,0),0)","v":0}]
[null,null,null,null,null,null,null,{"$f":"ROUND(IF(AND(B30>0,C30<>\"\",E30>0),IF(R30<VLOOKUP(C30,Reference!A$275:D$278,3,FALSE),VLOOKUP(C30,Reference!A$275:D$278,3,FALSE),IF(R30>VLOOKUP(C30,Reference!A$275:D$278,4,FALSE),VLOOKUP(C30,Reference!A$275:D$278,4,FALSE),R30))),2)","v":0},null,null,null,null,null,null,null,null,null,{"$f":"IF(AND(B30>0,C30<>\"\",E30>0),VLOOKUP(C30,Reference!A$275:D$278,2,FALSE)*'Miscellaneous 4'!E30,0)","v":0},null,null,{"$f":"IF(C30<>\"\",IF(OR(A30=\"\",B30=\"\",D30=\"\",E30=\"\",F30=\"\"),1,0),0)","v":0}]
[null,null,null,null,null,null,null,{"$f":"ROUND(IF(AND(B31>0,C31<>\"\",E31>0),IF(R31<VLOOKUP(C31,Reference!A$275:D$278,3,FALSE),VLOOKUP(C31,Reference!A$275:D$278,3,FALSE),IF(R31>VLOOKUP(C31,Reference!A$275:D$278,4,FALSE),VLOOKUP(C31,Reference!A$275:D$278,4,FALSE),R31))),2)","v":0},null,null,null,null,null,null,null,null,null,{"$f":"IF(AND(B31>0,C31<>\"\",E31>0),VLOOKUP(C31,Reference!A$275:D$278,2,FALSE)*'Miscellaneous 4'!E31,0)","v":0},null,null,{"$f":"IF(C31<>\"\",IF(OR(A31=\"\",B31=\"\",D31=\"\",E31=\"\",F31=\"\"),1,0),0)","v":0}]
[null,null,null,null,null,null,null,{"$f":"ROUND(IF(AND(B32>0,C32<>\"\",E32>0),IF(R32<VLOOKUP(C32,Reference!A$275:D$278,3,FALSE),VLOOKUP(C32,Reference!A$275:D$278,3,FALSE),IF(R32>VLOOKUP(C32,Reference!A$275:D$278,4,FALSE),VLOOKUP(C32,Reference!A$275:D$278,4,FALSE),R32))),2)","v":0},null,null,null,null,null,null,null,null,null,{"$f":"IF(AND(B32>0,C32<>\"\",E32>0),VLOOKUP(C32,Reference!A$275:D$278,2,FALSE)*'Miscellaneous 4'!E32,0)","v":0},null,null,{"$f":"IF(C32<>\"\",IF(OR(A32=\"\",B32=\"\",D32=\"\",E32=\"\",F32=\"\"),1,0),0)","v":0}]
["Corrective Action Plan Construction and Operations Report",null,null,null,null,null,"See page 55 of the \n2022 CCGD*\nfor rate descriptions"]
[null,"Report Type",null,null,"Date of Report"]
[null,null,null,null,null,null,null,{"$f":"ROUND(IF(AND(B35<>\"\",E35>0),VLOOKUP(B35,Reference!A$281:B$284,2,FALSE),0),2)","v":0},null,null,null,null,null,null,null,null,null,null,null,null,{"$f":"IF(B35<>\"\",IF(OR(A35=\"\",E35=\"\",F35=\"\"),1,0),0)","v":0}]
[null,null,null,null,null,null,null,{"$f":"ROUND(IF(AND(B36<>\"\",E36>0),VLOOKUP(B36,Reference!A$281:B$284,2,FALSE),0),2)","v":0},null,null,null,null,null,null,null,null,null,null,null,null,{"$f":"IF(B36<>\"\",IF(OR(A36=\"\",E36=\"\",F36=\"\"),1,0),0)","v":0}]
["Conveyance Notice ","(Copy of conveyance notice for each property is required for payment)",null,null,null,null,{"$f":"CONCATENATE(\"$\",Reference!B$287,\".00 per affected property\")","v":"$1344.00 per affected property"}]
[null,"Number of Affected Properties",null,"Date of Notice",null,null,null,{"$f":"ROUND(IF(AND(C38>0,E38>0),C38*Reference!$B$287,0),2)","v":0},null,null,null,null,null,null,null,null,null,null,null,null,{"$f":"IF(C38>0,IF(OR(F38=\"\",E38=\"\",A38=\"\"),1,0),0)","v":0}]
["Trust Fund Reimbursement for Application Preparation Activity","July – September",{"$f":"+'Part 5'!M$16","v":""},"January – March",{"$f":"+'Part 5'!S$16","v":""},null,{"$f":"CONCATENATE(\"Applications Addressing Field Work: $\",Reference!B291,\".00  Application Addressing Reports Only: $\",Reference!B292,\".00\")","v":"Applications Addressing Field Work: $400.00  Application Addressing Reports Only: $200.00"},null,null,null,null,null,null,null,null,null,null,null,null,null,{"$f":"IF(H41>0,IF(OR(F41=\"\",A41=\"\"),1,0),0)","v":0}]
[null,"October - December",{"$f":"+'Part 5'!M$17","v":""},"April - June",{"$f":"+'Part 5'!S$17","v":""}]
[null," Work the Trust Fund Reimbursement Application Addresses:",null,null,null,null,null,{"$f":"IF(D41<>\"\",VLOOKUP(D41,Reference!A$291:B$292,2,FALSE),0)","v":0}]

{"sheet":"Part 7","index":19,"n_rows":46,"n_cols":26,"rows_kept":46,"cut":false,"hidden":false,"merged":[[45,0,45,21],[42,0,42,7],[42,8,42,10],[42,11,42,15],[42,16,42,21],[44,3,44,9],[44,11,44,16],[44,17,44,21],[38,0,38,21],[39,0,39,21],[40,0,40,1],[40,2,40,9],[40,11,40,14],[40,15,40,21],[37,0,37,21],[31,9,31,11],[31,17,31,20],[32,0,32,5],[32,6,32,21],[34,0,34,8],[34,9,34,11],[34,12,34,16],[34,17,34,20],[35,9,35,11],[35,17,35,20],[28,0,28,6],[28,7,28,21],[24,10,24,15],[30,0,30,8],[30,9,30,11],[30,12,30,16],[30,17,30,20],[21,19,21,21],[25,9,25,21],[24,1,24,9],[25,1,25,8],[27,0,27,21],[11,15,11,19],[23,1,23,8],[23,9,23,11],[23,12,23,18],[23,19,23,21],[19,1,19,10],[19,12,19,15],[22,1,22,8],[22,9,22,11],[22,12,22,18],[22,19,22,21],[19,16,19,21],[20,0,20,21],[21,1,21,8],[21,9,21,11],[21,12,21,18],[16,0,16,19],[17,1,17,21],[18,0,18,21],[16,20,16,21],[0,0,0,21],[1,0,1,21],[4,0,4,3],[4,4,4,21],[6,0,6,6],[6,7,6,21],[8,0,8,21],[9,0,9,21],[10,0,10,21],[11,20,11,21],[11,10,11,13],[11,0,11,6],[12,10,12,13],[12,15,12,18],[12,19,12,20],[14,5,14,21],[15,0,15,7],[15,8,15,21]]}
["PART 7"]
["TREATMENT SYSTEM TRACKING FORM"]
[]
[]
["Name of Current Site:"]
[]
["Agency Interest Number (AIN):"]
[]
["Please provide the following for groundwater or vapor recovery equipment in use at the above listed site for"]
["which reimbursement is being ,or will be, requested."]
[]
["         Purchase",null,null,null,null,null,null,null,null,"Cost",null,null,null,null,null,"Vendor Invoice No. ",null,null,null,null,null,null,null,null,null,"(Invoice attached)"]
["         Rental (DEQ approval only)",null,null,null,null,null,null,null,null,"Monthly Rate",null,null,null,null,null,"Minimum Term:",null,null,null,null,null,"Months"]
[]
["2.      Manufacturer’s Name"]
["3.      Serial Number of Equipment "]
["4.        Prior location of the unit and period of use, if previously used at another site (include AIN)"]
[]
["5.      Brief information on the unit: (Please check appropriate method noted below)"]
[null,null,null,null,null,null,null,null,null,null,null,null,"Description:",null,null,null,null,null,null,null,null,null,null,{"$f":"IF(F15<>\"\",1,0)","v":0}]
["         Major Components and Manufacturer's Recommendations:"]
[null,"Motor Size (quantity and size)",null,null,null,null,null,null,null,null,null,null,"Carbon Filter (yes/no, size)"]
[null,"Pump (quantity and size)",null,null,null,null,null,null,null,null,null,null,"Oil Capacity (in gallons)"]
["   ","Manuf. Recommended.\nOil Change Frequency",null,null,null,null,null,null,null,null,null,null,"Air Stripper (flow rate)"]
[null,"Ozone Output (pounds per day)"]
[null,"Other System Specifications"]
[]
["6.       Period Operated (If original location, please estimate number of months of expected use at the site.)"]
["          Original Location/AIN:"]
[]
["          (Estimated time-frame) From",null,null,null,null,null,null,null,null,null,null,null,"Length of use"]
[null,null,null,null,null,null,null,null,null,"(Installation Date)",null,null,null,null,null,null,null,"(Estimated Time)"]
["           New Location/ AIN:."]
[]
["          (Estimated time-frame) From",null,null,null,null,null,null,null,null,null,null,null,"Length of use"]
[null,null,null,null,null,null,null,null,null,"(Installation Date)",null,null,null,null,null,null,null,"(Estimated Time)"]
[]
["I hereby certify that all of the above information is true and correct to the best of my knowledge and I agree to "]
["notify the Trust Fund Section, in writing, indicating the specific address of the relocation of the treatment"]
["equipment as soon as possible, but prior to relocation of the equipment."]
["RAC Name:",null,null,null,null,null,null,null,null,null,"  ","*Signature: ",null,null,null,{"$f":"IF(OR(CONCATENATE(K12,K13)=\"\",U12=\"\",F15=\"\",I16=\"\",CONCATENATE(J22,J23,J24,T24,T22,T23,K25,H26)=\"\",G33=\"\",J35=\"\",R35=\"\"),\"MISSING INFORMATION\",\"\")","v":"MISSING INFORMATION"}]
[]
["Owner, Operator, or RP Name:",null,null,null,null,null,null,null,null,null,null,"Title of Signatory:"]
[]
["Telefax Number:",null,null,null,null,null,null,null,null,null,null,"Telephone Number:"]
["* Signature is required of Owner, Operator, RP, or RAC (person purchasing unit).  RAC signature is required for rental."]

{"sheet":"Part 8","index":20,"n_rows":57,"n_cols":11,"rows_kept":57,"cut":false,"hidden":false,"merged":[[11,0,13,9],[50,1,50,7],[56,4,56,8],[56,0,56,3],[15,11,25,22],[38,0,38,8],[35,0,35,8],[54,0,54,1],[55,3,55,7],[52,0,52,1],[52,2,52,5],[39,0,39,8],[40,6,40,8],[41,0,41,5],[41,7,41,8],[42,0,42,8],[0,0,0,8],[1,0,1,8],[2,0,2,8],[8,0,10,8],[4,0,6,9],[18,0,21,9],[23,0,26,9],[28,0,30,9],[15,0,16,9],[32,0,33,9],[54,2,54,4],[54,5,54,6],[37,11,38,22],[35,11,35,22],[37,0,37,5],[37,7,37,8],[45,0,45,7],[46,0,46,8],[48,1,48,3],[48,6,48,8],[43,0,43,8],[54,7,54,9]]}
["PART 8"]
["PURCHASE AGREEMENT FORM"]
["(TREATMENT SYSTEMS ONLY)"]
[]
["1.    Treatment systems are defined as dual-phase vacuum extraction systems, ozone sparge systems, soil vapor extraction \n       systems, groundwater pump and treat systems, chemical injection systems, or any other technology or equipment \n       used in the remediation of contaminated underground storage tank sites (hereinafter referred to as “equipment”).  "]
[]
[]
[]
["2.    The Equipment owner is defined as the owner, operator, Responsible Party (RP), or Response Action \n       Contractor (RAC).” (hereinafter referred to as “owner”).   "]
[]
[]
["3.    The owner is responsible for the purchase, delivery, installation, operation, maintenance, troubleshooting, service, and \n       repairs of the equipment as per the manufacturer’s requirements in order to maintain continued, efficient, and effective \n       operation for the duration of corrective action at the site."]
[]
[]
[]
["4.    The owner shall place the equipment as close as possible to the area to be remediated to minimize cost the Motor \n       Fuel Trust Fund."]
[]
[]
["5.    The owner shall not use, operate, alter, or store the equipment improperly, carelessly, nor use or operate the equipment other \n       than in the manner and use for its intended purpose.  Should the equipment become damaged or rendered inoperable by \n       such activities, the owner, at no cost to the Department, shall repair or replace the equipment within sixty (60) days and \n       continue remediation of the site."]
[]
[]
[]
[]
["6.    Should the owner relocate the equipment to another site prior to meeting the site-specific clean-up standards and \n       completing the post remediation monitoring period at the original site, or without approval of the Department, the \n       owner, at no cost to the Department, shall mobilize to the original site the same or comparable equipment within \n       sixty (60) days and continue remediation of the site.  "]
[]
[]
[]
[]
["7.    Upon completion of remediation at the original site and with prior approval from the Department, the owner shall notify \n       the Trust Fund Section (Financial Services Division) of a pending transfer and relocation of the equipment by completing \n       a Treatment System Tracking Form (Part 7).  "]
[]
[]
[]
["8.    In the event of damage to the equipment whether by accident, theft, vandalism, acts of God or third parties, including \n       collision by a motor vehicle, the owner shall be responsible for the repair or replacement of the equipment."]
[]
[]
["I agree to comply with the terms and conditions as stated above."]
[]
[{"$f":"IF(OR(H42=\"\",E57=\"\",G41=\"VALUE DOES NOT MATCH PART 7\",D56=\"SERIAL NUMBER DOES NOT MATCH PART 7\"),\"MISSING INFORMATION\",\"\")","v":"MISSING INFORMATION"}]
["Signature of system purchaser/renter (Owner, Operator, RP, or RAC)                                 Date Signed"]
["    (Circle:  Owner, Operator, RP, or RAC)"]
[null,null,null,null,null,null,{"$f":"IF(AND(H42>0,H42<>'Part 7'!K12),\"VALUE DOES NOT MATCH PART 7\",\"\")","v":""}]
[null,null,null,null,null,null,null,null,null,null,{"$f":"IF(H42>0,1,0)","v":0}]
["Typed or Printed Name of Owner, Operator, RP, or RAC                                                     Cost of Unit"]
["    (Circle:  Owner, Operator, RP, or RAC)"]
[]
[]
["Mailing Address of Owner, Operator, RP, or RAC (above)"]
[]
["Phone No. ",null,null,null,null,"Telefax No. "]
[]
["Site Name:",{"$f":"IF('Part 1'!A20>0,'Part 1'!A20,\"\")","v":""}]
[]
["Agency Interest No. ",null,{"$f":"IF('Part 1'!A22>0,'Part 1'!A22,\"\")","v":""}]
[]
["Type of Equipment:",null,null,null,null,"Decription:"]
[null,null,null,{"$f":"IF(E57='Part 7'!I16,\"\",\"SERIAL NUMBER DOES NOT MATCH PART 7\")","v":""}]
["Equipment Serial Number:"]

{"sheet":"Reference","index":21,"n_rows":318,"n_cols":9,"rows_kept":318,"cut":false,"hidden":true,"merged":[[93,0,93,1],[183,0,183,3],[191,0,191,1],[299,0,299,1],[239,0,239,3],[245,0,245,2],[279,0,279,1],[288,0,288,1],[293,0,293,1],[0,1,0,2],[1,1,1,2],[2,1,2,2],[3,1,3,2],[25,0,26,0],[25,1,25,3]]}
["Costing Categories:","Drilling & P&A Costing category options",null,"Non-impacted and treated soils"]
["Emergency/Initial Work","Emergency/Initial Work",null,"Emergency/Initial Work"]
["Investigation Work","Investigation Work",null,"Corrective Action Plan Work"]
["Interim Monitoring Work","Corrective Action Plan Work"]
["Corrective Action Plan Work"]
["Report Preparation Work"]
[]
["Title","Rate","Max Qty (Hrs)"]
["**PRINCIPAL",146,10]
["*SENIOR TOXICOLOGIST",116,250]
["*SENIOR ENGINEER",116,250]
["*SENIOR GEOLOGIST",116,250]
["*PROJECT MANAGER",116,250]
["ENGINEER",84,250]
["GEOLOGIST",84,250]
["TOXICOLOGIST",84,250]
["*PROJECT COORDINATOR",84,250]
["DRAFTSMAN (Includes CAD equipment)",76,250]
["ENVIRONMENTAL SPECIALIST",76,250]
["FOREMAN",76,250]
["OPERATOR",53,250]
["CLERICAL",41,250]
["LABORER",41,250]
[]
[]
["EQUIPMENT","SHORT-TERM RATE"]
[null,"HOURLY","DAILY","WEEKLY","Error"]
["AIR COMPRESSOR  - 100 cfm to 249 cfm",7.3,58.2,174.7,"NA"]
["AIR COMPRESSOR - 250 cfm to 375 cfm",10.9,87.4,262.10000000000002,"NA"]
["BACKHOE (UP TO 36” BUCKET)",40,320.3,961,"NA"]
["BACKHOE (Including and OVER 36” BUCKET)",51.5,411.6,1234.8,"NA"]
["BOBCAT/SKID STEER LOADER/FRONT-END LOADER w/ BREAKER",26.2,209.7,629,"NA"]
["BULLDOZER",95.4,762.9,2288.8000000000002,"NA"]
["COMBUSTIBLE GAS INDICATOR",4.4000000000000004,34.9,104.8,"NA"]
["COMPACTOR",32.799999999999997,262.10000000000002,786.2,"NA",null,{"$f":"CONCATENATE(\"Applications Addressing Field Work: $\",Reference!B291,\".00      Application Addressing Reports Only: $\")","v":"Applications Addressing Field Work: $400.00      Application Addressing Reports Only: $"}]
["CONCRETE CORE DRILL",7.8,62.9,188.7,"NA"]
["CRANE TRUCK",52.4,419.3,1258,"NA"]
["DATA LOGGER",21.8,174.7,524.20000000000005,"NA"]
["DIGITAL MANOMETER",2.2000000000000002,17.5,52.4,"NA"]
["DISSOLVED OXYGEN METER",3.7,29.1,87.4,"NA"]
["DUMP TRUCK (7-10 YARDS)",34.9,"NA","NA","NA"]
["DUMP TRUCK (11-20 YARDS)",46.6,"NA","NA","NA"]
["DUMP TRUCK (OVER 20 YARDS)",58.2,"NA","NA","NA"]
["ELECTRIC GENERATOR",7.3,58.2,174.7,"NA"]
["EXCAVATORS",87.4,698.9,2096.6,"NA"]
["EXPLOSIMETER *",4.4000000000000004,34.9,104.8,"NA"]
["GAS DETECTOR *",3.7,29.1,87.4,"NA"]
["GOOSENECK TRAILER",14.6,116.5,349.4,"NA"]
["HYDROCARBON ANALYZER (FID, PID, HNU, OVA, TVA, ETC. *",10.9,87.4,262.10000000000002,"NA"]
["JACKHAMMER",4.4000000000000004,34.9,104.8,"NA"]
["LOWBOY TRAILER (INCLUDES TRUCK)",26.2,209.7,629,"NA"]
["OIL/WATER INTERFACE PROBE *",5.0999999999999996,40.799999999999997,122.3,"NA"]
["pH CONDUCTIVITY METER *",3.7,29.1,87.4,"NA"]
["PORTABLE GAS CHROMATOGRAPHY",21.8,174.7,524.20000000000005,"NA"]
["PUMPS (when not used in conjunction with a system)",4.4000000000000004,34.9,104.8,"NA"]
["TEMPERATURE PROBE *",2.2000000000000002,17.5,52.4,"NA"]
["THERMAL ANEMOMETER *",2.2000000000000002,17.5,52.4,"NA"]
["TILLER (HAND)",3.7,29.1,87.4,"NA"]
["TILLER (ROTARY w/ SLIP CLUTCH)",10.9,87.4,262.10000000000002,"NA"]
["TRACKHOE (UP TO & INCLUDING 200 HP)",74.3,594,1782.1,"NA"]
["TRACKHOE (OVER 200 HP)",148.5,1188.0999999999999,3564.3,"NA"]
["TRACTOR WITH TRAILER, FRONT END LOADER & BOX BLADE OR HITCH",37.1,297,891.1,"NA"]
["TRANSDUCER",29.1,233,698.9,"NA"]
["SOIL/WATER HOLDING CONTAINER (Skid or RAC tank)",9.5,75.7,326.10000000000002,"NA"]
["VACUUM TRUCK(Bobtail) – 39 HP and below",99,792.1,2376.1999999999998,"NA"]
["VACUUM TRUCK – 40 HP to 150 HP",128.1,1025,3075.1,"NA"]
["VACUUM TRUCK -  over 150 HP",179.1,1432.7,4298.1000000000004,"NA"]
["WATER LEVEL INDICATOR *",2.2000000000000002,17.5,52.4,"NA"]
["PURCHASE - TREATMENT UNIT",0,0,0,"NA"]
["RENTAL - TREATMENT UNIT",0,0,0,"NA"]
["Other - Not listed (describe in Activity Description section) ",0,0,0,"NA"]
[]
[]
["Mileage Unit Rate",2.2400000000000002]
[]
["Travel Activity Type"]
["Well Groundwater Sampling"]
["Free Product Recovery (Handbail of Wells)"]
["Free Product Recovery (VAC event)"]
["Well Gauging "]
["Treatment Unit, O&M"]
["Discharge Sampling"]
["Drilling, P/A Wells, Geoprobe"]
["Excavation"]
["System Installation"]
["Major Renovation"]
["Major Repair"]
["Soil Treatment"]
["Site Investigation"]
["Soil Confirmation Sampling"]
["Multiple Site Visits"]
["Other or Non-Unit Price Activity "]
[]
["Drilling - P&A - Type of Activity"]
["Chemical Injection"]
["Boring - Direct Push",1]
["Boring - Drilling",2]
["Monitoring Well",3]
["Extraction Well"]
["Hornizontal Recovery Well"]
["Recovery Well"]
["Sparge Well"]
["Temporary Well"]
[]
["Well Description","Well diameter (inches)","Sampled (Yes/No)","Manhole cover","Rate ($/ft)","Estimated Well Auger Size (inches) ","Overdrill & Grout (P&A-1)","Pull Casing & Grout (P&A-2)","Grout only (P&A-3)"]
["Direct Push, 2 inch, sampled",2,"Yes",0,71,2.5,0,0,0]
["Direct Push, 2 inch, non-sampled",2,"No",0,{"$f":"71-15","v":56},2.5,0,0,0]
["Boring, 2 inch, sampled",2,"Yes",0,71,8.25,0,0,0]
["Boring, 2 inch, non-sampled",2,"No",0,56,8.25,0,0,0]
["Boring, 4 inch, sampled",4,"Yes",0,77,10.25,0,0,0]
["Boring, 4 inch, non-sampled",4,"No",0,{"$f":"77-15","v":62},10.25,0,0,0]
["Monitor well, 2 inch, sampled",2,"Yes",1,101,8.25,72.2,58.8,32.5]
["Monitor well, 2 inch, non-sampled",2,"No",1,{"$f":"101-15","v":86},8.25,72.2,58.8,32.5]
["Monitor/Recovery well, 4 inch, sampled",4,"Yes",1,123,10.25,98,61,39.200000000000003]
["Monitor/Recovery well, 4 inch, non-sampled",4,"No",1,{"$f":"123-15","v":108},10.25,98,61,39.200000000000003]
["Horizontal Recovery well, 4 inch, non-sampled",4,"No",1,146,10.25,105.3,78.400000000000006,39.200000000000003]
["Ozone Injection well, 2 inch or less",2,"No",1,74,8.25,72.2,58.8,32.5]
[]
["Direct Push or Drilling Activity Type","Minimum rates ($/day)"]
["DRILLING",3914]
["DIRECT PUSH ",3136]
["CHEMICAL INJECTION",4659]
["P&A",1960]
[]
[]
["Parameter","Cost per sample","Method"]
["Atterberg Limits (LL, PLI, PI)",56,"ASTM D4318"]
["BTEX",55,"(8021B, 602,603) "]
["BTEX/MTBE",84,"8260B"]
["BTEX/TPH-G",70,"8021B/8015"]
["Dry Density-Calculated/Unit Wt Determination",22.5,"NA"]
["EPH Analysis",160,"MA DEP"]
["Hydraulic Conductivity - Constant Head",168,"ASTM D2434"]
["Hydraulic Conductivity - Falling Head",313.5,"ASTM D5084"]
["Lead",27,"6010B or 200.7"]
["Moisture Content",8,"ASTM D2216"]
["Moisture Content/Volumetric Content",8,"ASTM D2216"]
["MTBE",84,"8260B"]
["Organic matter",45,"ASTM D2974"]
["Organic Matter/Fractional Organic Carbon",45,"ASTM D2974"]
["PAH - 8270",200,8270]
["PAH - 8310",135,8310]
["Particle Size Analysis – Hydrometer",106.5,"ASTM 422"]
["Particle Size Analysis – Sieve",56,"ASTM 422"]
["RCRA Metals",135,6010]
["Soil pH",28,"ASTM D4972"]
["Specific Gravity",100,"ASTM D854"]
["SPLP Analysis",40,1312]
["TCLP",40,1311]
["TOC",30,"415.1 or 415.2"]
["Total Porosity - Calculated",62]
["TPH-D (RECAP DRO)",65,8015]
["TPH-G (RECAP GRO)",45,8015]
["TPH-O",65,8015]
["Triaxial Permeability - Falling Head",313.5,"ASTM D5084"]
["Unified Soil Classification System",45,"ASTM D2487"]
["VPH Analysis (TPH-G Fractions)",135,"MA DEP"]
["Combination - BTEX/MTBE, VPH Analysis (TPH-G Fractions)",219,"8260B, MA DEP"]
["Combination - BTEX, VPH Analysis (TPH-G Fractions)",190,"(8021B, 602,603) , MA DEP"]
["Combination - MTBE, VPH Analysis (TPH-G Fractions)",219,"8260B, MA DEP"]
["Combination - BTEX, Lead, VPH Analysis (TPH-G Fractions)",217,"(8021B, 602,603) , 6010B or 200.7, MA DEP"]
["Combination - BTEX/MTBE, Lead, VPH Analysis (TPH-G Fractions)",246,"8260B, 6010B or 200.7, MA DEP"]
["Combination - BTEX, TOC, Lead",112,"(8021B, 602,603) , 415.1 or 415.2, 6010B or 200.7"]
["Combination - EPH Analysis, PAH - 8310",295,"MA DEP, 8310"]
["Combination - EPH Analysis, PAH - 8310, RCRA Metals",430,"MA DEP, 8310, 6010"]
["Combination - SPLP Analysis, VPH Analysis (TPH-G Fractions)",175,"1312, MA DEP"]
["Combination - SPLP Analysis, EPH Analysis",200,"1312, MA DEP"]
["RAC Analysis Markup",0,"NA"]
["Lab Rush Charges",0,"NA"]
[]
["Aquifer Test","Cost"]
["1st well",1250]
["Subsequent wells",350]
[]
["Activity Description","Initial","Other"]
["Groundwater Sampling",655,204]
["Free Product recovery",198,65]
["Gauging wells",25,25]
["Discharge Sampling Event",263]
["Mob/Demob",320]
["Obtaining offsite access",459]
[]
[]
["Bid Package Prep"]
[null,"$0.00 - $1,999.99","$2,000.00 - $9,999.99","$10,000.00 and greater","NA"]
["Work Value Based",0,132,336]
["Treatment System Purchase",655]
["Chemical Injection Events",655]
["Used Treatment System Sale",0]
["Treatment System Installation",1960]
[]
["LDEQ Permits"]
["Air Exemption",1574]
["Air Permit (Small Source)",5242]
["LPDES Water",1960]
[]
["Groundwater Monitoring Reports"]
["Type","Treatment (Yes/No)","Initial/ Subsequent","Concatenate","Cost"]
["Annual","Yes","Initial",{"$f":"CONCATENATE(A199,B199,C199)","v":"AnnualYesInitial"},3590]
["Annual","Yes","Subsequent","AnnualYesSubsequent",3265]
["Annual","No","Initial","AnnualNoInitial",2285]
["Annual","No","Subsequent","AnnualNoSubsequent",1960]
["Semi-annual","Yes","Initial","Semi-annualYesInitial",3590]
["Semi-annual","Yes","Subsequent","Semi-annualYesSubsequent",3265]
["Semi-annual","No","Initial","Semi-annualNoInitial",2285]
["Semi-annual","No","Subsequent","Semi-annualNoSubsequent",1960]
["Quarterly","Yes","Initial","QuarterlyYesInitial",3265]
["Quarterly","Yes","Subsequent","QuarterlyYesSubsequent",2934]
["Quarterly","No","Initial","QuarterlyNoInitial",1960]
["Quarterly","No","Subsequent","QuarterlyNoSubsequent",1630]
[]
["Generic Reports"]
["Report type","Cost"]
["System Design and Planning",5242]
["Remediation Oversight Group Meeting Preparation and Attendance",786]
[]
[]
[]
["O&M rates"]
["Status","Unit Type","Frequency","Concatenate","Rates"]
["Active","Type 1","Weekly","Active, Type 1, Weekly",420]
["Active","Type 1","Biweekly","Active, Type 1, Biweekly",840]
["Active","Type 2","Weekly","Active, Type 2, Weekly",258]
["Active","Type 2","Biweekly","Active, Type 2, Biweekly",515]
["Active","Type 3","Weekly","Active, Type 3, Weekly",280]
["Active","Type 3","Biweekly","Active, Type 3, Biweekly",560]
["Post","Type 1","Monthly","Post, Type 1, Monthly",420]
["Post","Type 1","Quarterly","Post, Type 1, Quarterly",700]
["Post","Type 2","Monthly","Post, Type 2, Monthly",258]
["Post","Type 2","Quarterly","Post, Type 2, Quarterly",431]
["Post","Type 3","Monthly","Post, Type 3, Monthly",280]
["Post","Type 3","Quarterly","Post, Type 3, Quarterly",465]
[]
["Additional O&M unit rates","Rate"]
["Additional Treatment unit add-on",224]
["Oil Change(40 HP or less)",3136]
["Oil Change(> 40 HP)",560]
["Stripperator Cleaning",1008]
[]
["Vacuum Event Reporting"]
["Description","First Event","Additional Events","Planning cost"]
["Free Product Recovery Only",641,116,96]
["Free Product Recovery and Vapor Calc.",1680,560,280]
["Vacuum Extraction Pilot Test Report",3261,392,336]
[]
["Corrective Action Plan"]
["Type","Rate","Max"]
["Category 1 - Complete CAP",8200]
["Category 1 - Scoping Meeting",3280]
["Category 1 - ROG Approval",4920]
["Category 2",3000]
["Category 3",0.1,4480]
["Category 4",750]
["Category 5",0.05,2240]
["Category 6",0.05,1120]
["Prior to Category types"]
[]
["P&A reports"]
["Type","Rate"]
["P & A Report",840]
["P&A Work Plan",116]
[]
["RECAP reports"]
["Type","Rate"]
["Appendix I Only for Gas, Diesel or Oil",8200]
["Appendix I addon for combination of Gas, Diesel, or Motor Oil",582]
["Appendix I addon for sites with >20 borings",582]
["MO-1 RECAP",3920]
["Response to Team Leader/ROG requested revisions",800]
["RECAP Input Parameters Form",800]
["Addon per Enclosed structure",582]
[]
["Site Investigation or Soil Confirmation reports"]
["Type","Rate","Mininum","Maximum"]
["Site Investigation Workplan",0.04,582,1120]
["Soil Confirmation Workplan",0.04,582,1120]
["Site Investigation Report",0.17,0,11200]
["Soil Confirmation Report",0.17,0,11200]
[]
["Construction and Operations Report"]
["With System Installation (Dual/Single Phase Extractions, Ozone, etc.)",2061]
["Without System Installation (e.g Chemical Injection, etc)",874]
["Excavations greater than or equal to 675 tons ",3360]
["Excavations less than 675 tons",2016]
[]
["Conveyance Notice"]
["Notice per affected property",1344]
[]
["Trust Fund Application options"]
["Type","Rate"]
["Both field activities and reporting charges",400]
["Reporting charges only",200]
[]
["Drum disposal"]
["Type","Rate"]
["1st drum",260]
["Additional drums",195]
["Minimum",650]
[]
["Discharge Reports"]
["Type","Rate"]
["Discharge report with discharge",250]
["Discharge report without discharge",87]
[]
["Reviewer List"]
["Madalyn Marcel"]
["Meagan Arnold"]
["Kacie Stringer"]
["Randi Stump"]
["Danielle McCarty"]
["Tonjia Scott"]
[]
["Part 7 Dropdown"]
["Dual Phase Vacumm Extraction"]
["Ozone"]
["SVE"]
["Groundwater Pump & Treat"]
["Other"]

{"sheet":"ExcData","index":22,"n_rows":5019,"n_cols":8,"rows_kept":5019,"cut":false,"hidden":true,"merged":[[1,0,1,5],[7,0,7,2]]}
[]
["TONNAGE 1 - 99"]
[]
["Minimum Price",null,null,null,null,9900.7999999999993]
["Price / Ton (1 - 99 tons)",null,null,null,null,116.48]
[]
[null,null,null,null,"VARIABLE"]
["Tonnage Ranges",null,null,"Range Amounts","Price / Ton","Increments"]
[100,"-",250,{"$f":"C9-A9","v":150},215.49,{"$f":"(E9-E10)/D9","v":0.2873333333333335}]
[251,"-",500,{"$f":"C10-C9","v":250},172.39,{"$f":"(E10-E11)/D10","v":0.12111999999999989},null,{"$f":"E9-E10","v":43.100000000000023}]
[501,"-",1000,{"$f":"C11-C10","v":500},142.11000000000001,{"$f":"(E11-E12)/D11","v":5.1260000000000021E-2},null,{"$f":"E10-E11","v":30.279999999999973}]
[1001,"-",2000,{"$f":"C12-C11","v":1000},116.48,{"$f":"(E12-E13)/D12","v":1.1650000000000006E-2},null,{"$f":"E11-E12","v":25.63000000000001}]
[2001,"<",null,null,104.83,null,null,{"$f":"E12-E13","v":11.650000000000006}]
[]
[]
[]
[null,null,null,"TONS","PRICE / TON","TOTAL"]
[null,null,null,1,{"$f":"F18/D18","v":10017.279999999999},{"$f":"+$F$4+($F$5*D18)","v":10017.279999999999}]
[null,null,null,2,5066.8799999999992,10133.759999999998]
[null,null,null,3,3416.7466666666664,10250.24]
[null,null,null,4,2591.6799999999998,10366.719999999999]
[null,null,null,5,2096.64,10483.199999999999]
[null,null,null,6,1766.613333333333,10599.679999999998]
[null,null,null,7,1530.8799999999999,10716.16]
[null,null,null,8,1354.08,10832.64]
[null,null,null,9,1216.5688888888888,10949.119999999999]
[null,null,null,10,1106.56,11065.599999999999]
[null,null,null,11,1016.5527272727272,11182.08]
[null,null,null,12,941.54666666666662,11298.56]
[null,null,null,13,878.07999999999993,11415.039999999999]
[null,null,null,14,823.68,11531.519999999999]
[null,null,null,15,776.5333333333333,11648]
[null,null,null,16,735.28,11764.48]
[null,null,null,17,698.88,11880.96]
[null,null,null,18,666.52444444444438,11997.439999999999]
[null,null,null,19,637.57473684210515,12113.919999999998]
[null,null,null,20,611.52,12230.4]
[null,null,null,21,587.9466666666666,12346.88]
[null,null,null,22,566.51636363636362,12463.359999999999]
[null,null,null,23,546.9495652173913,12579.84]
[null,null,null,24,529.01333333333332,12696.32]
[null,null,null,25,512.51199999999994,12812.8]
[null,null,null,26,497.28,12929.279999999999]
[null,null,null,27,483.17629629629624,13045.759999999998]
[null,null,null,28,470.08,13162.24]
[null,null,null,29,457.88689655172413,13278.72]
[null,null,null,30,446.5066666666666,13395.199999999999]
[null,null,null,31,435.86064516129034,13511.68]
[null,null,null,32,425.88,13628.16]
[null,null,null,33,416.50424242424242,13744.64]
[null,null,null,34,407.67999999999995,13861.119999999999]
[null,null,null,35,399.35999999999996,13977.599999999999]
[null,null,null,36,391.50222222222214,14094.079999999998]
[null,null,null,37,384.06918918918916,14210.56]
[null,null,null,38,377.02736842105259,14327.039999999999]
[null,null,null,39,370.34666666666669,14443.52]
[null,null,null,40,364,14560]
[null,null,null,41,357.96292682926827,14676.48]
[null,null,null,42,352.21333333333331,14792.96]
[null,null,null,43,346.73116279069762,14909.439999999999]
[null,null,null,44,341.49818181818176,15025.919999999998]
[null,null,null,45,336.49777777777774,15142.4]
[null,null,null,46,331.71478260869566,15258.88]
[null,null,null,47,327.13531914893616,15375.36]
[null,null,null,48,322.74666666666667,15491.84]
[null,null,null,49,318.53714285714284,15608.32]
[null,null,null,50,314.49599999999998,15724.8]
[null,null,null,51,310.61333333333329,15841.279999999999]
[null,null,null,52,306.88,15957.759999999998]
[null,null,null,53,303.28754716981132,16074.24]
[null,null,null,54,299.82814814814816,16190.72]
[null,null,null,55,296.49454545454546,16307.2]
[null,null,null,56,293.28000000000003,16423.68]
[null,null,null,57,290.17824561403506,16540.16]
[null,null,null,58,287.18344827586208,16656.64]
[null,null,null,59,284.29016949152543,16773.12]
[null,null,null,60,281.49333333333328,16889.599999999999]
[null,null,null,61,278.78819672131152,17006.080000000002]
[null,null,null,62,276.17032258064512,17122.559999999998]
[null,null,null,63,273.63555555555558,17239.04]
[null,null,null,64,271.18,17355.52]
[null,null,null,65,{"$f":"F82/D82","v":268.8},{"$f":"+$F$4+($F$5*D82)","v":17472}]
[null,null,null,66,266.49212121212122,17588.48]
[null,null,null,67,264.25313432835821,17704.96]
[null,null,null,68,262.08,17821.439999999999]
[null,null,null,69,259.96985507246376,17937.919999999998]
[null,null,null,70,257.92,18054.400000000001]
[null,null,null,71,255.92788732394362,18170.879999999997]
[null,null,null,72,253.99111111111111,18287.36]
[null,null,null,73,252.10739726027398,18403.84]
[null,null,null,74,250.27459459459459,18520.32]
[null,null,null,75,248.49066666666667,18636.8]
[null,null,null,76,246.7536842105263,18753.28]
[null,null,null,77,245.06181818181821,18869.760000000002]
[null,null,null,78,243.4133333333333,18986.239999999998]
[null,null,null,79,241.80658227848102,19102.72]
[null,null,null,80,240.23999999999995,19219.199999999997]
[null,null,null,81,238.7120987654321,19335.68]
[null,null,null,82,237.22146341463414,19452.16]
[null,null,null,83,235.76674698795179,19568.64]
[null,null,null,84,234.34666666666666,19685.12]
[null,null,null,85,232.95999999999998,19801.599999999999]
[null,null,null,86,231.60558139534885,19918.080000000002]
[null,null,null,87,230.28229885057468,20034.559999999998]
[null,null,null,88,228.98909090909092,20151.04]
[null,null,null,89,227.72494382022472,20267.52]
[null,null,null,90,226.48888888888888,20384]
[null,null,null,91,225.28,20500.48]
[null,null,null,92,224.09739130434781,20616.96]
[null,null,null,93,222.94021505376347,20733.440000000002]
[null,null,null,94,221.80765957446806,20849.919999999998]
[null,null,null,95,220.69894736842107,20966.400000000001]
[null,null,null,96,219.61333333333332,21082.879999999997]
[null,null,null,97,218.5501030927835,21199.360000000001]
[null,null,null,98,217.50857142857143,21315.84]
[null,null,null,99,216.48808080808081,21432.32]
[null,null,null,100,{"$f":"E9","v":215.49},{"$f":"E117*D117","v":21549}]
[null,null,null,101,{"$f":"E117-$F$9","v":215.20266666666669},21735.469333333334]
[null,null,null,102,214.91533333333336,21921.364000000001]
[null,null,null,103,214.62800000000004,22106.684000000005]
[null,null,null,104,214.34066666666672,22291.429333333341]
[null,null,null,105,214.0533333333334,22475.600000000006]
[null,null,null,106,213.76600000000008,22659.196000000007]
[null,null,null,107,213.47866666666675,22842.217333333341]
[null,null,null,108,213.19133333333343,23024.664000000012]
[null,null,null,109,212.90400000000011,23206.536000000011]
[null,null,null,110,212.61666666666679,23387.833333333347]
[null,null,null,111,212.32933333333347,23568.556000000015]
[null,null,null,112,212.04200000000014,23748.704000000016]
[null,null,null,113,211.75466666666682,23928.27733333335]
[null,null,null,114,211.4673333333335,24107.27600000002]
[null,null,null,115,211.18000000000018,24285.700000000019]
[null,null,null,116,210.89266666666686,24463.549333333354]
[null,null,null,117,210.60533333333353,24640.824000000022]
[null,null,null,118,210.31800000000021,24817.524000000027]
[null,null,null,119,210.03066666666689,24993.64933333336]
[null,null,null,120,209.74333333333357,25169.200000000026]
[null,null,null,121,209.45600000000024,25344.176000000029]
[null,null,null,122,209.16866666666692,25518.577333333364]
[null,null,null,123,208.8813333333336,25692.404000000031]
[null,null,null,124,208.59400000000028,25865.656000000035]
[null,null,null,125,208.30666666666696,26038.333333333369]
[null,null,null,126,208.01933333333363,26210.436000000038]
[null,null,null,127,207.73200000000031,26381.96400000004]
[null,null,null,128,207.44466666666699,26552.917333333375]
[null,null,null,129,207.15733333333367,26723.296000000042]
[null,null,null,130,206.87000000000035,26893.100000000046]
[null,null,null,131,206.58266666666702,27062.329333333379]
[null,null,null,132,206.2953333333337,27230.984000000048]
[null,null,null,133,206.00800000000038,27399.064000000049]
[null,null,null,134,205.72066666666706,27566.569333333384]
[null,null,null,135,205.43333333333374,27733.500000000055]
[null,null,null,136,205.14600000000041,27899.856000000058]
[null,null,null,137,204.85866666666709,28065.63733333339]
[null,null,null,138,204.57133333333377,28230.844000000059]
[null,null,null,139,204.28400000000045,28395.476000000061]
[null,null,null,140,203.99666666666712,28559.533333333398]
[null,null,null,141,203.7093333333338,28723.016000000065]
[null,null,null,142,203.42200000000048,28885.924000000068]
[null,null,null,143,203.13466666666716,29048.257333333404]
[null,null,null,144,202.84733333333384,29210.016000000072]
[null,null,null,145,202.56000000000051,29371.200000000073]
[null,null,null,146,202.27266666666719,29531.809333333411]
[null,null,null,147,201.98533333333387,29691.844000000077]
[null,null,null,148,201.69800000000055,29851.30400000008]
[null,null,null,149,201.41066666666723,30010.189333333416]
[null,null,null,150,201.1233333333339,30168.500000000087]
[null,null,null,151,200.83600000000058,30326.236000000088]
[null,null,null,152,200.54866666666726,30483.397333333422]
[null,null,null,153,200.26133333333394,30639.984000000091]
[null,null,null,154,199.97400000000061,30795.996000000094]
[null,null,null,155,199.68666666666729,30951.433333333429]
[null,null,null,156,199.39933333333397,31106.2960000001]
[null,null,null,157,199.11200000000065,31260.584000000101]
[null,null,null,158,198.82466666666733,31414.297333333438]
[null,null,null,159,198.537333333334,31567.436000000107]
[null,null,null,160,198.25000000000068,31720.000000000109]
[null,null,null,161,197.96266666666736,31871.989333333444]
[null,null,null,162,197.67533333333404,32023.404000000115]
[null,null,null,163,197.38800000000072,32174.244000000115]
[null,null,null,164,197.10066666666739,{"$f":"E181*D181","v":32324.509333333452}]
[null,null,null,165,{"$f":"E181-$F$9","v":196.81333333333407},32474.200000000121]
[null,null,null,166,196.52600000000075,32623.316000000123]
[null,null,null,167,196.23866666666743,32771.857333333457]
[null,null,null,168,195.95133333333411,32919.824000000131]
[null,null,null,169,195.66400000000078,33067.216000000131]
[null,null,null,170,195.37666666666746,33214.033333333471]
[null,null,null,171,195.08933333333414,33360.276000000136]
[null,null,null,172,194.80200000000082,33505.944000000141]
[null,null,null,173,194.51466666666749,33651.037333333479]
[null,null,null,174,194.22733333333417,33795.556000000142]
[null,null,null,175,193.94000000000085,33939.500000000146]
[null,null,null,176,193.65266666666753,34082.869333333481]
[null,null,null,177,193.36533333333421,34225.664000000157]
[null,null,null,178,193.07800000000088,34367.884000000158]
[null,null,null,179,192.79066666666756,34509.529333333492]
[null,null,null,180,192.50333333333424,34650.600000000166]
[null,null,null,181,192.21600000000092,34791.096000000165]
[null,null,null,182,191.9286666666676,34931.017333333504]
[null,null,null,183,191.64133333333427,35070.364000000169]
[null,null,null,184,191.35400000000095,35209.136000000173]
[null,null,null,185,191.06666666666763,35347.33333333351]
[null,null,null,186,190.77933333333431,35484.95600000018]
[null,null,null,187,190.49200000000098,35622.004000000183]
[null,null,null,188,190.20466666666766,35758.477333333518]
[null,null,null,189,189.91733333333434,35894.376000000193]
[null,null,null,190,189.63000000000102,36029.700000000194]
[null,null,null,191,189.3426666666677,36164.449333333527]
[null,null,null,192,189.05533333333437,36298.6240000002]
[null,null,null,193,188.76800000000105,36432.224000000206]
[null,null,null,194,188.48066666666773,36565.249333333537]
[null,null,null,195,188.19333333333441,36697.700000000208]
[null,null,null,196,187.90600000000109,36829.576000000212]
[null,null,null,197,187.61866666666776,36960.877333333548]
[null,null,null,198,187.33133333333444,37091.604000000218]
[null,null,null,199,187.04400000000112,37221.75600000022]
[null,null,null,200,186.7566666666678,37351.333333333561]
[null,null,null,201,186.46933333333448,37480.336000000229]
[null,null,null,202,186.18200000000115,37608.764000000236]
[null,null,null,203,185.89466666666783,37736.617333333568]
[null,null,null,204,185.60733333333451,37863.896000000241]
[null,null,null,205,185.32000000000119,37990.600000000246]
[null,null,null,206,185.03266666666786,38116.729333333584]
[null,null,null,207,184.74533333333454,38242.284000000247]
[null,null,null,208,184.45800000000122,38367.264000000258]
[null,null,null,209,184.1706666666679,38491.669333333593]
[null,null,null,210,183.88333333333458,38615.500000000262]
[null,null,null,211,183.59600000000125,38738.756000000263]
[null,null,null,212,183.30866666666793,38861.437333333604]
[null,null,null,213,183.02133333333461,38983.544000000271]
[null,null,null,214,182.73400000000129,39105.076000000277]
[null,null,null,215,182.44666666666797,39226.033333333609]
[null,null,null,216,182.15933333333464,39346.416000000281]
[null,null,null,217,181.87200000000132,39466.224000000286]
[null,null,null,218,181.584666666668,39585.457333333623]
[null,null,null,219,181.29733333333468,39704.116000000293]
[null,null,null,220,181.01000000000136,39822.200000000295]
[null,null,null,221,180.72266666666803,39939.709333333638]
[null,null,null,222,180.43533333333471,40056.644000000306]
[null,null,null,223,180.14800000000139,40173.004000000306]
[null,null,null,224,179.86066666666807,40288.789333333647]
[null,null,null,225,179.57333333333474,40404.00000000032]
[null,null,null,226,179.28600000000142,40518.636000000319]
[null,null,null,227,178.9986666666681,40632.697333333657]
[null,null,null,228,178.71133333333478,{"$f":"E245*D245","v":40746.184000000329}]
[null,null,null,229,{"$f":"E245-$F$9","v":178.42400000000146},40859.096000000332]
[null,null,null,230,178.13666666666813,40971.433333333669]
[null,null,null,231,177.84933333333481,41083.196000000338]
[null,null,null,232,177.56200000000149,41194.384000000347]
[null,null,null,233,177.27466666666817,41304.997333333682]
[null,null,null,234,176.98733333333485,41415.036000000357]
[null,null,null,235,176.70000000000152,41524.500000000357]
[null,null,null,236,176.4126666666682,41633.389333333696]
[null,null,null,237,176.12533333333488,41741.704000000369]
[null,null,null,238,175.83800000000156,41849.444000000367]
[null,null,null,239,175.55066666666823,41956.609333333705]
[null,null,null,240,175.26333333333491,42063.200000000375]
[null,null,null,241,174.97600000000159,42169.216000000386]
[null,null,null,242,174.68866666666827,42274.657333333722]
[null,null,null,243,174.40133333333495,42379.524000000391]
[null,null,null,244,174.11400000000162,42483.816000000399]
[null,null,null,245,173.8266666666683,42587.533333333733]
[null,null,null,246,173.53933333333498,42690.676000000407]
[null,null,null,247,173.25200000000166,42793.244000000406]
[null,null,null,248,172.96466666666834,42895.237333333745]
[null,null,null,249,172.67733333333501,42996.656000000417]
[null,null,null,250,172.39000000000169,43097.500000000422]
[null,null,null,251,{"$f":"E267-$F$10","v":172.2688800000017},43239.488880000426]
[null,null,null,252,172.14776000000171,43381.235520000431]
[null,null,null,253,172.02664000000172,43522.739920000437]
[null,null,null,254,171.90552000000173,43664.002080000442]
[null,null,null,255,171.78440000000174,43805.022000000441]
[null,null,null,256,171.66328000000175,43945.799680000448]
[null,null,null,257,171.54216000000176,44086.335120000454]
[null,null,null,258,171.42104000000177,44226.628320000455]
[null,null,null,259,171.29992000000178,44366.679280000462]
[null,null,null,260,171.17880000000179,44506.488000000463]
[null,null,null,261,171.0576800000018,44646.054480000472]
[null,null,null,262,170.9365600000018,44785.378720000474]
[null,null,null,263,170.81544000000181,44924.460720000476]
[null,null,null,264,170.69432000000182,45063.300480000478]
[null,null,null,265,170.57320000000183,45201.898000000489]
[null,null,null,266,170.45208000000184,45340.253280000492]
[null,null,null,267,170.33096000000185,45478.366320000496]
[null,null,null,268,170.20984000000186,45616.2371200005]
[null,null,null,269,170.08872000000187,45753.865680000505]
[null,null,null,270,169.96760000000188,45891.25200000051]
[null,null,null,271,169.84648000000189,46028.396080000515]
[null,null,null,272,169.7253600000019,46165.297920000514]
[null,null,null,273,169.60424000000191,46301.95752000052]
[null,null,null,274,169.48312000000192,46438.374880000527]
[null,null,null,275,169.36200000000193,46574.550000000527]
[null,null,null,276,169.24088000000194,46710.482880000534]
[null,null,null,277,169.11976000000195,46846.173520000542]
[null,null,null,278,168.99864000000196,46981.621920000543]
[null,null,null,279,168.87752000000197,47116.828080000545]
[null,null,null,280,168.75640000000197,47251.792000000554]
[null,null,null,281,168.63528000000198,47386.513680000557]
[null,null,null,282,168.51416000000199,47520.993120000559]
[null,null,null,283,168.393040000002,47655.23032000057]
[null,null,null,284,168.27192000000201,47789.225280000574]
[null,null,null,285,168.15080000000202,47922.978000000578]
[null,null,null,286,168.02968000000203,48056.488480000582]
[null,null,null,287,167.90856000000204,48189.756720000587]
[null,null,null,288,167.78744000000205,48322.782720000592]
[null,null,null,289,167.66632000000206,48455.566480000598]
[null,null,null,290,167.54520000000207,48588.108000000597]
[null,null,null,291,167.42408000000208,48720.407280000603]
[null,null,null,292,167.30296000000209,{"$f":"E309*D309","v":48852.46432000061}]
[null,null,null,293,167.1818400000021,48984.279120000618]
[null,null,null,294,167.06072000000211,49115.851680000618]
[null,null,null,295,166.93960000000212,49247.182000000626]
[null,null,null,296,166.81848000000213,49378.270080000628]
[null,null,null,297,166.69736000000213,49509.115920000637]
[null,null,null,298,166.57624000000214,49639.719520000639]
[null,null,null,299,166.45512000000215,49770.080880000642]
[null,null,null,300,166.33400000000216,49900.200000000652]
[null,null,null,301,166.21288000000217,50030.076880000655]
[null,null,null,302,166.09176000000218,50159.711520000659]
[null,null,null,303,165.97064000000219,50289.103920000663]
[null,null,null,304,165.8495200000022,50418.254080000668]
[null,null,null,305,165.72840000000221,50547.162000000673]
[null,null,null,306,165.60728000000222,50675.827680000679]
[null,null,null,307,165.48616000000223,50804.251120000685]
[null,null,null,308,165.36504000000224,50932.432320000691]
[null,null,null,309,165.24392000000225,51060.371280000698]
[null,null,null,310,165.12280000000226,51188.068000000698]
[null,null,null,311,165.00168000000227,51315.522480000705]
[null,null,null,312,164.88056000000228,51442.734720000713]
[null,null,null,313,164.75944000000229,51569.704720000715]
[null,null,null,314,164.6383200000023,51696.432480000723]
[null,null,null,315,{"$f":"E331-$F$10","v":164.5172000000023},51822.918000000725]
[null,null,null,316,164.39608000000231,51949.161280000728]
[null,null,null,317,164.27496000000232,52075.162320000738]
[null,null,null,318,164.15384000000233,52200.921120000741]
[null,null,null,319,164.03272000000234,52326.437680000745]
[null,null,null,320,163.91160000000235,52451.712000000756]
[null,null,null,321,163.79048000000236,52576.744080000761]
[null,null,null,322,163.66936000000237,52701.533920000766]
[null,null,null,323,163.54824000000238,52826.081520000771]
[null,null,null,324,163.42712000000239,52950.386880000777]
[null,null,null,325,163.3060000000024,53074.450000000783]
[null,null,null,326,163.18488000000241,53198.270880000782]
[null,null,null,327,163.06376000000242,53321.849520000789]
[null,null,null,328,162.94264000000243,53445.185920000797]
[null,null,null,329,162.82152000000244,53568.280080000804]
[null,null,null,330,162.70040000000245,53691.132000000805]
[null,null,null,331,162.57928000000246,53813.741680000814]
[null,null,null,332,162.45816000000247,53936.109120000816]
[null,null,null,333,162.33704000000247,54058.234320000825]
[null,null,null,334,162.21592000000248,54180.117280000828]
[null,null,null,335,162.09480000000249,54301.758000000838]
[null,null,null,336,161.9736800000025,54423.156480000842]
[null,null,null,337,161.85256000000251,54544.312720000846]
[null,null,null,338,161.73144000000252,54665.22672000085]
[null,null,null,339,161.61032000000253,54785.898480000855]
[null,null,null,340,161.48920000000254,54906.328000000867]
[null,null,null,341,161.36808000000255,55026.515280000873]
[null,null,null,342,161.24696000000256,55146.460320000879]
[null,null,null,343,161.12584000000257,55266.163120000878]
[null,null,null,344,161.00472000000258,55385.623680000885]
[null,null,null,345,160.88360000000259,55504.842000000892]
[null,null,null,346,160.7624800000026,55623.818080000899]
[null,null,null,347,160.64136000000261,55742.551920000908]
[null,null,null,348,160.52024000000262,55861.043520000909]
[null,null,null,349,160.39912000000263,55979.292880000918]
[null,null,null,350,160.27800000000263,56097.30000000092]
[null,null,null,351,160.15688000000264,56215.064880000929]
[null,null,null,352,160.03576000000265,56332.587520000932]
[null,null,null,353,159.91464000000266,56449.867920000943]
[null,null,null,354,159.79352000000267,56566.906080000947]
[null,null,null,355,159.67240000000268,56683.702000000951]
[null,null,null,356,159.55128000000269,{"$f":"E373*D373","v":56800.255680000955}]
[null,null,null,357,159.4301600000027,56916.567120000967]
[null,null,null,358,159.30904000000271,57032.636320000973]
[null,null,null,359,159.18792000000272,57148.463280000979]
[null,null,null,360,159.06680000000273,57264.048000000985]
[null,null,null,361,158.94568000000274,57379.390480000991]
[null,null,null,362,158.82456000000275,57494.490720000991]
[null,null,null,363,158.70344000000276,57609.348720000999]
[null,null,null,364,158.58232000000277,57723.964480001006]
[null,null,null,365,158.46120000000278,57838.338000001015]
[null,null,null,366,158.34008000000279,57952.469280001016]
[null,null,null,367,158.2189600000028,58066.358320001025]
[null,null,null,368,158.0978400000028,58180.005120001035]
[null,null,null,369,157.97672000000281,58293.409680001037]
[null,null,null,370,157.85560000000282,58406.572000001048]
[null,null,null,371,157.73448000000283,58519.492080001051]
[null,null,null,372,157.61336000000284,58632.169920001055]
[null,null,null,373,157.49224000000285,58744.605520001067]
[null,null,null,374,157.37112000000286,58856.798880001072]
[null,null,null,375,157.25000000000287,58968.750000001077]
[null,null,null,376,157.12888000000288,59080.458880001082]
[null,null,null,377,157.00776000000289,59191.925520001088]
[null,null,null,378,156.8866400000029,59303.149920001095]
[null,null,null,379,{"$f":"E395-$F$10","v":156.76552000000291},59414.132080001102]
[null,null,null,380,156.64440000000292,59524.872000001109]
[null,null,null,381,156.52328000000293,59635.369680001117]
[null,null,null,382,156.40216000000294,59745.625120001125]
[null,null,null,383,156.28104000000295,59855.638320001126]
[null,null,null,384,156.15992000000296,59965.409280001135]
[null,null,null,385,156.03880000000296,60074.938000001144]
[null,null,null,386,155.91768000000297,60184.224480001147]
[null,null,null,387,155.79656000000298,60293.268720001157]
[null,null,null,388,155.67544000000299,60402.07072000116]
[null,null,null,389,155.554320000003,60510.630480001171]
[null,null,null,390,155.43320000000301,60618.948000001175]
[null,null,null,391,155.31208000000302,60727.02328000118]
[null,null,null,392,155.19096000000303,60834.856320001185]
[null,null,null,393,155.06984000000304,60942.447120001198]
[null,null,null,394,154.94872000000305,61049.795680001203]
[null,null,null,395,154.82760000000306,61156.90200000121]
[null,null,null,396,154.70648000000307,61263.766080001216]
[null,null,null,397,154.58536000000308,61370.387920001223]
[null,null,null,398,154.46424000000309,61476.767520001231]
[null,null,null,399,154.3431200000031,61582.904880001239]
[null,null,null,400,154.22200000000311,61688.80000000124]
[null,null,null,401,154.10088000000312,61794.452880001249]
[null,null,null,402,153.97976000000313,61899.863520001258]
[null,null,null,403,153.85864000000313,62005.03192000126]
[null,null,null,404,153.73752000000314,62109.95808000127]
[null,null,null,405,153.61640000000315,62214.64200000128]
[null,null,null,406,153.49528000000316,62319.083680001284]
[null,null,null,407,153.37416000000317,62423.283120001288]
[null,null,null,408,153.25304000000318,62527.2403200013]
[null,null,null,409,153.13192000000319,62630.955280001304]
[null,null,null,410,153.0108000000032,62734.42800000131]
[null,null,null,411,152.88968000000321,62837.658480001322]
[null,null,null,412,152.76856000000322,62940.646720001329]
[null,null,null,413,152.64744000000323,63043.392720001335]
[null,null,null,414,152.52632000000324,63145.896480001342]
[null,null,null,415,152.40520000000325,63248.158000001349]
[null,null,null,416,152.28408000000326,63350.177280001357]
[null,null,null,417,152.16296000000327,63451.954320001365]
[null,null,null,418,152.04184000000328,63553.489120001366]
[null,null,null,419,151.92072000000329,63654.781680001375]
[null,null,null,420,151.7996000000033,{"$f":"E437*D437","v":63755.832000001385}]
[null,null,null,421,151.6784800000033,63856.640080001394]
[null,null,null,422,151.55736000000331,63957.205920001397]
[null,null,null,423,151.43624000000332,64057.529520001408]
[null,null,null,424,151.31512000000333,64157.610880001412]
[null,null,null,425,151.19400000000334,64257.450000001423]
[null,null,null,426,151.07288000000335,64357.046880001428]
[null,null,null,427,150.95176000000336,64456.401520001433]
[null,null,null,428,150.83064000000337,64555.513920001446]
[null,null,null,429,150.70952000000338,64654.384080001451]
[null,null,null,430,150.58840000000339,64753.012000001458]
[null,null,null,431,150.4672800000034,64851.397680001464]
[null,null,null,432,150.34616000000341,64949.541120001471]
[null,null,null,433,150.22504000000342,65047.442320001479]
[null,null,null,434,150.10392000000343,65145.101280001487]
[null,null,null,435,149.98280000000344,65242.518000001495]
[null,null,null,436,149.86168000000345,65339.692480001504]
[null,null,null,437,149.74056000000346,65436.624720001513]
[null,null,null,438,149.61944000000346,65533.314720001516]
[null,null,null,439,149.49832000000347,65629.762480001518]
[null,null,null,440,149.37720000000348,65725.968000001536]
[null,null,null,441,149.25608000000349,65821.931280001547]
[null,null,null,442,149.1349600000035,65917.652320001551]
[null,null,null,443,{"$f":"E459-$F$10","v":149.01384000000351},66013.131120001563]
[null,null,null,444,148.89272000000352,66108.367680001567]
[null,null,null,445,148.77160000000353,66203.362000001565]
[null,null,null,446,148.65048000000354,66298.114080001586]
[null,null,null,447,148.52936000000355,66392.623920001584]
[null,null,null,448,148.40824000000356,66486.891520001591]
[null,null,null,449,148.28712000000357,66580.916880001605]
[null,null,null,450,148.16600000000358,66674.700000001612]
[null,null,null,451,148.04488000000359,66768.240880001613]
[null,null,null,452,147.9237600000036,66861.539520001621]
[null,null,null,453,147.80264000000361,66954.595920001637]
[null,null,null,454,147.68152000000362,67047.410080001646]
[null,null,null,455,147.56040000000363,67139.982000001648]
[null,null,null,456,147.43928000000363,67232.311680001658]
[null,null,null,457,147.31816000000364,67324.399120001661]
[null,null,null,458,147.19704000000365,67416.244320001671]
[null,null,null,459,147.07592000000366,67507.847280001675]
[null,null,null,460,146.95480000000367,67599.208000001687]
[null,null,null,461,146.83368000000368,67690.326480001691]
[null,null,null,462,146.71256000000369,67781.202720001704]
[null,null,null,463,146.5914400000037,67871.836720001709]
[null,null,null,464,146.47032000000371,67962.228480001722]
[null,null,null,465,146.34920000000372,68052.378000001729]
[null,null,null,466,146.22808000000373,68142.285280001743]
[null,null,null,467,146.10696000000374,68231.95032000175]
[null,null,null,468,145.98584000000375,68321.37312000175]
[null,null,null,469,145.86472000000376,68410.553680001758]
[null,null,null,470,145.74360000000377,68499.492000001774]
[null,null,null,471,145.62248000000378,68588.188080001783]
[null,null,null,472,145.50136000000379,68676.641920001784]
[null,null,null,473,145.38024000000379,68764.853520001794]
[null,null,null,474,145.2591200000038,68852.822880001797]
[null,null,null,475,145.13800000000381,68940.550000001807]
[null,null,null,476,145.01688000000382,69028.034880001826]
[null,null,null,477,144.89576000000383,69115.277520001822]
[null,null,null,478,144.77464000000384,69202.277920001841]
[null,null,null,479,144.65352000000385,69289.036080001839]
[null,null,null,480,144.53240000000386,69375.552000001859]
[null,null,null,481,144.41128000000387,69461.825680001857]
[null,null,null,482,144.29016000000388,69547.857120001863]
[null,null,null,483,144.16904000000389,69633.646320001877]
[null,null,null,484,144.0479200000039,{"$f":"E501*D501","v":69719.193280001884}]
[null,null,null,485,143.92680000000391,69804.498000001899]
[null,null,null,486,143.80568000000392,69889.560480001906]
[null,null,null,487,143.68456000000393,69974.380720001907]
[null,null,null,488,143.56344000000394,70058.958720001916]
[null,null,null,489,143.44232000000395,70143.294480001932]
[null,null,null,490,143.32120000000396,70227.388000001942]
[null,null,null,491,143.20008000000396,70311.239280001944]
[null,null,null,492,143.07896000000397,70394.848320001955]
[null,null,null,493,142.95784000000398,70478.215120001958]
[null,null,null,494,142.83672000000399,70561.339680001969]
[null,null,null,495,142.715600000004,70644.222000001988]
[null,null,null,496,142.59448000000401,70726.862080001985]
[null,null,null,497,142.47336000000402,70809.259920002005]
[null,null,null,498,142.35224000000403,70891.415520002003]
[null,null,null,499,142.23112000000404,70973.328880002009]
[null,null,null,500,142.11000000000405,71055.000000002023]
[null,null,null,501,{"$f":"E517-$F$11","v":142.05874000000404},71171.428740002026]
[null,null,null,502,142.00748000000402,71287.754960002014]
[null,null,null,503,141.95622000000401,71403.978660002016]
[null,null,null,504,141.904960000004,71520.099840002018]
[null,null,null,505,141.85370000000398,71636.118500002005]
[null,null,null,506,141.80244000000397,71752.034640002006]
[null,null,null,507,141.75118000000396,71867.848260002007]
[null,null,null,508,141.69992000000394,71983.559360002007]
[null,null,null,509,141.64866000000393,72099.167940001993]
[null,null,null,510,141.59740000000392,72214.674000001993]
[null,null,null,511,141.5461400000039,72330.077540001992]
[null,null,null,512,141.49488000000389,72445.378560001991]
[null,null,null,513,141.44362000000388,72560.57706000199]
[null,null,null,514,141.39236000000386,72675.673040001988]
[null,null,null,515,141.34110000000385,72790.666500001986]
[null,null,null,516,141.28984000000384,72905.557440001983]
[null,null,null,517,141.23858000000382,73020.34586000198]
[null,null,null,518,141.18732000000381,73135.031760001977]
[null,null,null,519,141.13606000000379,73249.615140001973]
[null,null,null,520,141.08480000000378,73364.09600000197]
[null,null,null,521,141.03354000000377,73478.474340001965]
[null,null,null,522,140.98228000000375,73592.75016000196]
[null,null,null,523,140.93102000000374,73706.923460001955]
[null,null,null,524,140.87976000000373,73820.99424000195]
[null,null,null,525,140.82850000000371,73934.962500001944]
[null,null,null,526,140.7772400000037,74048.828240001953]
[null,null,null,527,140.72598000000369,74162.591460001946]
[null,null,null,528,140.67472000000367,74276.252160001939]
[null,null,null,529,140.62346000000366,74389.810340001932]
[null,null,null,530,140.57220000000365,74503.266000001939]
[null,null,null,531,140.52094000000363,74616.619140001931]
[null,null,null,532,140.46968000000362,74729.869760001922]
[null,null,null,533,140.41842000000361,74843.017860001928]
[null,null,null,534,140.36716000000359,74956.063440001919]
[null,null,null,535,140.31590000000358,75069.006500001909]
[null,null,null,536,140.26464000000357,75181.847040001914]
[null,null,null,537,140.21338000000355,75294.585060001904]
[null,null,null,538,140.16212000000354,75407.220560001908]
[null,null,null,539,140.11086000000353,75519.753540001897]
[null,null,null,540,140.05960000000351,75632.1840000019]
[null,null,null,541,140.0083400000035,75744.511940001888]
[null,null,null,542,139.95708000000349,75856.737360001891]
[null,null,null,543,139.90582000000347,75968.860260001893]
[null,null,null,544,139.85456000000346,76080.88064000188]
[null,null,null,545,139.80330000000345,76192.798500001882]
[null,null,null,546,139.75204000000343,76304.613840001868]
[null,null,null,547,139.70078000000342,76416.326660001869]
[null,null,null,548,139.64952000000341,{"$f":"E565*D565","v":76527.936960001869}]
[null,null,null,549,139.59826000000339,76639.444740001869]
[null,null,null,550,139.54700000000338,76750.850000001854]
[null,null,null,551,139.49574000000337,76862.152740001853]
[null,null,null,552,139.44448000000335,76973.352960001852]
[null,null,null,553,139.39322000000334,77084.45066000185]
[null,null,null,554,139.34196000000333,77195.445840001848]
[null,null,null,555,139.29070000000331,77306.338500001832]
[null,null,null,556,139.2394400000033,77417.128640001829]
[null,null,null,557,139.18818000000329,77527.816260001826]
[null,null,null,558,139.13692000000327,77638.401360001822]
[null,null,null,559,139.08566000000326,77748.883940001819]
[null,null,null,560,139.03440000000325,77859.264000001815]
[null,null,null,561,138.98314000000323,77969.54154000181]
[null,null,null,562,138.93188000000322,78079.716560001805]
[null,null,null,563,138.8806200000032,78189.7890600018]
[null,null,null,564,138.82936000000319,78299.759040001794]
[null,null,null,565,{"$f":"E581-$F$11","v":138.77810000000318},78409.626500001788]
[null,null,null,566,138.72684000000316,78519.391440001797]
[null,null,null,567,138.67558000000315,78629.05386000179]
[null,null,null,568,138.62432000000314,78738.613760001783]
[null,null,null,569,138.57306000000312,78848.071140001775]
[null,null,null,570,138.52180000000311,78957.426000001768]
[null,null,null,571,138.4705400000031,79066.678340001774]
[null,null,null,572,138.41928000000308,79175.828160001765]
[null,null,null,573,138.36802000000307,79284.875460001756]
[null,null,null,574,138.31676000000306,79393.820240001762]
[null,null,null,575,138.26550000000304,79502.662500001752]
[null,null,null,576,138.21424000000303,79611.402240001742]
[null,null,null,577,138.16298000000302,79720.039460001746]
[null,null,null,578,138.111720000003,79828.574160001735]
[null,null,null,579,138.06046000000299,79937.006340001724]
[null,null,null,580,138.00920000000298,80045.336000001727]
[null,null,null,581,137.95794000000296,80153.563140001716]
[null,null,null,582,137.90668000000295,80261.687760001718]
[null,null,null,583,137.85542000000294,80369.709860001705]
[null,null,null,584,137.80416000000292,80477.629440001707]
[null,null,null,585,137.75290000000291,80585.446500001708]
[null,null,null,586,137.7016400000029,80693.161040001694]
[null,null,null,587,137.65038000000288,80800.773060001695]
[null,null,null,588,137.59912000000287,80908.28256000168]
[null,null,null,589,137.54786000000286,81015.68954000168]
[null,null,null,590,137.49660000000284,81122.99400000168]
[null,null,null,591,137.44534000000283,81230.195940001679]
[null,null,null,592,137.39408000000282,81337.295360001663]
[null,null,null,593,137.3428200000028,81444.292260001661]
[null,null,null,594,137.29156000000279,81551.186640001659]
[null,null,null,595,137.24030000000278,81657.978500001656]
[null,null,null,596,137.18904000000276,81764.667840001654]
[null,null,null,597,137.13778000000275,81871.254660001636]
[null,null,null,598,137.08652000000274,81977.738960001632]
[null,null,null,599,137.03526000000272,82084.120740001628]
[null,null,null,600,136.98400000000271,82190.400000001624]
[null,null,null,601,136.9327400000027,82296.576740001619]
[null,null,null,602,136.88148000000268,82402.650960001614]
[null,null,null,603,136.83022000000267,82508.622660001609]
[null,null,null,604,136.77896000000266,82614.491840001603]
[null,null,null,605,136.72770000000264,82720.258500001597]
[null,null,null,606,136.67644000000263,82825.92264000159]
[null,null,null,607,136.62518000000262,82931.484260001584]
[null,null,null,608,136.5739200000026,83036.943360001576]
[null,null,null,609,136.52266000000259,83142.299940001583]
[null,null,null,610,136.47140000000257,83247.554000001575]
[null,null,null,611,136.42014000000256,83352.705540001567]
[null,null,null,612,136.36888000000255,{"$f":"E629*D629","v":83457.754560001558}]
[null,null,null,613,136.31762000000253,83562.701060001549]
[null,null,null,614,136.26636000000252,83667.545040001554]
[null,null,null,615,136.21510000000251,83772.286500001544]
[null,null,null,616,136.16384000000249,83876.925440001534]
[null,null,null,617,136.11258000000248,83981.461860001524]
[null,null,null,618,136.06132000000247,84085.895760001527]
[null,null,null,619,136.01006000000245,84190.227140001516]
[null,null,null,620,135.95880000000244,84294.456000001519]
[null,null,null,621,135.90754000000243,84398.582340001507]
[null,null,null,622,135.85628000000241,84502.606160001495]
[null,null,null,623,135.8050200000024,84606.527460001496]
[null,null,null,624,135.75376000000239,84710.346240001483]
[null,null,null,625,135.70250000000237,84814.062500001484]
[null,null,null,626,135.65124000000236,84917.67624000147]
[null,null,null,627,135.59998000000235,85021.187460001471]
[null,null,null,628,135.54872000000233,85124.596160001471]
[null,null,null,629,{"$f":"E645-$F$11","v":135.49746000000232},85227.902340001456]
[null,null,null,630,135.44620000000231,85331.106000001455]
[null,null,null,631,135.39494000000229,85434.207140001454]
[null,null,null,632,135.34368000000228,85537.205760001438]
[null,null,null,633,135.29242000000227,85640.101860001436]
[null,null,null,634,135.24116000000225,85742.895440001434]
[null,null,null,635,135.18990000000224,85845.586500001416]
[null,null,null,636,135.13864000000223,85948.175040001413]
[null,null,null,637,135.08738000000221,86050.66106000141]
[null,null,null,638,135.0361200000022,86153.044560001406]
[null,null,null,639,134.98486000000219,86255.325540001402]
[null,null,null,640,134.93360000000217,86357.504000001383]
[null,null,null,641,134.88234000000216,86459.579940001378]
[null,null,null,642,134.83108000000215,86561.553360001373]
[null,null,null,643,134.77982000000213,86663.424260001368]
[null,null,null,644,134.72856000000212,86765.192640001362]
[null,null,null,645,134.67730000000211,86866.858500001355]
[null,null,null,646,134.62604000000209,86968.421840001349]
[null,null,null,647,134.57478000000208,87069.882660001342]
[null,null,null,648,134.52352000000207,87171.240960001334]
[null,null,null,649,134.47226000000205,87272.496740001327]
[null,null,null,650,134.42100000000204,87373.650000001318]
[null,null,null,651,134.36974000000203,87474.700740001324]
[null,null,null,652,134.31848000000201,87575.648960001316]
[null,null,null,653,134.267220000002,87676.494660001306]
[null,null,null,654,134.21596000000199,87777.237840001297]
[null,null,null,655,134.16470000000197,87877.878500001287]
[null,null,null,656,134.11344000000196,87978.416640001291]
[null,null,null,657,134.06218000000194,88078.85226000128]
[null,null,null,658,134.01092000000193,88179.185360001269]
[null,null,null,659,133.95966000000192,88279.415940001258]
[null,null,null,660,133.9084000000019,88379.54400000126]
[null,null,null,661,133.85714000000189,88479.569540001248]
[null,null,null,662,133.80588000000188,88579.49256000125]
[null,null,null,663,133.75462000000186,88679.313060001237]
[null,null,null,664,133.70336000000185,88779.031040001224]
[null,null,null,665,133.65210000000184,88878.646500001225]
[null,null,null,666,133.60084000000182,88978.159440001211]
[null,null,null,667,133.54958000000181,89077.569860001211]
[null,null,null,668,133.4983200000018,89176.877760001196]
[null,null,null,669,133.44706000000178,89276.083140001196]
[null,null,null,670,133.39580000000177,89375.18600000118]
[null,null,null,671,133.34454000000176,89474.186340001179]
[null,null,null,672,133.29328000000174,89573.084160001177]
[null,null,null,673,133.24202000000173,89671.879460001161]
[null,null,null,674,133.19076000000172,89770.572240001158]
[null,null,null,675,133.1395000000017,89869.162500001155]
[null,null,null,676,133.08824000000169,{"$f":"E693*D693","v":89967.650240001138}]
[null,null,null,677,133.03698000000168,90066.035460001134]
[null,null,null,678,132.98572000000166,90164.31816000113]
[null,null,null,679,132.93446000000165,90262.498340001126]
[null,null,null,680,132.88320000000164,90360.576000001107]
[null,null,null,681,132.83194000000162,90458.551140001102]
[null,null,null,682,132.78068000000161,90556.423760001097]
[null,null,null,683,132.7294200000016,90654.193860001091]
[null,null,null,684,132.67816000000158,90751.861440001085]
[null,null,null,685,132.62690000000157,90849.426500001078]
[null,null,null,686,132.57564000000156,90946.889040001071]
[null,null,null,687,132.52438000000154,91044.249060001064]
[null,null,null,688,132.47312000000153,91141.506560001057]
[null,null,null,689,132.42186000000152,91238.661540001049]
[null,null,null,690,132.3706000000015,91335.71400000104]
[null,null,null,691,132.31934000000149,91432.663940001032]
[null,null,null,692,132.26808000000148,91529.511360001023]
[null,null,null,693,{"$f":"E709-$F$11","v":132.21682000000146},91626.256260001013]
[null,null,null,694,132.16556000000145,91722.898640001004]
[null,null,null,695,132.11430000000144,91819.438500000993]
[null,null,null,696,132.06304000000142,91915.875840000983]
[null,null,null,697,132.01178000000141,92012.210660000987]
[null,null,null,698,131.9605200000014,92108.442960000975]
[null,null,null,699,131.90926000000138,92204.572740000964]
[null,null,null,700,131.85800000000137,92300.600000000952]
[null,null,null,701,131.80674000000135,92396.524740000954]
[null,null,null,702,131.75548000000134,92492.346960000941]
[null,null,null,703,131.70422000000133,92588.066660000928]
[null,null,null,704,131.65296000000131,92683.683840000929]
[null,null,null,705,131.6017000000013,92779.198500000915]
[null,null,null,706,131.55044000000129,92874.610640000916]
[null,null,null,707,131.49918000000127,92969.920260000901]
[null,null,null,708,131.44792000000126,93065.127360000886]
[null,null,null,709,131.39666000000125,93160.231940000886]
[null,null,null,710,131.34540000000123,93255.23400000087]
[null,null,null,711,131.29414000000122,93350.133540000868]
[null,null,null,712,131.24288000000121,93444.930560000867]
[null,null,null,713,131.19162000000119,93539.62506000085]
[null,null,null,714,131.14036000000118,93634.217040000847]
[null,null,null,715,131.08910000000117,93728.70650000083]
[null,null,null,716,131.03784000000115,93823.093440000826]
[null,null,null,717,130.98658000000114,93917.377860000823]
[null,null,null,718,130.93532000000113,94011.559760000804]
[null,null,null,719,130.88406000000111,94105.6391400008]
[null,null,null,720,130.8328000000011,94199.616000000795]
[null,null,null,721,130.78154000000109,94293.49034000079]
[null,null,null,722,130.73028000000107,94387.26216000077]
[null,null,null,723,130.67902000000106,94480.931460000764]
[null,null,null,724,130.62776000000105,94574.498240000758]
[null,null,null,725,130.57650000000103,94667.962500000751]
[null,null,null,726,130.52524000000102,94761.324240000744]
[null,null,null,727,130.47398000000101,94854.583460000737]
[null,null,null,728,130.42272000000099,94947.740160000729]
[null,null,null,729,130.37146000000098,95040.794340000721]
[null,null,null,730,130.32020000000097,95133.746000000712]
[null,null,null,731,130.26894000000095,95226.595140000703]
[null,null,null,732,130.21768000000094,95319.341760000694]
[null,null,null,733,130.16642000000093,95411.985860000685]
[null,null,null,734,130.11516000000091,95504.527440000675]
[null,null,null,735,130.0639000000009,95596.966500000664]
[null,null,null,736,130.01264000000089,95689.303040000654]
[null,null,null,737,129.96138000000087,95781.537060000643]
[null,null,null,738,129.91012000000086,95873.668560000631]
[null,null,null,739,129.85886000000085,95965.697540000619]
[null,null,null,740,129.80760000000083,{"$f":"E757*D757","v":96057.624000000622}]
[null,null,null,741,129.75634000000082,96149.447940000609]
[null,null,null,742,129.70508000000081,96241.169360000596]
[null,null,null,743,129.65382000000079,96332.788260000583]
[null,null,null,744,129.60256000000078,96424.304640000584]
[null,null,null,745,129.55130000000077,96515.71850000057]
[null,null,null,746,129.50004000000075,96607.029840000556]
[null,null,null,747,129.44878000000074,96698.238660000556]
[null,null,null,748,129.39752000000072,96789.344960000541]
[null,null,null,749,129.34626000000071,96880.34874000054]
[null,null,null,750,129.2950000000007,96971.250000000524]
[null,null,null,751,129.24374000000068,97062.048740000508]
[null,null,null,752,129.19248000000067,97152.744960000506]
[null,null,null,753,129.14122000000066,97243.338660000489]
[null,null,null,754,129.08996000000064,97333.829840000486]
[null,null,null,755,129.03870000000063,97424.218500000483]
[null,null,null,756,128.98744000000062,97514.504640000465]
[null,null,null,757,{"$f":"E773-$F$11","v":128.9361800000006},97604.688260000461]
[null,null,null,758,128.88492000000059,97694.769360000442]
[null,null,null,759,128.83366000000058,97784.747940000438]
[null,null,null,760,128.78240000000056,97874.624000000433]
[null,null,null,761,128.73114000000055,97964.397540000413]
[null,null,null,762,128.67988000000054,98054.068560000407]
[null,null,null,763,128.62862000000052,98143.637060000401]
[null,null,null,764,128.57736000000051,98233.103040000395]
[null,null,null,765,128.5261000000005,98322.466500000373]
[null,null,null,766,128.47484000000048,98411.727440000366]
[null,null,null,767,128.42358000000047,98500.885860000359]
[null,null,null,768,128.37232000000046,98589.941760000351]
[null,null,null,769,128.32106000000044,98678.895140000343]
[null,null,null,770,128.26980000000043,98767.746000000334]
[null,null,null,771,128.21854000000042,98856.494340000325]
[null,null,null,772,128.1672800000004,98945.140160000316]
[null,null,null,773,128.11602000000039,99033.683460000306]
[null,null,null,774,128.06476000000038,99122.124240000296]
[null,null,null,775,128.01350000000036,99210.462500000285]
[null,null,null,776,127.96224000000036,99298.698240000289]
[null,null,null,777,127.91098000000036,99386.831460000278]
[null,null,null,778,127.85972000000037,99474.862160000281]
[null,null,null,779,127.80846000000037,99562.790340000283]
[null,null,null,780,127.75720000000037,99650.616000000286]
[null,null,null,781,127.70594000000037,99738.339140000287]
[null,null,null,782,127.65468000000037,99825.959760000289]
[null,null,null,783,127.60342000000037,99913.47786000029]
[null,null,null,784,127.55216000000037,100000.89344000029]
[null,null,null,785,127.50090000000037,100088.20650000029]
[null,null,null,786,127.44964000000037,100175.41704000029]
[null,null,null,787,127.39838000000037,100262.52506000029]
[null,null,null,788,127.34712000000037,100349.53056000029]
[null,null,null,789,127.29586000000037,100436.43354000029]
[null,null,null,790,127.24460000000037,100523.2340000003]
[null,null,null,791,127.19334000000038,100609.9319400003]
[null,null,null,792,127.14208000000038,100696.5273600003]
[null,null,null,793,127.09082000000038,100783.0202600003]
[null,null,null,794,127.03956000000038,100869.41064000031]
[null,null,null,795,126.98830000000038,100955.6985000003]
[null,null,null,796,126.93704000000038,101041.8838400003]
[null,null,null,797,126.88578000000038,101127.9666600003]
[null,null,null,798,126.83452000000038,101213.94696000031]
[null,null,null,799,126.78326000000038,101299.8247400003]
[null,null,null,800,126.73200000000038,101385.60000000031]
[null,null,null,801,126.68074000000038,101471.27274000031]
[null,null,null,802,126.62948000000038,101556.84296000031]
[null,null,null,803,126.57822000000039,101642.31066000031]
[null,null,null,804,126.52696000000039,{"$f":"E821*D821","v":101727.67584000032}]
[null,null,null,805,126.47570000000039,101812.93850000031]
[null,null,null,806,126.42444000000039,101898.09864000032]
[null,null,null,807,126.37318000000039,101983.15626000031]
[null,null,null,808,126.32192000000039,102068.11136000032]
[null,null,null,809,126.27066000000039,102152.96394000032]
[null,null,null,810,126.21940000000039,102237.71400000031]
[null,null,null,811,126.16814000000039,102322.36154000032]
[null,null,null,812,126.11688000000039,102406.90656000032]
[null,null,null,813,126.06562000000039,102491.34906000031]
[null,null,null,814,126.01436000000039,102575.68904000032]
[null,null,null,815,125.9631000000004,102659.92650000032]
[null,null,null,816,125.9118400000004,102744.06144000033]
[null,null,null,817,125.8605800000004,102828.09386000033]
[null,null,null,818,125.8093200000004,102912.02376000033]
[null,null,null,819,125.7580600000004,102995.85114000032]
[null,null,null,820,125.7068000000004,103079.57600000032]
[null,null,null,821,{"$f":"E837-$F$11","v":125.6555400000004},103163.19834000032]
[null,null,null,822,125.6042800000004,103246.71816000032]
[null,null,null,823,125.5530200000004,103330.13546000033]
[null,null,null,824,125.5017600000004,103413.45024000033]
[null,null,null,825,125.4505000000004,103496.66250000033]
[null,null,null,826,125.3992400000004,103579.77224000034]
[null,null,null,827,125.3479800000004,103662.77946000034]
[null,null,null,828,125.29672000000041,103745.68416000034]
[null,null,null,829,125.24546000000041,103828.48634000034]
[null,null,null,830,125.19420000000041,103911.18600000034]
[null,null,null,831,125.14294000000041,103993.78314000033]
[null,null,null,832,125.09168000000041,104076.27776000035]
[null,null,null,833,125.04042000000041,104158.66986000034]
[null,null,null,834,124.98916000000041,104240.95944000034]
[null,null,null,835,124.93790000000041,104323.14650000034]
[null,null,null,836,124.88664000000041,104405.23104000035]
[null,null,null,837,124.83538000000041,104487.21306000034]
[null,null,null,838,124.78412000000041,104569.09256000035]
[null,null,null,839,124.73286000000041,104650.86954000035]
[null,null,null,840,124.68160000000042,104732.54400000034]
[null,null,null,841,124.63034000000042,104814.11594000035]
[null,null,null,842,124.57908000000042,104895.58536000035]
[null,null,null,843,124.52782000000042,104976.95226000035]
[null,null,null,844,124.47656000000042,105058.21664000035]
[null,null,null,845,124.42530000000042,105139.37850000036]
[null,null,null,846,124.37404000000042,105220.43784000036]
[null,null,null,847,124.32278000000042,105301.39466000035]
[null,null,null,848,124.27152000000042,105382.24896000036]
[null,null,null,849,124.22026000000042,105463.00074000035]
[null,null,null,850,124.16900000000042,105543.65000000036]
[null,null,null,851,124.11774000000042,105624.19674000036]
[null,null,null,852,124.06648000000042,105704.64096000037]
[null,null,null,853,124.01522000000043,105784.98266000036]
[null,null,null,854,123.96396000000043,105865.22184000036]
[null,null,null,855,123.91270000000043,105945.35850000037]
[null,null,null,856,123.86144000000043,106025.39264000037]
[null,null,null,857,123.81018000000043,106105.32426000037]
[null,null,null,858,123.75892000000043,106185.15336000037]
[null,null,null,859,123.70766000000043,106264.87994000036]
[null,null,null,860,123.65640000000043,106344.50400000036]
[null,null,null,861,123.60514000000043,106424.02554000037]
[null,null,null,862,123.55388000000043,106503.44456000037]
[null,null,null,863,123.50262000000043,106582.76106000037]
[null,null,null,864,123.45136000000043,106661.97504000037]
[null,null,null,865,123.40010000000044,106741.08650000038]
[null,null,null,866,123.34884000000044,106820.09544000038]
[null,null,null,867,123.29758000000044,106899.00186000038]
[null,null,null,868,123.24632000000044,{"$f":"E885*D885","v":106977.80576000038}]
[null,null,null,869,123.19506000000044,107056.50714000038]
[null,null,null,870,123.14380000000044,107135.10600000038]
[null,null,null,871,123.09254000000044,107213.60234000039]
[null,null,null,872,123.04128000000044,107291.99616000039]
[null,null,null,873,122.99002000000044,107370.28746000039]
[null,null,null,874,122.93876000000044,107448.47624000038]
[null,null,null,875,122.88750000000044,107526.56250000039]
[null,null,null,876,122.83624000000044,107604.54624000039]
[null,null,null,877,122.78498000000044,107682.42746000038]
[null,null,null,878,122.73372000000045,107760.20616000039]
[null,null,null,879,122.68246000000045,107837.88234000039]
[null,null,null,880,122.63120000000045,107915.4560000004]
[null,null,null,881,122.57994000000045,107992.92714000039]
[null,null,null,882,122.52868000000045,108070.2957600004]
[null,null,null,883,122.47742000000045,108147.56186000039]
[null,null,null,884,122.42616000000045,108224.7254400004]
[null,null,null,885,{"$f":"E901-$F$11","v":122.37490000000045},108301.78650000039]
[null,null,null,886,122.32364000000045,108378.7450400004]
[null,null,null,887,122.27238000000045,108455.60106000041]
[null,null,null,888,122.22112000000045,108532.3545600004]
[null,null,null,889,122.16986000000045,108609.00554000041]
[null,null,null,890,122.11860000000046,108685.55400000041]
[null,null,null,891,122.06734000000046,108761.9999400004]
[null,null,null,892,122.01608000000046,108838.34336000041]
[null,null,null,893,121.96482000000046,108914.58426000041]
[null,null,null,894,121.91356000000046,108990.72264000041]
[null,null,null,895,121.86230000000046,109066.75850000042]
[null,null,null,896,121.81104000000046,109142.69184000041]
[null,null,null,897,121.75978000000046,109218.52266000041]
[null,null,null,898,121.70852000000046,109294.25096000041]
[null,null,null,899,121.65726000000046,109369.87674000041]
[null,null,null,900,121.60600000000046,109445.40000000042]
[null,null,null,901,121.55474000000046,109520.82074000042]
[null,null,null,902,121.50348000000047,109596.13896000042]
[null,null,null,903,121.45222000000047,109671.35466000042]
[null,null,null,904,121.40096000000047,109746.46784000042]
[null,null,null,905,121.34970000000047,109821.47850000042]
[null,null,null,906,121.29844000000047,109896.38664000042]
[null,null,null,907,121.24718000000047,109971.19226000043]
[null,null,null,908,121.19592000000047,110045.89536000043]
[null,null,null,909,121.14466000000047,110120.49594000043]
[null,null,null,910,121.09340000000047,110194.99400000043]
[null,null,null,911,121.04214000000047,110269.38954000043]
[null,null,null,912,120.99088000000047,110343.68256000044]
[null,null,null,913,120.93962000000047,110417.87306000043]
[null,null,null,914,120.88836000000047,110491.96104000043]
[null,null,null,915,120.83710000000048,110565.94650000044]
[null,null,null,916,120.78584000000048,110639.82944000044]
[null,null,null,917,120.73458000000048,110713.60986000043]
[null,null,null,918,120.68332000000048,110787.28776000044]
[null,null,null,919,120.63206000000048,110860.86314000044]
[null,null,null,920,120.58080000000048,110934.33600000045]
[null,null,null,921,120.52954000000048,111007.70634000044]
[null,null,null,922,120.47828000000048,111080.97416000045]
[null,null,null,923,120.42702000000048,111154.13946000044]
[null,null,null,924,120.37576000000048,111227.20224000045]
[null,null,null,925,120.32450000000048,111300.16250000044]
[null,null,null,926,120.27324000000048,111373.02024000045]
[null,null,null,927,120.22198000000049,111445.77546000046]
[null,null,null,928,120.17072000000049,111518.42816000045]
[null,null,null,929,120.11946000000049,111590.97834000045]
[null,null,null,930,120.06820000000049,111663.42600000046]
[null,null,null,931,120.01694000000049,111735.77114000045]
[null,null,null,932,119.96568000000049,{"$f":"E949*D949","v":111808.01376000045}]
[null,null,null,933,119.91442000000049,111880.15386000046]
[null,null,null,934,119.86316000000049,111952.19144000046]
[null,null,null,935,119.81190000000049,112024.12650000046]
[null,null,null,936,119.76064000000049,112095.95904000047]
[null,null,null,937,119.70938000000049,112167.68906000046]
[null,null,null,938,119.65812000000049,112239.31656000046]
[null,null,null,939,119.60686000000049,112310.84154000046]
[null,null,null,940,119.5556000000005,112382.26400000046]
[null,null,null,941,119.5043400000005,112453.58394000046]
[null,null,null,942,119.4530800000005,112524.80136000046]
[null,null,null,943,119.4018200000005,112595.91626000046]
[null,null,null,944,119.3505600000005,112666.92864000046]
[null,null,null,945,119.2993000000005,112737.83850000048]
[null,null,null,946,119.2480400000005,112808.64584000048]
[null,null,null,947,119.1967800000005,112879.35066000048]
[null,null,null,948,119.1455200000005,112949.95296000048]
[null,null,null,949,{"$f":"E965-$F$11","v":119.0942600000005},113020.45274000047]
[null,null,null,950,119.0430000000005,113090.85000000047]
[null,null,null,951,118.9917400000005,113161.14474000048]
[null,null,null,952,118.94048000000051,113231.33696000048]
[null,null,null,953,118.88922000000051,113301.42666000048]
[null,null,null,954,118.83796000000051,113371.41384000049]
[null,null,null,955,118.78670000000051,113441.29850000048]
[null,null,null,956,118.73544000000051,113511.08064000048]
[null,null,null,957,118.68418000000051,113580.76026000049]
[null,null,null,958,118.63292000000051,113650.33736000049]
[null,null,null,959,118.58166000000051,113719.81194000049]
[null,null,null,960,118.53040000000051,113789.18400000049]
[null,null,null,961,118.47914000000051,113858.4535400005]
[null,null,null,962,118.42788000000051,113927.62056000049]
[null,null,null,963,118.37662000000051,113996.6850600005]
[null,null,null,964,118.32536000000052,114065.64704000049]
[null,null,null,965,118.27410000000052,114134.5065000005]
[null,null,null,966,118.22284000000052,114203.2634400005]
[null,null,null,967,118.17158000000052,114271.9178600005]
[null,null,null,968,118.12032000000052,114340.4697600005]
[null,null,null,969,118.06906000000052,114408.91914000051]
[null,null,null,970,118.01780000000052,114477.2660000005]
[null,null,null,971,117.96654000000052,114545.5103400005]
[null,null,null,972,117.91528000000052,114613.65216000051]
[null,null,null,973,117.86402000000052,114681.69146000051]
[null,null,null,974,117.81276000000052,114749.62824000051]
[null,null,null,975,117.76150000000052,114817.46250000052]
[null,null,null,976,117.71024000000052,114885.19424000051]
[null,null,null,977,117.65898000000053,114952.82346000051]
[null,null,null,978,117.60772000000053,115020.35016000051]
[null,null,null,979,117.55646000000053,115087.77434000051]
[null,null,null,980,117.50520000000053,115155.09600000051]
[null,null,null,981,117.45394000000053,115222.31514000052]
[null,null,null,982,117.40268000000053,115289.43176000052]
[null,null,null,983,117.35142000000053,115356.44586000052]
[null,null,null,984,117.30016000000053,115423.35744000052]
[null,null,null,985,117.24890000000053,115490.16650000053]
[null,null,null,986,117.19764000000053,115556.87304000053]
[null,null,null,987,117.14638000000053,115623.47706000053]
[null,null,null,988,117.09512000000053,115689.97856000053]
[null,null,null,989,117.04386000000054,115756.37754000053]
[null,null,null,990,116.99260000000054,115822.67400000054]
[null,null,null,991,116.94134000000054,115888.86794000053]
[null,null,null,992,116.89008000000054,115954.95936000053]
[null,null,null,993,116.83882000000054,116020.94826000053]
[null,null,null,994,116.78756000000054,116086.83464000054]
[null,null,null,995,116.73630000000054,116152.61850000054]
[null,null,null,996,116.68504000000054,{"$f":"E1013*D1013","v":116218.29984000055}]
[null,null,null,997,116.63378000000054,116283.87866000054]
[null,null,null,998,116.58252000000054,116349.35496000054]
[null,null,null,999,116.53126000000054,116414.72874000054]
[null,null,null,1000,116.48000000000054,116480.00000000054]
[null,null,null,1001,{"$f":"E1017-$F$12","v":116.46835000000054},116584.81835000054]
[null,null,null,1002,116.45670000000054,116689.61340000054]
[null,null,null,1003,116.44505000000053,116794.38515000054]
[null,null,null,1004,116.43340000000053,116899.13360000054]
[null,null,null,1005,116.42175000000053,117003.85875000054]
[null,null,null,1006,116.41010000000053,117108.56060000054]
[null,null,null,1007,116.39845000000052,117213.23915000053]
[null,null,null,1008,116.38680000000052,117317.89440000053]
[null,null,null,1009,116.37515000000052,117422.52635000052]
[null,null,null,1010,116.36350000000051,117527.13500000052]
[null,null,null,1011,116.35185000000051,117631.72035000051]
[null,null,null,1012,116.34020000000051,117736.28240000052]
[null,null,null,1013,116.3285500000005,117840.82115000051]
[null,null,null,1014,116.3169000000005,117945.3366000005]
[null,null,null,1015,116.3052500000005,118049.82875000051]
[null,null,null,1016,116.2936000000005,118154.2976000005]
[null,null,null,1017,116.28195000000049,118258.7431500005]
[null,null,null,1018,116.27030000000049,118363.16540000049]
[null,null,null,1019,116.25865000000049,118467.5643500005]
[null,null,null,1020,116.24700000000048,118571.9400000005]
[null,null,null,1021,116.23535000000048,118676.29235000048]
[null,null,null,1022,116.22370000000048,118780.62140000048]
[null,null,null,1023,116.21205000000047,118884.92715000048]
[null,null,null,1024,116.20040000000047,118989.20960000048]
[null,null,null,1025,116.18875000000047,119093.46875000048]
[null,null,null,1026,116.17710000000046,119197.70460000048]
[null,null,null,1027,116.16545000000046,119301.91715000047]
[null,null,null,1028,116.15380000000046,119406.10640000047]
[null,null,null,1029,116.14215000000046,119510.27235000046]
[null,null,null,1030,116.13050000000045,119614.41500000046]
[null,null,null,1031,116.11885000000045,119718.53435000047]
[null,null,null,1032,116.10720000000045,119822.63040000046]
[null,null,null,1033,116.09555000000044,119926.70315000045]
[null,null,null,1034,116.08390000000044,120030.75260000046]
[null,null,null,1035,116.07225000000044,120134.77875000045]
[null,null,null,1036,116.06060000000043,120238.78160000045]
[null,null,null,1037,116.04895000000043,120342.76115000044]
[null,null,null,1038,116.03730000000043,120446.71740000045]
[null,null,null,1039,116.02565000000043,120550.65035000045]
[null,null,null,1040,116.01400000000042,120654.56000000043]
[null,null,null,1041,116.00235000000042,120758.44635000043]
[null,null,null,1042,115.99070000000042,120862.30940000043]
[null,null,null,1043,115.97905000000041,120966.14915000043]
[null,null,null,1044,115.96740000000041,121069.96560000043]
[null,null,null,1045,115.95575000000041,121173.75875000043]
[null,null,null,1046,115.9441000000004,121277.52860000043]
[null,null,null,1047,115.9324500000004,121381.27515000042]
[null,null,null,1048,115.9208000000004,121484.99840000042]
[null,null,null,1049,115.90915000000039,121588.69835000041]
[null,null,null,1050,115.89750000000039,121692.37500000041]
[null,null,null,1051,115.88585000000039,121796.02835000042]
[null,null,null,1052,115.87420000000039,121899.65840000041]
[null,null,null,1053,115.86255000000038,122003.2651500004]
[null,null,null,1054,115.85090000000038,122106.8486000004]
[null,null,null,1055,115.83925000000038,122210.4087500004]
[null,null,null,1056,115.82760000000037,122313.9456000004]
[null,null,null,1057,115.81595000000037,122417.45915000039]
[null,null,null,1058,115.80430000000037,122520.94940000039]
[null,null,null,1059,115.79265000000036,122624.41635000039]
[null,null,null,1060,115.78100000000036,{"$f":"E1077*D1077","v":122727.86000000038}]
[null,null,null,1061,115.76935000000036,122831.28035000038]
[null,null,null,1062,115.75770000000036,122934.67740000038]
[null,null,null,1063,115.74605000000035,123038.05115000038]
[null,null,null,1064,115.73440000000035,123141.40160000038]
[null,null,null,1065,{"$f":"E1081-$F$12","v":115.72275000000035},123244.72875000037]
[null,null,null,1066,115.71110000000034,123348.03260000037]
[null,null,null,1067,115.69945000000034,123451.31315000037]
[null,null,null,1068,115.68780000000034,123554.57040000036]
[null,null,null,1069,115.67615000000033,123657.80435000036]
[null,null,null,1070,115.66450000000033,123761.01500000035]
[null,null,null,1071,115.65285000000033,123864.20235000036]
[null,null,null,1072,115.64120000000032,123967.36640000035]
[null,null,null,1073,115.62955000000032,124070.50715000034]
[null,null,null,1074,115.61790000000032,124173.62460000034]
[null,null,null,1075,115.60625000000032,124276.71875000033]
[null,null,null,1076,115.59460000000031,124379.78960000034]
[null,null,null,1077,115.58295000000031,124482.83715000033]
[null,null,null,1078,115.57130000000031,124585.86140000033]
[null,null,null,1079,115.5596500000003,124688.86235000033]
[null,null,null,1080,115.5480000000003,124791.84000000033]
[null,null,null,1081,115.5363500000003,124894.79435000032]
[null,null,null,1082,115.52470000000029,124997.72540000032]
[null,null,null,1083,115.51305000000029,125100.63315000031]
[null,null,null,1084,115.50140000000029,125203.51760000031]
[null,null,null,1085,115.48975000000029,125306.37875000031]
[null,null,null,1086,115.47810000000028,125409.21660000031]
[null,null,null,1087,115.46645000000028,125512.0311500003]
[null,null,null,1088,115.45480000000028,125614.8224000003]
[null,null,null,1089,115.44315000000027,125717.5903500003]
[null,null,null,1090,115.43150000000027,125820.3350000003]
[null,null,null,1091,115.41985000000027,125923.05635000029]
[null,null,null,1092,115.40820000000026,126025.75440000028]
[null,null,null,1093,115.39655000000026,126128.42915000029]
[null,null,null,1094,115.38490000000026,126231.08060000028]
[null,null,null,1095,115.37325000000025,126333.70875000028]
[null,null,null,1096,115.36160000000025,126436.31360000027]
[null,null,null,1097,115.34995000000025,126538.89515000027]
[null,null,null,1098,115.33830000000025,126641.45340000027]
[null,null,null,1099,115.32665000000024,126743.98835000026]
[null,null,null,1100,115.31500000000024,126846.50000000026]
[null,null,null,1101,115.30335000000024,126948.98835000026]
[null,null,null,1102,115.29170000000023,127051.45340000026]
[null,null,null,1103,115.28005000000023,127153.89515000026]
[null,null,null,1104,115.26840000000023,127256.31360000026]
[null,null,null,1105,115.25675000000022,127358.70875000025]
[null,null,null,1106,115.24510000000022,127461.08060000025]
[null,null,null,1107,115.23345000000022,127563.42915000024]
[null,null,null,1108,115.22180000000021,127665.75440000024]
[null,null,null,1109,115.21015000000021,127768.05635000023]
[null,null,null,1110,115.19850000000021,127870.33500000022]
[null,null,null,1111,115.18685000000021,127972.59035000023]
[null,null,null,1112,115.1752000000002,128074.82240000022]
[null,null,null,1113,115.1635500000002,128177.03115000023]
[null,null,null,1114,115.1519000000002,128279.21660000022]
[null,null,null,1115,115.14025000000019,128381.37875000022]
[null,null,null,1116,115.12860000000019,128483.51760000021]
[null,null,null,1117,115.11695000000019,128585.63315000021]
[null,null,null,1118,115.10530000000018,128687.7254000002]
[null,null,null,1119,115.09365000000018,128789.7943500002]
[null,null,null,1120,115.08200000000018,128891.8400000002]
[null,null,null,1121,115.07035000000018,128993.8623500002]
[null,null,null,1122,115.05870000000017,129095.8614000002]
[null,null,null,1123,115.04705000000017,129197.8371500002]
[null,null,null,1124,115.03540000000017,{"$f":"E1141*D1141","v":129299.78960000019}]
[null,null,null,1125,115.02375000000016,129401.71875000019]
[null,null,null,1126,115.01210000000016,129503.62460000018]
[null,null,null,1127,115.00045000000016,129605.50715000018]
[null,null,null,1128,114.98880000000015,129707.36640000017]
[null,null,null,1129,{"$f":"E1145-$F$12","v":114.97715000000015},129809.20235000017]
[null,null,null,1130,114.96550000000015,129911.01500000017]
[null,null,null,1131,114.95385000000014,130012.80435000017]
[null,null,null,1132,114.94220000000014,130114.57040000016]
[null,null,null,1133,114.93055000000014,130216.31315000016]
[null,null,null,1134,114.91890000000014,130318.03260000015]
[null,null,null,1135,114.90725000000013,130419.72875000015]
[null,null,null,1136,114.89560000000013,130521.40160000014]
[null,null,null,1137,114.88395000000013,130623.05115000014]
[null,null,null,1138,114.87230000000012,130724.67740000015]
[null,null,null,1139,114.86065000000012,130826.28035000013]
[null,null,null,1140,114.84900000000012,130927.86000000013]
[null,null,null,1141,114.83735000000011,131029.41635000013]
[null,null,null,1142,114.82570000000011,131130.94940000013]
[null,null,null,1143,114.81405000000011,131232.45915000013]
[null,null,null,1144,114.80240000000011,131333.94560000012]
[null,null,null,1145,114.7907500000001,131435.40875000012]
[null,null,null,1146,114.7791000000001,131536.84860000011]
[null,null,null,1147,114.7674500000001,131638.26515000011]
[null,null,null,1148,114.75580000000009,131739.6584000001]
[null,null,null,1149,114.74415000000009,131841.0283500001]
[null,null,null,1150,114.73250000000009,131942.37500000009]
[null,null,null,1151,114.72085000000008,132043.69835000011]
[null,null,null,1152,114.70920000000008,132144.9984000001]
[null,null,null,1153,114.69755000000008,132246.27515000009]
[null,null,null,1154,114.68590000000007,132347.52860000008]
[null,null,null,1155,114.67425000000007,132448.7587500001]
[null,null,null,1156,114.66260000000007,132549.96560000008]
[null,null,null,1157,114.65095000000007,132651.14915000007]
[null,null,null,1158,114.63930000000006,132752.30940000009]
[null,null,null,1159,114.62765000000006,132853.44635000007]
[null,null,null,1160,114.61600000000006,132954.56000000006]
[null,null,null,1161,114.60435000000005,133055.65035000007]
[null,null,null,1162,114.59270000000005,133156.71740000005]
[null,null,null,1163,114.58105000000005,133257.76115000006]
[null,null,null,1164,114.56940000000004,133358.78160000005]
[null,null,null,1165,114.55775000000004,133459.77875000006]
[null,null,null,1166,114.54610000000004,133560.75260000004]
[null,null,null,1167,114.53445000000004,133661.70315000004]
[null,null,null,1168,114.52280000000003,133762.63040000002]
[null,null,null,1169,114.51115000000003,133863.53435000003]
[null,null,null,1170,114.49950000000003,133964.41500000004]
[null,null,null,1171,114.48785000000002,134065.27235000001]
[null,null,null,1172,114.47620000000002,134166.10640000002]
[null,null,null,1173,114.46455000000002,134266.91715000002]
[null,null,null,1174,114.45290000000001,134367.70460000003]
[null,null,null,1175,114.44125000000001,134468.46875]
[null,null,null,1176,114.42960000000001,134569.2096]
[null,null,null,1177,114.41795,134669.92715]
[null,null,null,1178,114.4063,134770.6214]
[null,null,null,1179,114.39465,134871.29235]
[null,null,null,1180,114.383,134971.94]
[null,null,null,1181,114.37134999999999,135072.56435]
[null,null,null,1182,114.35969999999999,135173.1654]
[null,null,null,1183,114.34804999999999,135273.74314999999]
[null,null,null,1184,114.33639999999998,135374.29759999999]
[null,null,null,1185,114.32474999999998,135474.82874999999]
[null,null,null,1186,114.31309999999998,135575.33659999998]
[null,null,null,1187,114.30144999999997,135675.82114999997]
[null,null,null,1188,114.28979999999997,{"$f":"E1205*D1205","v":135776.28239999997}]
[null,null,null,1189,114.27814999999997,135876.72034999996]
[null,null,null,1190,114.26649999999997,135977.13499999995]
[null,null,null,1191,114.25484999999996,136077.52634999994]
[null,null,null,1192,114.24319999999996,136177.89439999996]
[null,null,null,1193,{"$f":"E1209-$F$12","v":114.23154999999996},136278.23914999995]
[null,null,null,1194,114.21989999999995,136378.56059999994]
[null,null,null,1195,114.20824999999995,136478.85874999993]
[null,null,null,1196,114.19659999999995,136579.13359999994]
[null,null,null,1197,114.18494999999994,136679.38514999993]
[null,null,null,1198,114.17329999999994,136779.61339999991]
[null,null,null,1199,114.16164999999994,136879.81834999993]
[null,null,null,1200,114.14999999999993,136979.99999999991]
[null,null,null,1201,114.13834999999993,137080.15834999993]
[null,null,null,1202,114.12669999999993,137180.29339999991]
[null,null,null,1203,114.11504999999993,137280.40514999992]
[null,null,null,1204,114.10339999999992,137380.4935999999]
[null,null,null,1205,114.09174999999992,137480.55874999991]
[null,null,null,1206,114.08009999999992,137580.60059999989]
[null,null,null,1207,114.06844999999991,137680.6191499999]
[null,null,null,1208,114.05679999999991,137780.6143999999]
[null,null,null,1209,114.04514999999991,137880.58634999988]
[null,null,null,1210,114.0334999999999,137980.53499999989]
[null,null,null,1211,114.0218499999999,138080.46034999989]
[null,null,null,1212,114.0101999999999,138180.36239999987]
[null,null,null,1213,113.9985499999999,138280.24114999987]
[null,null,null,1214,113.98689999999989,138380.09659999987]
[null,null,null,1215,113.97524999999989,138479.92874999988]
[null,null,null,1216,113.96359999999989,138579.73759999985]
[null,null,null,1217,113.95194999999988,138679.52314999985]
[null,null,null,1218,113.94029999999988,138779.28539999985]
[null,null,null,1219,113.92864999999988,138879.02434999985]
[null,null,null,1220,113.91699999999987,138978.73999999985]
[null,null,null,1221,113.90534999999987,139078.43234999984]
[null,null,null,1222,113.89369999999987,139178.10139999984]
[null,null,null,1223,113.88204999999986,139277.74714999984]
[null,null,null,1224,113.87039999999986,139377.36959999983]
[null,null,null,1225,113.85874999999986,139476.96874999983]
[null,null,null,1226,113.84709999999986,139576.54459999982]
[null,null,null,1227,113.83544999999985,139676.09714999981]
[null,null,null,1228,113.82379999999985,139775.6263999998]
[null,null,null,1229,113.81214999999985,139875.13234999983]
[null,null,null,1230,113.80049999999984,139974.61499999982]
[null,null,null,1231,113.78884999999984,140074.07434999981]
[null,null,null,1232,113.77719999999984,140173.5103999998]
[null,null,null,1233,113.76554999999983,140272.92314999978]
[null,null,null,1234,113.75389999999983,140372.3125999998]
[null,null,null,1235,113.74224999999983,140471.67874999979]
[null,null,null,1236,113.73059999999982,140571.02159999977]
[null,null,null,1237,113.71894999999982,140670.34114999979]
[null,null,null,1238,113.70729999999982,140769.63739999977]
[null,null,null,1239,113.69564999999982,140868.91034999976]
[null,null,null,1240,113.68399999999981,140968.15999999977]
[null,null,null,1241,113.67234999999981,141067.38634999975]
[null,null,null,1242,113.66069999999981,141166.58939999976]
[null,null,null,1243,113.6490499999998,141265.76914999975]
[null,null,null,1244,113.6373999999998,141364.92559999975]
[null,null,null,1245,113.6257499999998,141464.05874999973]
[null,null,null,1246,113.61409999999979,141563.16859999974]
[null,null,null,1247,113.60244999999979,141662.25514999975]
[null,null,null,1248,113.59079999999979,141761.31839999973]
[null,null,null,1249,113.57914999999979,141860.35834999973]
[null,null,null,1250,113.56749999999978,141959.37499999974]
[null,null,null,1251,113.55584999999978,142058.36834999971]
[null,null,null,1252,113.54419999999978,{"$f":"E1269*D1269","v":142157.33839999972}]
[null,null,null,1253,113.53254999999977,142256.28514999972]
[null,null,null,1254,113.52089999999977,142355.20859999972]
[null,null,null,1255,113.50924999999977,142454.10874999969]
[null,null,null,1256,113.49759999999976,142552.98559999969]
[null,null,null,1257,{"$f":"E1273-$F$12","v":113.48594999999976},142651.83914999969]
[null,null,null,1258,113.47429999999976,142750.66939999969]
[null,null,null,1259,113.46264999999975,142849.47634999969]
[null,null,null,1260,113.45099999999975,142948.25999999969]
[null,null,null,1261,113.43934999999975,143047.02034999969]
[null,null,null,1262,113.42769999999975,143145.75739999968]
[null,null,null,1263,113.41604999999974,143244.47114999968]
[null,null,null,1264,113.40439999999974,143343.16159999967]
[null,null,null,1265,113.39274999999974,143441.82874999967]
[null,null,null,1266,113.38109999999973,143540.47259999966]
[null,null,null,1267,113.36944999999973,143639.09314999965]
[null,null,null,1268,113.35779999999973,143737.69039999964]
[null,null,null,1269,113.34614999999972,143836.26434999966]
[null,null,null,1270,113.33449999999972,143934.81499999965]
[null,null,null,1271,113.32284999999972,144033.34234999964]
[null,null,null,1272,113.31119999999972,144131.84639999963]
[null,null,null,1273,113.29954999999971,144230.32714999965]
[null,null,null,1274,113.28789999999971,144328.78459999964]
[null,null,null,1275,113.27624999999971,144427.21874999962]
[null,null,null,1276,113.2645999999997,144525.62959999961]
[null,null,null,1277,113.2529499999997,144624.01714999962]
[null,null,null,1278,113.2412999999997,144722.38139999961]
[null,null,null,1279,113.22964999999969,144820.72234999962]
[null,null,null,1280,113.21799999999969,144919.0399999996]
[null,null,null,1281,113.20634999999969,145017.33434999961]
[null,null,null,1282,113.19469999999968,145115.60539999959]
[null,null,null,1283,113.18304999999968,145213.8531499996]
[null,null,null,1284,113.17139999999968,145312.07759999958]
[null,null,null,1285,113.15974999999968,145410.27874999959]
[null,null,null,1286,113.14809999999967,145508.45659999957]
[null,null,null,1287,113.13644999999967,145606.61114999957]
[null,null,null,1288,113.12479999999967,145704.74239999958]
[null,null,null,1289,113.11314999999966,145802.85034999956]
[null,null,null,1290,113.10149999999966,145900.93499999956]
[null,null,null,1291,113.08984999999966,145998.99634999956]
[null,null,null,1292,113.07819999999965,146097.03439999957]
[null,null,null,1293,113.06654999999965,146195.04914999954]
[null,null,null,1294,113.05489999999965,146293.04059999954]
[null,null,null,1295,113.04324999999965,146391.00874999954]
[null,null,null,1296,113.03159999999964,146488.95359999954]
[null,null,null,1297,113.01994999999964,146586.87514999954]
[null,null,null,1298,113.00829999999964,146684.77339999954]
[null,null,null,1299,112.99664999999963,146782.64834999954]
[null,null,null,1300,112.98499999999963,146880.49999999951]
[null,null,null,1301,112.97334999999963,146978.3283499995]
[null,null,null,1302,112.96169999999962,147076.1333999995]
[null,null,null,1303,112.95004999999962,147173.91514999949]
[null,null,null,1304,112.93839999999962,147271.67359999951]
[null,null,null,1305,112.92674999999961,147369.40874999951]
[null,null,null,1306,112.91509999999961,147467.1205999995]
[null,null,null,1307,112.90344999999961,147564.80914999949]
[null,null,null,1308,112.89179999999961,147662.47439999948]
[null,null,null,1309,112.8801499999996,147760.11634999947]
[null,null,null,1310,112.8684999999996,147857.73499999946]
[null,null,null,1311,112.8568499999996,147955.33034999948]
[null,null,null,1312,112.84519999999959,148052.90239999947]
[null,null,null,1313,112.83354999999959,148150.45114999946]
[null,null,null,1314,112.82189999999959,148247.97659999947]
[null,null,null,1315,112.81024999999958,148345.47874999946]
[null,null,null,1316,112.79859999999958,{"$f":"E1333*D1333","v":148442.95759999944}]
[null,null,null,1317,112.78694999999958,148540.41314999945]
[null,null,null,1318,112.77529999999958,148637.84539999944]
[null,null,null,1319,112.76364999999957,148735.25434999945]
[null,null,null,1320,112.75199999999957,148832.63999999943]
[null,null,null,1321,{"$f":"E1337-$F$12","v":112.74034999999957},148930.00234999941]
[null,null,null,1322,112.72869999999956,149027.34139999942]
[null,null,null,1323,112.71704999999956,149124.65714999943]
[null,null,null,1324,112.70539999999956,149221.94959999941]
[null,null,null,1325,112.69374999999955,149319.21874999942]
[null,null,null,1326,112.68209999999955,149416.4645999994]
[null,null,null,1327,112.67044999999955,149513.6871499994]
[null,null,null,1328,112.65879999999954,149610.88639999941]
[null,null,null,1329,112.64714999999954,149708.06234999938]
[null,null,null,1330,112.63549999999954,149805.21499999939]
[null,null,null,1331,112.62384999999954,149902.34434999939]
[null,null,null,1332,112.61219999999953,149999.45039999939]
[null,null,null,1333,112.60054999999953,150096.53314999936]
[null,null,null,1334,112.58889999999953,150193.59259999936]
[null,null,null,1335,112.57724999999952,150290.62874999936]
[null,null,null,1336,112.56559999999952,150387.64159999936]
[null,null,null,1337,112.55394999999952,150484.63114999936]
[null,null,null,1338,112.54229999999951,150581.59739999936]
[null,null,null,1339,112.53064999999951,150678.54034999936]
[null,null,null,1340,112.51899999999951,150775.45999999935]
[null,null,null,1341,112.50734999999951,150872.35634999935]
[null,null,null,1342,112.4956999999995,150969.22939999934]
[null,null,null,1343,112.4840499999995,151066.07914999934]
[null,null,null,1344,112.4723999999995,151162.90559999933]
[null,null,null,1345,112.46074999999949,151259.70874999932]
[null,null,null,1346,112.44909999999949,151356.48859999931]
[null,null,null,1347,112.43744999999949,151453.2451499993]
[null,null,null,1348,112.42579999999948,151549.97839999929]
[null,null,null,1349,112.41414999999948,151646.68834999931]
[null,null,null,1350,112.40249999999948,151743.3749999993]
[null,null,null,1351,112.39084999999947,151840.03834999929]
[null,null,null,1352,112.37919999999947,151936.67839999928]
[null,null,null,1353,112.36754999999947,152033.29514999929]
[null,null,null,1354,112.35589999999947,152129.88859999928]
[null,null,null,1355,112.34424999999946,152226.45874999926]
[null,null,null,1356,112.33259999999946,152323.00559999928]
[null,null,null,1357,112.32094999999946,152419.52914999926]
[null,null,null,1358,112.30929999999945,152516.02939999927]
[null,null,null,1359,112.29764999999945,152612.50634999925]
[null,null,null,1360,112.28599999999945,152708.95999999924]
[null,null,null,1361,112.27434999999944,152805.39034999924]
[null,null,null,1362,112.26269999999944,152901.79739999922]
[null,null,null,1363,112.25104999999944,152998.18114999923]
[null,null,null,1364,112.23939999999943,153094.54159999924]
[null,null,null,1365,112.22774999999943,153190.87874999922]
[null,null,null,1366,112.21609999999943,153287.19259999922]
[null,null,null,1367,112.20444999999943,153383.48314999923]
[null,null,null,1368,112.19279999999942,153479.7503999992]
[null,null,null,1369,112.18114999999942,153575.99434999921]
[null,null,null,1370,112.16949999999942,153672.21499999921]
[null,null,null,1371,112.15784999999941,153768.41234999918]
[null,null,null,1372,112.14619999999941,153864.58639999919]
[null,null,null,1373,112.13454999999941,153960.73714999919]
[null,null,null,1374,112.1228999999994,154056.86459999919]
[null,null,null,1375,112.1112499999994,154152.96874999919]
[null,null,null,1376,112.0995999999994,154249.04959999918]
[null,null,null,1377,112.0879499999994,154345.10714999918]
[null,null,null,1378,112.07629999999939,154441.14139999915]
[null,null,null,1379,112.06464999999939,154537.15234999915]
[null,null,null,1380,112.05299999999939,{"$f":"E1397*D1397","v":154633.13999999914}]
[null,null,null,1381,112.04134999999938,154729.10434999914]
[null,null,null,1382,112.02969999999938,154825.04539999913]
[null,null,null,1383,112.01804999999938,154920.96314999915]
[null,null,null,1384,112.00639999999937,155016.85759999914]
[null,null,null,1385,{"$f":"E1401-$F$12","v":111.99474999999937},155112.72874999914]
[null,null,null,1386,111.98309999999937,155208.57659999913]
[null,null,null,1387,111.97144999999936,155304.40114999912]
[null,null,null,1388,111.95979999999936,155400.20239999911]
[null,null,null,1389,111.94814999999936,155495.9803499991]
[null,null,null,1390,111.93649999999936,155591.73499999911]
[null,null,null,1391,111.92484999999935,155687.4663499991]
[null,null,null,1392,111.91319999999935,155783.17439999909]
[null,null,null,1393,111.90154999999935,155878.8591499991]
[null,null,null,1394,111.88989999999934,155974.52059999909]
[null,null,null,1395,111.87824999999934,156070.15874999907]
[null,null,null,1396,111.86659999999934,156165.77359999908]
[null,null,null,1397,111.85494999999933,156261.36514999907]
[null,null,null,1398,111.84329999999933,156356.93339999908]
[null,null,null,1399,111.83164999999933,156452.47834999906]
[null,null,null,1400,111.81999999999933,156547.99999999907]
[null,null,null,1401,111.80834999999932,156643.49834999905]
[null,null,null,1402,111.79669999999932,156738.97339999906]
[null,null,null,1403,111.78504999999932,156834.42514999904]
[null,null,null,1404,111.77339999999931,156929.85359999904]
[null,null,null,1405,111.76174999999931,157025.25874999902]
[null,null,null,1406,111.75009999999931,157120.64059999902]
[null,null,null,1407,111.7384499999993,157215.99914999903]
[null,null,null,1408,111.7267999999993,157311.334399999]
[null,null,null,1409,111.7151499999993,157406.64634999901]
[null,null,null,1410,111.70349999999929,157501.93499999901]
[null,null,null,1411,111.69184999999929,157597.20034999901]
[null,null,null,1412,111.68019999999929,157692.44239999898]
[null,null,null,1413,111.66854999999929,157787.66114999898]
[null,null,null,1414,111.65689999999928,157882.85659999898]
[null,null,null,1415,111.64524999999928,157978.02874999898]
[null,null,null,1416,111.63359999999928,158073.17759999898]
[null,null,null,1417,111.62194999999927,158168.30314999897]
[null,null,null,1418,111.61029999999927,158263.40539999897]
[null,null,null,1419,111.59864999999927,158358.48434999897]
[null,null,null,1420,111.58699999999926,158453.53999999896]
[null,null,null,1421,111.57534999999926,158548.57234999895]
[null,null,null,1422,111.56369999999926,158643.58139999895]
[null,null,null,1423,111.55204999999926,158738.56714999894]
[null,null,null,1424,111.54039999999925,158833.52959999893]
[null,null,null,1425,111.52874999999925,158928.46874999892]
[null,null,null,1426,111.51709999999925,159023.38459999891]
[null,null,null,1427,111.50544999999924,159118.27714999893]
[null,null,null,1428,111.49379999999924,159213.14639999892]
[null,null,null,1429,111.48214999999924,159307.99234999891]
[null,null,null,1430,111.47049999999923,159402.8149999989]
[null,null,null,1431,111.45884999999923,159497.61434999891]
[null,null,null,1432,111.44719999999923,159592.3903999989]
[null,null,null,1433,111.43554999999922,159687.14314999888]
[null,null,null,1434,111.42389999999922,159781.8725999989]
[null,null,null,1435,111.41224999999922,159876.57874999888]
[null,null,null,1436,111.40059999999922,159971.26159999886]
[null,null,null,1437,111.38894999999921,160065.92114999887]
[null,null,null,1438,111.37729999999921,160160.55739999886]
[null,null,null,1439,111.36564999999921,160255.17034999887]
[null,null,null,1440,111.3539999999992,160349.75999999885]
[null,null,null,1441,111.3423499999992,160444.32634999885]
[null,null,null,1442,111.3306999999992,160538.86939999883]
[null,null,null,1443,111.31904999999919,160633.38914999884]
[null,null,null,1444,111.30739999999919,{"$f":"E1461*D1461","v":160727.88559999884}]
[null,null,null,1445,111.29574999999919,160822.35874999882]
[null,null,null,1446,111.28409999999919,160916.80859999883]
[null,null,null,1447,111.27244999999918,161011.23514999883]
[null,null,null,1448,111.26079999999918,161105.6383999988]
[null,null,null,1449,{"$f":"E1465-$F$12","v":111.24914999999918},161200.01834999881]
[null,null,null,1450,111.23749999999917,161294.37499999881]
[null,null,null,1451,111.22584999999917,161388.70834999881]
[null,null,null,1452,111.21419999999917,161483.01839999878]
[null,null,null,1453,111.20254999999916,161577.30514999878]
[null,null,null,1454,111.19089999999916,161671.56859999878]
[null,null,null,1455,111.17924999999916,161765.80874999877]
[null,null,null,1456,111.16759999999915,161860.02559999877]
[null,null,null,1457,111.15594999999915,161954.21914999877]
[null,null,null,1458,111.14429999999915,162048.38939999876]
[null,null,null,1459,111.13264999999915,162142.53634999876]
[null,null,null,1460,111.12099999999914,162236.65999999875]
[null,null,null,1461,111.10934999999914,162330.76034999875]
[null,null,null,1462,111.09769999999914,162424.83739999874]
[null,null,null,1463,111.08604999999913,162518.89114999873]
[null,null,null,1464,111.07439999999913,162612.92159999872]
[null,null,null,1465,111.06274999999913,162706.92874999871]
[null,null,null,1466,111.05109999999912,162800.91259999873]
[null,null,null,1467,111.03944999999912,162894.87314999872]
[null,null,null,1468,111.02779999999912,162988.81039999871]
[null,null,null,1469,111.01614999999912,163082.72434999869]
[null,null,null,1470,111.00449999999911,163176.61499999868]
[null,null,null,1471,110.99284999999911,163270.4823499987]
[null,null,null,1472,110.98119999999911,163364.32639999868]
[null,null,null,1473,110.9695499999991,163458.14714999867]
[null,null,null,1474,110.9578999999991,163551.94459999868]
[null,null,null,1475,110.9462499999991,163645.71874999866]
[null,null,null,1476,110.93459999999909,163739.46959999867]
[null,null,null,1477,110.92294999999909,163833.19714999865]
[null,null,null,1478,110.91129999999909,163926.90139999866]
[null,null,null,1479,110.89964999999908,164020.58234999864]
[null,null,null,1480,110.88799999999908,164114.23999999865]
[null,null,null,1481,110.87634999999908,164207.87434999863]
[null,null,null,1482,110.86469999999908,164301.48539999864]
[null,null,null,1483,110.85304999999907,164395.07314999861]
[null,null,null,1484,110.84139999999907,164488.63759999862]
[null,null,null,1485,110.82974999999907,164582.17874999862]
[null,null,null,1486,110.81809999999906,164675.6965999986]
[null,null,null,1487,110.80644999999906,164769.1911499986]
[null,null,null,1488,110.79479999999906,164862.6623999986]
[null,null,null,1489,110.78314999999905,164956.11034999861]
[null,null,null,1490,110.77149999999905,165049.53499999858]
[null,null,null,1491,110.75984999999905,165142.93634999858]
[null,null,null,1492,110.74819999999904,165236.31439999858]
[null,null,null,1493,110.73654999999904,165329.66914999858]
[null,null,null,1494,110.72489999999904,165423.00059999857]
[null,null,null,1495,110.71324999999904,165516.30874999857]
[null,null,null,1496,110.70159999999903,165609.59359999857]
[null,null,null,1497,110.68994999999903,165702.85514999853]
[null,null,null,1498,110.67829999999903,165796.09339999853]
[null,null,null,1499,110.66664999999902,165889.30834999852]
[null,null,null,1500,110.65499999999902,165982.49999999854]
[null,null,null,1501,110.64334999999902,166075.66834999854]
[null,null,null,1502,110.63169999999901,166168.81339999853]
[null,null,null,1503,110.62004999999901,166261.93514999852]
[null,null,null,1504,110.60839999999901,166355.03359999851]
[null,null,null,1505,110.59674999999901,166448.1087499985]
[null,null,null,1506,110.585099999999,166541.16059999849]
[null,null,null,1507,110.573449999999,166634.18914999848]
[null,null,null,1508,110.561799999999,{"$f":"E1525*D1525","v":166727.19439999849}]
[null,null,null,1509,110.55014999999899,166820.17634999848]
[null,null,null,1510,110.53849999999899,166913.13499999847]
[null,null,null,1511,110.52684999999899,167006.07034999848]
[null,null,null,1512,110.51519999999898,167098.98239999847]
[null,null,null,1513,{"$f":"E1529-$F$12","v":110.50354999999898},167191.87114999845]
[null,null,null,1514,110.49189999999898,167284.73659999846]
[null,null,null,1515,110.48024999999897,167377.57874999844]
[null,null,null,1516,110.46859999999897,167470.39759999845]
[null,null,null,1517,110.45694999999897,167563.19314999843]
[null,null,null,1518,110.44529999999897,167655.96539999844]
[null,null,null,1519,110.43364999999896,167748.71434999842]
[null,null,null,1520,110.42199999999896,167841.43999999843]
[null,null,null,1521,110.41034999999896,167934.14234999841]
[null,null,null,1522,110.39869999999895,168026.82139999841]
[null,null,null,1523,110.38704999999895,168119.47714999839]
[null,null,null,1524,110.37539999999895,168212.1095999984]
[null,null,null,1525,110.36374999999894,168304.7187499984]
[null,null,null,1526,110.35209999999894,168397.30459999837]
[null,null,null,1527,110.34044999999894,168489.86714999838]
[null,null,null,1528,110.32879999999894,168582.40639999838]
[null,null,null,1529,110.31714999999893,168674.92234999838]
[null,null,null,1530,110.30549999999893,168767.41499999835]
[null,null,null,1531,110.29384999999893,168859.88434999835]
[null,null,null,1532,110.28219999999892,168952.33039999835]
[null,null,null,1533,110.27054999999892,169044.75314999835]
[null,null,null,1534,110.25889999999892,169137.15259999834]
[null,null,null,1535,110.24724999999891,169229.52874999834]
[null,null,null,1536,110.23559999999891,169321.88159999833]
[null,null,null,1537,110.22394999999891,169414.21114999833]
[null,null,null,1538,110.2122999999989,169506.51739999832]
[null,null,null,1539,110.2006499999989,169598.80034999832]
[null,null,null,1540,110.1889999999989,169691.05999999831]
[null,null,null,1541,110.1773499999989,169783.2963499983]
[null,null,null,1542,110.16569999999889,169875.50939999829]
[null,null,null,1543,110.15404999999889,169967.69914999828]
[null,null,null,1544,110.14239999999889,170059.86559999827]
[null,null,null,1545,110.13074999999888,170152.00874999826]
[null,null,null,1546,110.11909999999888,170244.12859999828]
[null,null,null,1547,110.10744999999888,170336.22514999827]
[null,null,null,1548,110.09579999999887,170428.29839999825]
[null,null,null,1549,110.08414999999887,170520.34834999824]
[null,null,null,1550,110.07249999999887,170612.37499999825]
[null,null,null,1551,110.06084999999887,170704.37834999824]
[null,null,null,1552,110.04919999999886,170796.35839999822]
[null,null,null,1553,110.03754999999886,170888.31514999823]
[null,null,null,1554,110.02589999999886,170980.24859999822]
[null,null,null,1555,110.01424999999885,171072.15874999823]
[null,null,null,1556,110.00259999999885,171164.04559999821]
[null,null,null,1557,109.99094999999885,171255.90914999822]
[null,null,null,1558,109.97929999999884,171347.7493999982]
[null,null,null,1559,109.96764999999884,171439.5663499982]
[null,null,null,1560,109.95599999999884,171531.35999999818]
[null,null,null,1561,109.94434999999883,171623.13034999819]
[null,null,null,1562,109.93269999999883,171714.87739999816]
[null,null,null,1563,109.92104999999883,171806.60114999817]
[null,null,null,1564,109.90939999999883,171898.30159999817]
[null,null,null,1565,109.89774999999882,171989.97874999815]
[null,null,null,1566,109.88609999999882,172081.63259999815]
[null,null,null,1567,109.87444999999882,172173.26314999815]
[null,null,null,1568,109.86279999999881,172264.87039999815]
[null,null,null,1569,109.85114999999881,172356.45434999812]
[null,null,null,1570,109.83949999999881,172448.01499999812]
[null,null,null,1571,109.8278499999988,172539.55234999812]
[null,null,null,1572,109.8161999999988,{"$f":"E1589*D1589","v":172631.06639999812}]
[null,null,null,1573,109.8045499999988,172722.55714999812]
[null,null,null,1574,109.7928999999988,172814.02459999811]
[null,null,null,1575,109.78124999999879,172905.46874999811]
[null,null,null,1576,109.76959999999879,172996.8895999981]
[null,null,null,1577,{"$f":"E1593-$F$12","v":109.75794999999879},173088.2871499981]
[null,null,null,1578,109.74629999999878,173179.66139999809]
[null,null,null,1579,109.73464999999878,173271.01234999808]
[null,null,null,1580,109.72299999999878,173362.33999999808]
[null,null,null,1581,109.71134999999877,173453.64434999807]
[null,null,null,1582,109.69969999999877,173544.92539999806]
[null,null,null,1583,109.68804999999877,173636.18314999805]
[null,null,null,1584,109.67639999999876,173727.41759999804]
[null,null,null,1585,109.66474999999876,173818.62874999802]
[null,null,null,1586,109.65309999999876,173909.81659999804]
[null,null,null,1587,109.64144999999876,174000.98114999803]
[null,null,null,1588,109.62979999999875,174092.12239999801]
[null,null,null,1589,109.61814999999875,174183.240349998]
[null,null,null,1590,109.60649999999875,174274.33499999801]
[null,null,null,1591,109.59484999999874,174365.406349998]
[null,null,null,1592,109.58319999999874,174456.45439999801]
[null,null,null,1593,109.57154999999874,174547.47914999799]
[null,null,null,1594,109.55989999999873,174638.48059999797]
[null,null,null,1595,109.54824999999873,174729.45874999798]
[null,null,null,1596,109.53659999999873,174820.41359999796]
[null,null,null,1597,109.52494999999873,174911.34514999797]
[null,null,null,1598,109.51329999999872,175002.25339999795]
[null,null,null,1599,109.50164999999872,175093.13834999796]
[null,null,null,1600,109.48999999999872,175183.99999999793]
[null,null,null,1601,109.47834999999871,175274.83834999794]
[null,null,null,1602,109.46669999999871,175365.65339999794]
[null,null,null,1603,109.45504999999871,175456.44514999792]
[null,null,null,1604,109.4433999999987,175547.21359999792]
[null,null,null,1605,109.4317499999987,175637.95874999792]
[null,null,null,1606,109.4200999999987,175728.6805999979]
[null,null,null,1607,109.40844999999869,175819.3791499979]
[null,null,null,1608,109.39679999999869,175910.0543999979]
[null,null,null,1609,109.38514999999869,176000.7063499979]
[null,null,null,1610,109.37349999999869,176091.3349999979]
[null,null,null,1611,109.36184999999868,176181.94034999787]
[null,null,null,1612,109.35019999999868,176272.52239999786]
[null,null,null,1613,109.33854999999868,176363.08114999786]
[null,null,null,1614,109.32689999999867,176453.61659999785]
[null,null,null,1615,109.31524999999867,176544.12874999785]
[null,null,null,1616,109.30359999999867,176634.61759999784]
[null,null,null,1617,109.29194999999866,176725.08314999784]
[null,null,null,1618,109.28029999999866,176815.52539999783]
[null,null,null,1619,109.26864999999866,176905.94434999782]
[null,null,null,1620,109.25699999999865,176996.33999999781]
[null,null,null,1621,109.24534999999865,177086.7123499978]
[null,null,null,1622,109.23369999999865,177177.06139999779]
[null,null,null,1623,109.22204999999865,177267.38714999781]
[null,null,null,1624,109.21039999999864,177357.6895999978]
[null,null,null,1625,109.19874999999864,177447.96874999779]
[null,null,null,1626,109.18709999999864,177538.22459999777]
[null,null,null,1627,109.17544999999863,177628.45714999779]
[null,null,null,1628,109.16379999999863,177718.66639999778]
[null,null,null,1629,109.15214999999863,177808.85234999776]
[null,null,null,1630,109.14049999999862,177899.01499999774]
[null,null,null,1631,109.12884999999862,177989.15434999776]
[null,null,null,1632,109.11719999999862,178079.27039999774]
[null,null,null,1633,109.10554999999862,178169.36314999775]
[null,null,null,1634,109.09389999999861,178259.43259999773]
[null,null,null,1635,109.08224999999861,178349.47874999774]
[null,null,null,1636,109.07059999999861,{"$f":"E1653*D1653","v":178439.50159999772}]
[null,null,null,1637,109.0589499999986,178529.50114999773]
[null,null,null,1638,109.0472999999986,178619.4773999977]
[null,null,null,1639,109.0356499999986,178709.43034999771]
[null,null,null,1640,109.02399999999859,178799.35999999769]
[null,null,null,1641,{"$f":"E1657-$F$12","v":109.01234999999859},178889.26634999769]
[null,null,null,1642,109.00069999999859,178979.1493999977]
[null,null,null,1643,108.98904999999858,179069.00914999767]
[null,null,null,1644,108.97739999999858,179158.84559999767]
[null,null,null,1645,108.96574999999858,179248.65874999767]
[null,null,null,1646,108.95409999999858,179338.44859999765]
[null,null,null,1647,108.94244999999857,179428.21514999765]
[null,null,null,1648,108.93079999999857,179517.95839999765]
[null,null,null,1649,108.91914999999857,179607.67834999764]
[null,null,null,1650,108.90749999999856,179697.37499999764]
[null,null,null,1651,108.89584999999856,179787.04834999761]
[null,null,null,1652,108.88419999999856,179876.69839999761]
[null,null,null,1653,108.87254999999855,179966.3251499976]
[null,null,null,1654,108.86089999999855,180055.9285999976]
[null,null,null,1655,108.84924999999855,180145.50874999759]
[null,null,null,1656,108.83759999999855,180235.06559999759]
[null,null,null,1657,108.82594999999854,180324.59914999758]
[null,null,null,1658,108.81429999999854,180414.10939999757]
[null,null,null,1659,108.80264999999854,180503.59634999756]
[null,null,null,1660,108.79099999999853,180593.05999999755]
[null,null,null,1661,108.77934999999853,180682.50034999757]
[null,null,null,1662,108.76769999999853,180771.91739999756]
[null,null,null,1663,108.75604999999852,180861.31114999755]
[null,null,null,1664,108.74439999999852,180950.68159999754]
[null,null,null,1665,108.73274999999852,181040.02874999752]
[null,null,null,1666,108.72109999999851,181129.35259999754]
[null,null,null,1667,108.70944999999851,181218.65314999752]
[null,null,null,1668,108.69779999999851,181307.93039999751]
[null,null,null,1669,108.68614999999851,181397.18434999749]
[null,null,null,1670,108.6744999999985,181486.41499999751]
[null,null,null,1671,108.6628499999985,181575.62234999749]
[null,null,null,1672,108.6511999999985,181664.8063999975]
[null,null,null,1673,108.63954999999849,181753.96714999748]
[null,null,null,1674,108.62789999999849,181843.10459999746]
[null,null,null,1675,108.61624999999849,181932.21874999747]
[null,null,null,1676,108.60459999999848,182021.30959999745]
[null,null,null,1677,108.59294999999848,182110.37714999745]
[null,null,null,1678,108.58129999999848,182199.42139999746]
[null,null,null,1679,108.56964999999848,182288.44234999744]
[null,null,null,1680,108.55799999999847,182377.43999999744]
[null,null,null,1681,108.54634999999847,182466.41434999742]
[null,null,null,1682,108.53469999999847,182555.36539999742]
[null,null,null,1683,108.52304999999846,182644.29314999742]
[null,null,null,1684,108.51139999999846,182733.19759999739]
[null,null,null,1685,108.49974999999846,182822.0787499974]
[null,null,null,1686,108.48809999999845,182910.9365999974]
[null,null,null,1687,108.47644999999845,182999.7711499974]
[null,null,null,1688,108.46479999999845,183088.58239999737]
[null,null,null,1689,108.45314999999844,183177.37034999736]
[null,null,null,1690,108.44149999999844,183266.13499999736]
[null,null,null,1691,108.42984999999844,183354.87634999736]
[null,null,null,1692,108.41819999999844,183443.59439999735]
[null,null,null,1693,108.40654999999843,183532.28914999735]
[null,null,null,1694,108.39489999999843,183620.96059999734]
[null,null,null,1695,108.38324999999843,183709.60874999734]
[null,null,null,1696,108.37159999999842,183798.23359999733]
[null,null,null,1697,108.35994999999842,183886.83514999732]
[null,null,null,1698,108.34829999999842,183975.41339999731]
[null,null,null,1699,108.33664999999841,184063.9683499973]
[null,null,null,1700,108.32499999999841,{"$f":"E1717*D1717","v":184152.49999999729}]
[null,null,null,1701,108.31334999999841,184241.00834999728]
[null,null,null,1702,108.30169999999841,184329.4933999973]
[null,null,null,1703,108.2900499999984,184417.95514999729]
[null,null,null,1704,108.2783999999984,184506.39359999727]
[null,null,null,1705,{"$f":"E1721-$F$12","v":108.2667499999984},184594.80874999726]
[null,null,null,1706,108.25509999999839,184683.20059999725]
[null,null,null,1707,108.24344999999839,184771.56914999726]
[null,null,null,1708,108.23179999999839,184859.91439999724]
[null,null,null,1709,108.22014999999838,184948.23634999723]
[null,null,null,1710,108.20849999999838,185036.53499999724]
[null,null,null,1711,108.19684999999838,185124.81034999722]
[null,null,null,1712,108.18519999999837,185213.06239999723]
[null,null,null,1713,108.17354999999837,185301.29114999721]
[null,null,null,1714,108.16189999999837,185389.49659999719]
[null,null,null,1715,108.15024999999837,185477.6787499972]
[null,null,null,1716,108.13859999999836,185565.83759999718]
[null,null,null,1717,108.12694999999836,185653.97314999718]
[null,null,null,1718,108.11529999999836,185742.08539999719]
[null,null,null,1719,108.10364999999835,185830.17434999716]
[null,null,null,1720,108.09199999999835,185918.23999999717]
[null,null,null,1721,108.08034999999835,186006.28234999714]
[null,null,null,1722,108.06869999999834,186094.30139999714]
[null,null,null,1723,108.05704999999834,186182.29714999715]
[null,null,null,1724,108.04539999999834,186270.26959999715]
[null,null,null,1725,108.03374999999834,186358.21874999712]
[null,null,null,1726,108.02209999999833,186446.14459999712]
[null,null,null,1727,108.01044999999833,186534.04714999712]
[null,null,null,1728,107.99879999999833,186621.92639999712]
[null,null,null,1729,107.98714999999832,186709.78234999711]
[null,null,null,1730,107.97549999999832,186797.61499999708]
[null,null,null,1731,107.96384999999832,186885.42434999708]
[null,null,null,1732,107.95219999999831,186973.21039999707]
[null,null,null,1733,107.94054999999831,187060.97314999707]
[null,null,null,1734,107.92889999999831,187148.71259999706]
[null,null,null,1735,107.9172499999983,187236.42874999705]
[null,null,null,1736,107.9055999999983,187324.12159999704]
[null,null,null,1737,107.8939499999983,187411.79114999704]
[null,null,null,1738,107.8822999999983,187499.43739999703]
[null,null,null,1739,107.87064999999829,187587.06034999702]
[null,null,null,1740,107.85899999999829,187674.65999999703]
[null,null,null,1741,107.84734999999829,187762.23634999702]
[null,null,null,1742,107.83569999999828,187849.78939999701]
[null,null,null,1743,107.82404999999828,187937.319149997]
[null,null,null,1744,107.81239999999828,188024.82559999698]
[null,null,null,1745,107.80074999999827,188112.308749997]
[null,null,null,1746,107.78909999999827,188199.76859999698]
[null,null,null,1747,107.77744999999827,188287.20514999697]
[null,null,null,1748,107.76579999999826,188374.61839999698]
[null,null,null,1749,107.75414999999826,188462.00834999696]
[null,null,null,1750,107.74249999999826,188549.37499999694]
[null,null,null,1751,107.73084999999826,188636.71834999695]
[null,null,null,1752,107.71919999999825,188724.03839999693]
[null,null,null,1753,107.70754999999825,188811.33514999694]
[null,null,null,1754,107.69589999999825,188898.60859999692]
[null,null,null,1755,107.68424999999824,188985.85874999693]
[null,null,null,1756,107.67259999999824,189073.08559999691]
[null,null,null,1757,107.66094999999824,189160.28914999691]
[null,null,null,1758,107.64929999999823,189247.46939999689]
[null,null,null,1759,107.63764999999823,189334.62634999689]
[null,null,null,1760,107.62599999999823,189421.7599999969]
[null,null,null,1761,107.61434999999823,189508.87034999687]
[null,null,null,1762,107.60269999999822,189595.95739999687]
[null,null,null,1763,107.59104999999822,189683.02114999687]
[null,null,null,1764,107.57939999999822,{"$f":"E1781*D1781","v":189770.06159999684}]
[null,null,null,1765,107.56774999999821,189857.07874999684]
[null,null,null,1766,107.55609999999821,189944.07259999684]
[null,null,null,1767,107.54444999999821,190031.04314999684]
[null,null,null,1768,107.5327999999982,190117.99039999684]
[null,null,null,1769,{"$f":"E1785-$F$12","v":107.5211499999982},190204.9143499968]
[null,null,null,1770,107.5094999999982,190291.8149999968]
[null,null,null,1771,107.49784999999819,190378.6923499968]
[null,null,null,1772,107.48619999999819,190465.54639999679]
[null,null,null,1773,107.47454999999819,190552.37714999678]
[null,null,null,1774,107.46289999999819,190639.18459999678]
[null,null,null,1775,107.45124999999818,190725.96874999677]
[null,null,null,1776,107.43959999999818,190812.72959999676]
[null,null,null,1777,107.42794999999818,190899.46714999675]
[null,null,null,1778,107.41629999999817,190986.18139999674]
[null,null,null,1779,107.40464999999817,191072.87234999673]
[null,null,null,1780,107.39299999999817,191159.53999999675]
[null,null,null,1781,107.38134999999816,191246.18434999674]
[null,null,null,1782,107.36969999999816,191332.80539999672]
[null,null,null,1783,107.35804999999816,191419.40314999671]
[null,null,null,1784,107.34639999999816,191505.9775999967]
[null,null,null,1785,107.33474999999815,191592.52874999671]
[null,null,null,1786,107.32309999999815,191679.05659999669]
[null,null,null,1787,107.31144999999815,191765.56114999668]
[null,null,null,1788,107.29979999999814,191852.04239999669]
[null,null,null,1789,107.28814999999814,191938.50034999667]
[null,null,null,1790,107.27649999999814,192024.93499999665]
[null,null,null,1791,107.26484999999813,192111.34634999666]
[null,null,null,1792,107.25319999999813,192197.73439999664]
[null,null,null,1793,107.24154999999813,192284.09914999665]
[null,null,null,1794,107.22989999999812,192370.44059999663]
[null,null,null,1795,107.21824999999812,192456.75874999663]
[null,null,null,1796,107.20659999999812,192543.05359999661]
[null,null,null,1797,107.19494999999812,192629.32514999661]
[null,null,null,1798,107.18329999999811,192715.57339999662]
[null,null,null,1799,107.17164999999811,192801.79834999659]
[null,null,null,1800,107.15999999999811,192887.99999999659]
[null,null,null,1801,107.1483499999981,192974.1783499966]
[null,null,null,1802,107.1366999999981,193060.33339999657]
[null,null,null,1803,107.1250499999981,193146.46514999657]
[null,null,null,1804,107.11339999999809,193232.57359999657]
[null,null,null,1805,107.10174999999809,193318.65874999657]
[null,null,null,1806,107.09009999999809,193404.72059999654]
[null,null,null,1807,107.07844999999809,193490.75914999653]
[null,null,null,1808,107.06679999999808,193576.77439999653]
[null,null,null,1809,107.05514999999808,193662.76634999653]
[null,null,null,1810,107.04349999999808,193748.73499999652]
[null,null,null,1811,107.03184999999807,193834.68034999652]
[null,null,null,1812,107.02019999999807,193920.60239999651]
[null,null,null,1813,107.00854999999807,194006.5011499965]
[null,null,null,1814,106.99689999999806,194092.3765999965]
[null,null,null,1815,106.98524999999806,194178.22874999649]
[null,null,null,1816,106.97359999999806,194264.05759999648]
[null,null,null,1817,106.96194999999805,194349.86314999647]
[null,null,null,1818,106.95029999999805,194435.64539999646]
[null,null,null,1819,106.93864999999805,194521.40434999645]
[null,null,null,1820,106.92699999999805,194607.13999999643]
[null,null,null,1821,106.91534999999804,194692.85234999642]
[null,null,null,1822,106.90369999999804,194778.54139999644]
[null,null,null,1823,106.89204999999804,194864.20714999642]
[null,null,null,1824,106.88039999999803,194949.84959999641]
[null,null,null,1825,106.86874999999803,195035.46874999639]
[null,null,null,1826,106.85709999999803,195121.0645999964]
[null,null,null,1827,106.84544999999802,195206.63714999639]
[null,null,null,1828,106.83379999999802,{"$f":"E1845*D1845","v":195292.1863999964}]
[null,null,null,1829,106.82214999999802,195377.71234999638]
[null,null,null,1830,106.81049999999802,195463.21499999636]
[null,null,null,1831,106.79884999999801,195548.69434999637]
[null,null,null,1832,106.78719999999801,195634.15039999635]
[null,null,null,1833,{"$f":"E1849-$F$12","v":106.77554999999801},195719.58314999635]
[null,null,null,1834,106.763899999998,195804.99259999633]
[null,null,null,1835,106.752249999998,195890.37874999634]
[null,null,null,1836,106.740599999998,195975.74159999631]
[null,null,null,1837,106.72894999999799,196061.08114999632]
[null,null,null,1838,106.71729999999799,196146.39739999632]
[null,null,null,1839,106.70564999999799,196231.69034999629]
[null,null,null,1840,106.69399999999798,196316.9599999963]
[null,null,null,1841,106.68234999999798,196402.2063499963]
[null,null,null,1842,106.67069999999798,196487.42939999627]
[null,null,null,1843,106.65904999999798,196572.62914999627]
[null,null,null,1844,106.64739999999797,196657.80559999627]
[null,null,null,1845,106.63574999999797,196742.95874999627]
[null,null,null,1846,106.62409999999797,196828.08859999623]
[null,null,null,1847,106.61244999999796,196913.19514999623]
[null,null,null,1848,106.60079999999796,196998.27839999623]
[null,null,null,1849,106.58914999999796,197083.33834999622]
[null,null,null,1850,106.57749999999795,197168.37499999622]
[null,null,null,1851,106.56584999999795,197253.38834999621]
[null,null,null,1852,106.55419999999795,197338.3783999962]
[null,null,null,1853,106.54254999999795,197423.3451499962]
[null,null,null,1854,106.53089999999794,197508.28859999619]
[null,null,null,1855,106.51924999999794,197593.20874999618]
[null,null,null,1856,106.50759999999794,197678.10559999617]
[null,null,null,1857,106.49594999999793,197762.97914999616]
[null,null,null,1858,106.48429999999793,197847.82939999615]
[null,null,null,1859,106.47264999999793,197932.65634999613]
[null,null,null,1860,106.46099999999792,198017.45999999615]
[null,null,null,1861,106.44934999999792,198102.24034999614]
[null,null,null,1862,106.43769999999792,198186.99739999612]
[null,null,null,1863,106.42604999999791,198271.73114999611]
[null,null,null,1864,106.41439999999791,198356.44159999612]
[null,null,null,1865,106.40274999999791,198441.1287499961]
[null,null,null,1866,106.39109999999791,198525.79259999609]
[null,null,null,1867,106.3794499999979,198610.4331499961]
[null,null,null,1868,106.3677999999979,198695.05039999608]
[null,null,null,1869,106.3561499999979,198779.64434999606]
[null,null,null,1870,106.34449999999789,198864.21499999607]
[null,null,null,1871,106.33284999999789,198948.76234999605]
[null,null,null,1872,106.32119999999789,199033.28639999605]
[null,null,null,1873,106.30954999999788,199117.78714999603]
[null,null,null,1874,106.29789999999788,199202.26459999604]
[null,null,null,1875,106.28624999999788,199286.71874999601]
[null,null,null,1876,106.27459999999787,199371.14959999602]
[null,null,null,1877,106.26294999999787,199455.55714999599]
[null,null,null,1878,106.25129999999787,199539.94139999599]
[null,null,null,1879,106.23964999999787,199624.302349996]
[null,null,null,1880,106.22799999999786,199708.63999999597]
[null,null,null,1881,106.21634999999786,199792.95434999597]
[null,null,null,1882,106.20469999999786,199877.24539999597]
[null,null,null,1883,106.19304999999785,199961.51314999597]
[null,null,null,1884,106.18139999999785,200045.75759999594]
[null,null,null,1885,106.16974999999785,200129.97874999593]
[null,null,null,1886,106.15809999999784,200214.17659999593]
[null,null,null,1887,106.14644999999784,200298.35114999593]
[null,null,null,1888,106.13479999999784,200382.50239999592]
[null,null,null,1889,106.12314999999784,200466.63034999592]
[null,null,null,1890,106.11149999999783,200550.73499999591]
[null,null,null,1891,106.09984999999783,200634.8163499959]
[null,null,null,1892,106.08819999999783,{"$f":"E1909*D1909","v":200718.8743999959}]
[null,null,null,1893,106.07654999999782,200802.90914999589]
[null,null,null,1894,106.06489999999782,200886.92059999588]
[null,null,null,1895,106.05324999999782,200970.90874999587]
[null,null,null,1896,106.04159999999781,201054.87359999586]
[null,null,null,1897,{"$f":"E1913-$F$12","v":106.02994999999781},201138.81514999585]
[null,null,null,1898,106.01829999999781,201222.73339999584]
[null,null,null,1899,106.0066499999978,201306.62834999582]
[null,null,null,1900,105.9949999999978,201390.49999999581]
[null,null,null,1901,105.9833499999978,201474.34834999582]
[null,null,null,1902,105.9716999999978,201558.17339999581]
[null,null,null,1903,105.96004999999779,201641.97514999579]
[null,null,null,1904,105.94839999999779,201725.75359999581]
[null,null,null,1905,105.93674999999779,201809.50874999579]
[null,null,null,1906,105.92509999999778,201893.24059999577]
[null,null,null,1907,105.91344999999778,201976.94914999578]
[null,null,null,1908,105.90179999999778,202060.63439999576]
[null,null,null,1909,105.89014999999777,202144.29634999574]
[null,null,null,1910,105.87849999999777,202227.93499999575]
[null,null,null,1911,105.86684999999777,202311.55034999573]
[null,null,null,1912,105.85519999999777,202395.14239999573]
[null,null,null,1913,105.84354999999776,202478.71114999571]
[null,null,null,1914,105.83189999999776,202562.25659999572]
[null,null,null,1915,105.82024999999776,202645.77874999569]
[null,null,null,1916,105.80859999999775,202729.27759999569]
[null,null,null,1917,105.79694999999775,202812.7531499957]
[null,null,null,1918,105.78529999999775,202896.20539999567]
[null,null,null,1919,105.77364999999774,202979.63434999567]
[null,null,null,1920,105.76199999999774,203063.03999999567]
[null,null,null,1921,105.75034999999774,203146.42234999564]
[null,null,null,1922,105.73869999999773,203229.78139999564]
[null,null,null,1923,105.72704999999773,203313.11714999564]
[null,null,null,1924,105.71539999999773,203396.42959999564]
[null,null,null,1925,105.70374999999773,203479.71874999563]
[null,null,null,1926,105.69209999999772,203562.9845999956]
[null,null,null,1927,105.68044999999772,203646.2271499956]
[null,null,null,1928,105.66879999999772,203729.44639999559]
[null,null,null,1929,105.65714999999771,203812.64234999559]
[null,null,null,1930,105.64549999999771,203895.81499999558]
[null,null,null,1931,105.63384999999771,203978.96434999557]
[null,null,null,1932,105.6221999999977,204062.09039999556]
[null,null,null,1933,105.6105499999977,204145.19314999555]
[null,null,null,1934,105.5988999999977,204228.27259999554]
[null,null,null,1935,105.5872499999977,204311.32874999553]
[null,null,null,1936,105.57559999999769,204394.36159999552]
[null,null,null,1937,105.56394999999769,204477.37114999551]
[null,null,null,1938,105.55229999999769,204560.35739999553]
[null,null,null,1939,105.54064999999768,204643.32034999551]
[null,null,null,1940,105.52899999999768,204726.2599999955]
[null,null,null,1941,105.51734999999768,204809.17634999548]
[null,null,null,1942,105.50569999999767,204892.0693999955]
[null,null,null,1943,105.49404999999767,204974.93914999548]
[null,null,null,1944,105.48239999999767,205057.78559999546]
[null,null,null,1945,105.47074999999766,205140.60874999544]
[null,null,null,1946,105.45909999999766,205223.40859999546]
[null,null,null,1947,105.44744999999766,205306.18514999544]
[null,null,null,1948,105.43579999999766,205388.93839999544]
[null,null,null,1949,105.42414999999765,205471.66834999542]
[null,null,null,1950,105.41249999999765,205554.37499999543]
[null,null,null,1951,105.40084999999765,205637.05834999541]
[null,null,null,1952,105.38919999999764,205719.71839999541]
[null,null,null,1953,105.37754999999764,205802.35514999539]
[null,null,null,1954,105.36589999999764,205884.96859999539]
[null,null,null,1955,105.35424999999763,205967.55874999537]
[null,null,null,1956,105.34259999999763,{"$f":"E1973*D1973","v":206050.12559999537}]
[null,null,null,1957,105.33094999999763,206132.66914999534]
[null,null,null,1958,105.31929999999763,206215.18939999535]
[null,null,null,1959,105.30764999999762,206297.68634999535]
[null,null,null,1960,105.29599999999762,206380.15999999535]
[null,null,null,1961,{"$f":"E1977-$F$12","v":105.28434999999762},206462.61034999532]
[null,null,null,1962,105.27269999999761,206545.03739999532]
[null,null,null,1963,105.26104999999761,206627.44114999531]
[null,null,null,1964,105.24939999999761,206709.82159999531]
[null,null,null,1965,105.2377499999976,206792.17874999528]
[null,null,null,1966,105.2260999999976,206874.51259999527]
[null,null,null,1967,105.2144499999976,206956.82314999527]
[null,null,null,1968,105.20279999999759,207039.11039999526]
[null,null,null,1969,105.19114999999759,207121.37434999525]
[null,null,null,1970,105.17949999999759,207203.61499999525]
[null,null,null,1971,105.16784999999759,207285.83234999524]
[null,null,null,1972,105.15619999999758,207368.02639999523]
[null,null,null,1973,105.14454999999758,207450.19714999522]
[null,null,null,1974,105.13289999999758,207532.34459999521]
[null,null,null,1975,105.12124999999757,207614.4687499952]
[null,null,null,1976,105.10959999999757,207696.56959999519]
[null,null,null,1977,105.09794999999757,207778.6471499952]
[null,null,null,1978,105.08629999999756,207860.70139999519]
[null,null,null,1979,105.07464999999756,207942.73234999517]
[null,null,null,1980,105.06299999999756,208024.73999999516]
[null,null,null,1981,105.05134999999756,208106.72434999514]
[null,null,null,1982,105.03969999999755,208188.68539999516]
[null,null,null,1983,105.02804999999755,208270.62314999514]
[null,null,null,1984,105.01639999999755,208352.53759999512]
[null,null,null,1985,105.00474999999754,208434.42874999513]
[null,null,null,1986,104.99309999999754,208516.29659999511]
[null,null,null,1987,104.98144999999754,208598.14114999509]
[null,null,null,1988,104.96979999999753,208679.9623999951]
[null,null,null,1989,104.95814999999753,208761.76034999508]
[null,null,null,1990,104.94649999999753,208843.53499999508]
[null,null,null,1991,104.93484999999752,208925.28634999506]
[null,null,null,1992,104.92319999999752,209007.01439999507]
[null,null,null,1993,104.91154999999752,209088.71914999504]
[null,null,null,1994,104.89989999999752,209170.40059999505]
[null,null,null,1995,104.88824999999751,209252.05874999505]
[null,null,null,1996,104.87659999999751,209333.69359999502]
[null,null,null,1997,104.86494999999751,209415.30514999502]
[null,null,null,1998,104.8532999999975,209496.89339999502]
[null,null,null,1999,104.8416499999975,209578.45834999499]
[null,null,null,2000,104.8299999999975,209659.99999999499]
[null,null,null,2001,{"$f":"$E$13","v":104.83},209764.83]
[null,null,null,2002,104.83,209869.66]
[null,null,null,2003,104.83,209974.49]
[null,null,null,2004,104.83,210079.32]
[null,null,null,2005,104.83,210184.15]
[null,null,null,2006,104.83,210288.98]
[null,null,null,2007,104.83,210393.81]
[null,null,null,2008,104.83,210498.63999999998]
[null,null,null,2009,104.83,210603.47]
[null,null,null,2010,104.83,210708.3]
[null,null,null,2011,104.83,210813.13]
[null,null,null,2012,104.83,210917.96]
[null,null,null,2013,104.83,211022.79]
[null,null,null,2014,104.83,211127.62]
[null,null,null,2015,104.83,211232.44999999998]
[null,null,null,2016,104.83,211337.28]
[null,null,null,2017,104.83,211442.11]
[null,null,null,2018,104.83,211546.94]
[null,null,null,2019,104.83,211651.77]
[null,null,null,2020,104.83,{"$f":"E2037*D2037","v":211756.6}]
[null,null,null,2021,104.83,211861.43]
[null,null,null,2022,104.83,211966.26]
[null,null,null,2023,104.83,212071.09]
[null,null,null,2024,104.83,212175.91999999998]
[null,null,null,2025,104.83,212280.75]
[null,null,null,2026,104.83,212385.58]
[null,null,null,2027,104.83,212490.41]
[null,null,null,2028,104.83,212595.24]
[null,null,null,2029,104.83,212700.07]
[null,null,null,2030,104.83,212804.9]
[null,null,null,2031,104.83,212909.73]
[null,null,null,2032,104.83,213014.56]
[null,null,null,2033,104.83,213119.38999999998]
[null,null,null,2034,104.83,213224.22]
[null,null,null,2035,104.83,213329.05]
[null,null,null,2036,104.83,213433.88]
[null,null,null,2037,104.83,213538.71]
[null,null,null,2038,104.83,213643.54]
[null,null,null,2039,104.83,213748.37]
[null,null,null,2040,104.83,213853.19999999998]
[null,null,null,2041,104.83,213958.03]
[null,null,null,2042,104.83,214062.86]
[null,null,null,2043,104.83,214167.69]
[null,null,null,2044,104.83,214272.52]
[null,null,null,2045,104.83,214377.35]
[null,null,null,2046,104.83,214482.18]
[null,null,null,2047,104.83,214587.01]
[null,null,null,2048,104.83,214691.84]
[null,null,null,2049,104.83,214796.66999999998]
[null,null,null,2050,104.83,214901.5]
[null,null,null,2051,104.83,215006.33]
[null,null,null,2052,104.83,215111.16]
[null,null,null,2053,104.83,215215.99]
[null,null,null,2054,104.83,215320.82]
[null,null,null,2055,104.83,215425.65]
[null,null,null,2056,104.83,215530.48]
[null,null,null,2057,104.83,215635.31]
[null,null,null,2058,104.83,215740.13999999998]
[null,null,null,2059,104.83,215844.97]
[null,null,null,2060,104.83,215949.8]
[null,null,null,2061,104.83,216054.63]
[null,null,null,2062,104.83,216159.46]
[null,null,null,2063,104.83,216264.29]
[null,null,null,2064,104.83,216369.12]
[null,null,null,2065,{"$f":"$E$13","v":104.83},216473.94999999998]
[null,null,null,2066,104.83,216578.78]
[null,null,null,2067,104.83,216683.61]
[null,null,null,2068,104.83,216788.44]
[null,null,null,2069,104.83,216893.27]
[null,null,null,2070,104.83,216998.1]
[null,null,null,2071,104.83,217102.93]
[null,null,null,2072,104.83,217207.76]
[null,null,null,2073,104.83,217312.59]
[null,null,null,2074,104.83,217417.41999999998]
[null,null,null,2075,104.83,217522.25]
[null,null,null,2076,104.83,217627.08]
[null,null,null,2077,104.83,217731.91]
[null,null,null,2078,104.83,217836.74]
[null,null,null,2079,104.83,217941.57]
[null,null,null,2080,104.83,218046.4]
[null,null,null,2081,104.83,218151.23]
[null,null,null,2082,104.83,218256.06]
[null,null,null,2083,104.83,218360.88999999998]
[null,null,null,2084,104.83,{"$f":"E2101*D2101","v":218465.72}]
[null,null,null,2085,104.83,218570.55]
[null,null,null,2086,104.83,218675.38]
[null,null,null,2087,104.83,218780.21]
[null,null,null,2088,104.83,218885.04]
[null,null,null,2089,104.83,218989.87]
[null,null,null,2090,104.83,219094.69999999998]
[null,null,null,2091,104.83,219199.53]
[null,null,null,2092,104.83,219304.36]
[null,null,null,2093,104.83,219409.19]
[null,null,null,2094,104.83,219514.02]
[null,null,null,2095,104.83,219618.85]
[null,null,null,2096,104.83,219723.68]
[null,null,null,2097,104.83,219828.51]
[null,null,null,2098,104.83,219933.34]
[null,null,null,2099,104.83,220038.16999999998]
[null,null,null,2100,104.83,220143]
[null,null,null,2101,104.83,220247.83]
[null,null,null,2102,104.83,220352.66]
[null,null,null,2103,104.83,220457.49]
[null,null,null,2104,104.83,220562.32]
[null,null,null,2105,104.83,220667.15]
[null,null,null,2106,104.83,220771.98]
[null,null,null,2107,104.83,220876.81]
[null,null,null,2108,104.83,220981.63999999998]
[null,null,null,2109,104.83,221086.47]
[null,null,null,2110,104.83,221191.3]
[null,null,null,2111,104.83,221296.13]
[null,null,null,2112,104.83,221400.95999999999]
[null,null,null,2113,104.83,221505.79]
[null,null,null,2114,104.83,221610.62]
[null,null,null,2115,104.83,221715.44999999998]
[null,null,null,2116,104.83,221820.28]
[null,null,null,2117,104.83,221925.11]
[null,null,null,2118,104.83,222029.94]
[null,null,null,2119,104.83,222134.77]
[null,null,null,2120,104.83,222239.6]
[null,null,null,2121,104.83,222344.43]
[null,null,null,2122,104.83,222449.26]
[null,null,null,2123,104.83,222554.09]
[null,null,null,2124,104.83,222658.91999999998]
[null,null,null,2125,104.83,222763.75]
[null,null,null,2126,104.83,222868.58]
[null,null,null,2127,104.83,222973.41]
[null,null,null,2128,104.83,223078.24]
[null,null,null,2129,{"$f":"$E$13","v":104.83},223183.07]
[null,null,null,2130,104.83,223287.9]
[null,null,null,2131,104.83,223392.73]
[null,null,null,2132,104.83,223497.56]
[null,null,null,2133,104.83,223602.38999999998]
[null,null,null,2134,104.83,223707.22]
[null,null,null,2135,104.83,223812.05]
[null,null,null,2136,104.83,223916.88]
[null,null,null,2137,104.83,224021.71]
[null,null,null,2138,104.83,224126.54]
[null,null,null,2139,104.83,224231.37]
[null,null,null,2140,104.83,224336.19999999998]
[null,null,null,2141,104.83,224441.03]
[null,null,null,2142,104.83,224545.86]
[null,null,null,2143,104.83,224650.69]
[null,null,null,2144,104.83,224755.52]
[null,null,null,2145,104.83,224860.35]
[null,null,null,2146,104.83,224965.18]
[null,null,null,2147,104.83,225070.01]
[null,null,null,2148,104.83,{"$f":"E2165*D2165","v":225174.84}]
[null,null,null,2149,104.83,225279.66999999998]
[null,null,null,2150,104.83,225384.5]
[null,null,null,2151,104.83,225489.33]
[null,null,null,2152,104.83,225594.16]
[null,null,null,2153,104.83,225698.99]
[null,null,null,2154,104.83,225803.82]
[null,null,null,2155,104.83,225908.65]
[null,null,null,2156,104.83,226013.48]
[null,null,null,2157,104.83,226118.31]
[null,null,null,2158,104.83,226223.13999999998]
[null,null,null,2159,104.83,226327.97]
[null,null,null,2160,104.83,226432.8]
[null,null,null,2161,104.83,226537.63]
[null,null,null,2162,104.83,226642.46]
[null,null,null,2163,104.83,226747.29]
[null,null,null,2164,104.83,226852.12]
[null,null,null,2165,104.83,226956.94999999998]
[null,null,null,2166,104.83,227061.78]
[null,null,null,2167,104.83,227166.61]
[null,null,null,2168,104.83,227271.44]
[null,null,null,2169,104.83,227376.27]
[null,null,null,2170,104.83,227481.1]
[null,null,null,2171,104.83,227585.93]
[null,null,null,2172,104.83,227690.76]
[null,null,null,2173,104.83,227795.59]
[null,null,null,2174,104.83,227900.41999999998]
[null,null,null,2175,104.83,228005.25]
[null,null,null,2176,104.83,228110.07999999999]
[null,null,null,2177,104.83,228214.91]
[null,null,null,2178,104.83,228319.74]
[null,null,null,2179,104.83,228424.57]
[null,null,null,2180,104.83,228529.4]
[null,null,null,2181,104.83,228634.23]
[null,null,null,2182,104.83,228739.06]
[null,null,null,2183,104.83,228843.88999999998]
[null,null,null,2184,104.83,228948.72]
[null,null,null,2185,104.83,229053.55]
[null,null,null,2186,104.83,229158.38]
[null,null,null,2187,104.83,229263.21]
[null,null,null,2188,104.83,229368.04]
[null,null,null,2189,104.83,229472.87]
[null,null,null,2190,104.83,229577.69999999998]
[null,null,null,2191,104.83,229682.53]
[null,null,null,2192,104.83,229787.36]
[null,null,null,2193,{"$f":"$E$13","v":104.83},229892.19]
[null,null,null,2194,104.83,229997.02]
[null,null,null,2195,104.83,230101.85]
[null,null,null,2196,104.83,230206.68]
[null,null,null,2197,104.83,230311.51]
[null,null,null,2198,104.83,230416.34]
[null,null,null,2199,104.83,230521.16999999998]
[null,null,null,2200,104.83,230626]
[null,null,null,2201,104.83,230730.83]
[null,null,null,2202,104.83,230835.66]
[null,null,null,2203,104.83,230940.49]
[null,null,null,2204,104.83,231045.32]
[null,null,null,2205,104.83,231150.15]
[null,null,null,2206,104.83,231254.98]
[null,null,null,2207,104.83,231359.81]
[null,null,null,2208,104.83,231464.63999999998]
[null,null,null,2209,104.83,231569.47]
[null,null,null,2210,104.83,231674.3]
[null,null,null,2211,104.83,231779.13]
[null,null,null,2212,104.83,{"$f":"E2229*D2229","v":231883.96}]
[null,null,null,2213,104.83,231988.79]
[null,null,null,2214,104.83,232093.62]
[null,null,null,2215,104.83,232198.44999999998]
[null,null,null,2216,104.83,232303.28]
[null,null,null,2217,104.83,232408.11]
[null,null,null,2218,104.83,232512.94]
[null,null,null,2219,104.83,232617.77]
[null,null,null,2220,104.83,232722.6]
[null,null,null,2221,104.83,232827.43]
[null,null,null,2222,104.83,232932.26]
[null,null,null,2223,104.83,233037.09]
[null,null,null,2224,104.83,233141.91999999998]
[null,null,null,2225,104.83,233246.75]
[null,null,null,2226,104.83,233351.58]
[null,null,null,2227,104.83,233456.41]
[null,null,null,2228,104.83,233561.24]
[null,null,null,2229,104.83,233666.07]
[null,null,null,2230,104.83,233770.9]
[null,null,null,2231,104.83,233875.73]
[null,null,null,2232,104.83,233980.56]
[null,null,null,2233,104.83,234085.38999999998]
[null,null,null,2234,104.83,234190.22]
[null,null,null,2235,104.83,234295.05]
[null,null,null,2236,104.83,234399.88]
[null,null,null,2237,104.83,234504.71]
[null,null,null,2238,104.83,234609.54]
[null,null,null,2239,104.83,234714.37]
[null,null,null,2240,104.83,234819.19999999998]
[null,null,null,2241,104.83,234924.03]
[null,null,null,2242,104.83,235028.86]
[null,null,null,2243,104.83,235133.69]
[null,null,null,2244,104.83,235238.52]
[null,null,null,2245,104.83,235343.35]
[null,null,null,2246,104.83,235448.18]
[null,null,null,2247,104.83,235553.01]
[null,null,null,2248,104.83,235657.84]
[null,null,null,2249,104.83,235762.66999999998]
[null,null,null,2250,104.83,235867.5]
[null,null,null,2251,104.83,235972.33]
[null,null,null,2252,104.83,236077.16]
[null,null,null,2253,104.83,236181.99]
[null,null,null,2254,104.83,236286.82]
[null,null,null,2255,104.83,236391.65]
[null,null,null,2256,104.83,236496.48]
[null,null,null,2257,{"$f":"$E$13","v":104.83},236601.31]
[null,null,null,2258,104.83,236706.13999999998]
[null,null,null,2259,104.83,236810.97]
[null,null,null,2260,104.83,236915.8]
[null,null,null,2261,104.83,237020.63]
[null,null,null,2262,104.83,237125.46]
[null,null,null,2263,104.83,237230.29]
[null,null,null,2264,104.83,237335.12]
[null,null,null,2265,104.83,237439.94999999998]
[null,null,null,2266,104.83,237544.78]
[null,null,null,2267,104.83,237649.61]
[null,null,null,2268,104.83,237754.44]
[null,null,null,2269,104.83,237859.27]
[null,null,null,2270,104.83,237964.1]
[null,null,null,2271,104.83,238068.93]
[null,null,null,2272,104.83,238173.76]
[null,null,null,2273,104.83,238278.59]
[null,null,null,2274,104.83,238383.41999999998]
[null,null,null,2275,104.83,238488.25]
[null,null,null,2276,104.83,{"$f":"E2293*D2293","v":238593.08}]
[null,null,null,2277,104.83,238697.91]
[null,null,null,2278,104.83,238802.74]
[null,null,null,2279,104.83,238907.57]
[null,null,null,2280,104.83,239012.4]
[null,null,null,2281,104.83,239117.23]
[null,null,null,2282,104.83,239222.06]
[null,null,null,2283,104.83,239326.88999999998]
[null,null,null,2284,104.83,239431.72]
[null,null,null,2285,104.83,239536.55]
[null,null,null,2286,104.83,239641.38]
[null,null,null,2287,104.83,239746.21]
[null,null,null,2288,104.83,239851.04]
[null,null,null,2289,104.83,239955.87]
[null,null,null,2290,104.83,240060.69999999998]
[null,null,null,2291,104.83,240165.53]
[null,null,null,2292,104.83,240270.36]
[null,null,null,2293,104.83,240375.19]
[null,null,null,2294,104.83,240480.02]
[null,null,null,2295,104.83,240584.85]
[null,null,null,2296,104.83,240689.68]
[null,null,null,2297,104.83,240794.51]
[null,null,null,2298,104.83,240899.34]
[null,null,null,2299,104.83,241004.16999999998]
[null,null,null,2300,104.83,241109]
[null,null,null,2301,104.83,241213.83]
[null,null,null,2302,104.83,241318.66]
[null,null,null,2303,104.83,241423.49]
[null,null,null,2304,104.83,241528.32000000001]
[null,null,null,2305,104.83,241633.15]
[null,null,null,2306,104.83,241737.98]
[null,null,null,2307,104.83,241842.81]
[null,null,null,2308,104.83,241947.63999999998]
[null,null,null,2309,104.83,242052.47]
[null,null,null,2310,104.83,242157.3]
[null,null,null,2311,104.83,242262.13]
[null,null,null,2312,104.83,242366.96]
[null,null,null,2313,104.83,242471.79]
[null,null,null,2314,104.83,242576.62]
[null,null,null,2315,104.83,242681.44999999998]
[null,null,null,2316,104.83,242786.28]
[null,null,null,2317,104.83,242891.11]
[null,null,null,2318,104.83,242995.94]
[null,null,null,2319,104.83,243100.77]
[null,null,null,2320,104.83,243205.6]
[null,null,null,2321,{"$f":"$E$13","v":104.83},243310.43]
[null,null,null,2322,104.83,243415.26]
[null,null,null,2323,104.83,243520.09]
[null,null,null,2324,104.83,243624.91999999998]
[null,null,null,2325,104.83,243729.75]
[null,null,null,2326,104.83,243834.58]
[null,null,null,2327,104.83,243939.41]
[null,null,null,2328,104.83,244044.24]
[null,null,null,2329,104.83,244149.07]
[null,null,null,2330,104.83,244253.9]
[null,null,null,2331,104.83,244358.73]
[null,null,null,2332,104.83,244463.56]
[null,null,null,2333,104.83,244568.38999999998]
[null,null,null,2334,104.83,244673.22]
[null,null,null,2335,104.83,244778.05]
[null,null,null,2336,104.83,244882.88]
[null,null,null,2337,104.83,244987.71]
[null,null,null,2338,104.83,245092.54]
[null,null,null,2339,104.83,245197.37]
[null,null,null,2340,104.83,{"$f":"E2357*D2357","v":245302.19999999998}]
[null,null,null,2341,104.83,245407.03]
[null,null,null,2342,104.83,245511.86]
[null,null,null,2343,104.83,245616.69]
[null,null,null,2344,104.83,245721.52]
[null,null,null,2345,104.83,245826.35]
[null,null,null,2346,104.83,245931.18]
[null,null,null,2347,104.83,246036.01]
[null,null,null,2348,104.83,246140.84]
[null,null,null,2349,104.83,246245.66999999998]
[null,null,null,2350,104.83,246350.5]
[null,null,null,2351,104.83,246455.33]
[null,null,null,2352,104.83,246560.16]
[null,null,null,2353,104.83,246664.99]
[null,null,null,2354,104.83,246769.82]
[null,null,null,2355,104.83,246874.65]
[null,null,null,2356,104.83,246979.48]
[null,null,null,2357,104.83,247084.31]
[null,null,null,2358,104.83,247189.13999999998]
[null,null,null,2359,104.83,247293.97]
[null,null,null,2360,104.83,247398.8]
[null,null,null,2361,104.83,247503.63]
[null,null,null,2362,104.83,247608.46]
[null,null,null,2363,104.83,247713.29]
[null,null,null,2364,104.83,247818.12]
[null,null,null,2365,104.83,247922.94999999998]
[null,null,null,2366,104.83,248027.78]
[null,null,null,2367,104.83,248132.61]
[null,null,null,2368,104.83,248237.44]
[null,null,null,2369,104.83,248342.27]
[null,null,null,2370,104.83,248447.1]
[null,null,null,2371,104.83,248551.93]
[null,null,null,2372,104.83,248656.76]
[null,null,null,2373,104.83,248761.59]
[null,null,null,2374,104.83,248866.41999999998]
[null,null,null,2375,104.83,248971.25]
[null,null,null,2376,104.83,249076.08]
[null,null,null,2377,104.83,249180.91]
[null,null,null,2378,104.83,249285.74]
[null,null,null,2379,104.83,249390.57]
[null,null,null,2380,104.83,249495.4]
[null,null,null,2381,104.83,249600.23]
[null,null,null,2382,104.83,249705.06]
[null,null,null,2383,104.83,249809.88999999998]
[null,null,null,2384,104.83,249914.72]
[null,null,null,2385,{"$f":"$E$13","v":104.83},250019.55]
[null,null,null,2386,104.83,250124.38]
[null,null,null,2387,104.83,250229.21]
[null,null,null,2388,104.83,250334.04]
[null,null,null,2389,104.83,250438.87]
[null,null,null,2390,104.83,250543.69999999998]
[null,null,null,2391,104.83,250648.53]
[null,null,null,2392,104.83,250753.36]
[null,null,null,2393,104.83,250858.19]
[null,null,null,2394,104.83,250963.02]
[null,null,null,2395,104.83,251067.85]
[null,null,null,2396,104.83,251172.68]
[null,null,null,2397,104.83,251277.51]
[null,null,null,2398,104.83,251382.34]
[null,null,null,2399,104.83,251487.16999999998]
[null,null,null,2400,104.83,251592]
[null,null,null,2401,104.83,251696.83]
[null,null,null,2402,104.83,251801.66]
[null,null,null,2403,104.83,251906.49]
[null,null,null,2404,104.83,{"$f":"E2421*D2421","v":252011.32}]
[null,null,null,2405,104.83,252116.15]
[null,null,null,2406,104.83,252220.97999999998]
[null,null,null,2407,104.83,252325.81]
[null,null,null,2408,104.83,252430.63999999998]
[null,null,null,2409,104.83,252535.47]
[null,null,null,2410,104.83,252640.3]
[null,null,null,2411,104.83,252745.13]
[null,null,null,2412,104.83,252849.96]
[null,null,null,2413,104.83,252954.79]
[null,null,null,2414,104.83,253059.62]
[null,null,null,2415,104.83,253164.44999999998]
[null,null,null,2416,104.83,253269.28]
[null,null,null,2417,104.83,253374.11]
[null,null,null,2418,104.83,253478.94]
[null,null,null,2419,104.83,253583.77]
[null,null,null,2420,104.83,253688.6]
[null,null,null,2421,104.83,253793.43]
[null,null,null,2422,104.83,253898.26]
[null,null,null,2423,104.83,254003.09]
[null,null,null,2424,104.83,254107.91999999998]
[null,null,null,2425,104.83,254212.75]
[null,null,null,2426,104.83,254317.58]
[null,null,null,2427,104.83,254422.41]
[null,null,null,2428,104.83,254527.24]
[null,null,null,2429,104.83,254632.07]
[null,null,null,2430,104.83,254736.9]
[null,null,null,2431,104.83,254841.72999999998]
[null,null,null,2432,104.83,254946.56]
[null,null,null,2433,104.83,255051.38999999998]
[null,null,null,2434,104.83,255156.22]
[null,null,null,2435,104.83,255261.05]
[null,null,null,2436,104.83,255365.88]
[null,null,null,2437,104.83,255470.71]
[null,null,null,2438,104.83,255575.54]
[null,null,null,2439,104.83,255680.37]
[null,null,null,2440,104.83,255785.19999999998]
[null,null,null,2441,104.83,255890.03]
[null,null,null,2442,104.83,255994.86]
[null,null,null,2443,104.83,256099.69]
[null,null,null,2444,104.83,256204.52]
[null,null,null,2445,104.83,256309.35]
[null,null,null,2446,104.83,256414.18]
[null,null,null,2447,104.83,256519.01]
[null,null,null,2448,104.83,256623.84]
[null,null,null,2449,{"$f":"$E$13","v":104.83},256728.66999999998]
[null,null,null,2450,104.83,256833.5]
[null,null,null,2451,104.83,256938.33]
[null,null,null,2452,104.83,257043.16]
[null,null,null,2453,104.83,257147.99]
[null,null,null,2454,104.83,257252.82]
[null,null,null,2455,104.83,257357.65]
[null,null,null,2456,104.83,257462.47999999998]
[null,null,null,2457,104.83,257567.31]
[null,null,null,2458,104.83,257672.13999999998]
[null,null,null,2459,104.83,257776.97]
[null,null,null,2460,104.83,257881.8]
[null,null,null,2461,104.83,257986.63]
[null,null,null,2462,104.83,258091.46]
[null,null,null,2463,104.83,258196.29]
[null,null,null,2464,104.83,258301.12]
[null,null,null,2465,104.83,258405.94999999998]
[null,null,null,2466,104.83,258510.78]
[null,null,null,2467,104.83,258615.61]
[null,null,null,2468,104.83,{"$f":"E2485*D2485","v":258720.44}]
[null,null,null,2469,104.83,258825.27]
[null,null,null,2470,104.83,258930.1]
[null,null,null,2471,104.83,259034.93]
[null,null,null,2472,104.83,259139.76]
[null,null,null,2473,104.83,259244.59]
[null,null,null,2474,104.83,259349.41999999998]
[null,null,null,2475,104.83,259454.25]
[null,null,null,2476,104.83,259559.08]
[null,null,null,2477,104.83,259663.91]
[null,null,null,2478,104.83,259768.74]
[null,null,null,2479,104.83,259873.57]
[null,null,null,2480,104.83,259978.4]
[null,null,null,2481,104.83,260083.22999999998]
[null,null,null,2482,104.83,260188.06]
[null,null,null,2483,104.83,260292.88999999998]
[null,null,null,2484,104.83,260397.72]
[null,null,null,2485,104.83,260502.55]
[null,null,null,2486,104.83,260607.38]
[null,null,null,2487,104.83,260712.21]
[null,null,null,2488,104.83,260817.04]
[null,null,null,2489,104.83,260921.87]
[null,null,null,2490,104.83,261026.69999999998]
[null,null,null,2491,104.83,261131.53]
[null,null,null,2492,104.83,261236.36]
[null,null,null,2493,104.83,261341.19]
[null,null,null,2494,104.83,261446.02]
[null,null,null,2495,104.83,261550.85]
[null,null,null,2496,104.83,261655.67999999999]
[null,null,null,2497,104.83,261760.51]
[null,null,null,2498,104.83,261865.34]
[null,null,null,2499,104.83,261970.16999999998]
[null,null,null,2500,104.83,262075]
[null,null,null,2501,104.83,262179.83]
[null,null,null,2502,104.83,262284.65999999997]
[null,null,null,2503,104.83,262389.49]
[null,null,null,2504,104.83,262494.32]
[null,null,null,2505,104.83,262599.15000000002]
[null,null,null,2506,104.83,262703.98]
[null,null,null,2507,104.83,262808.81]
[null,null,null,2508,104.83,262913.64]
[null,null,null,2509,104.83,263018.46999999997]
[null,null,null,2510,104.83,263123.3]
[null,null,null,2511,104.83,263228.13]
[null,null,null,2512,104.83,263332.96000000002]
[null,null,null,2513,{"$f":"$E$13","v":104.83},263437.78999999998]
[null,null,null,2514,104.83,263542.62]
[null,null,null,2515,104.83,263647.45]
[null,null,null,2516,104.83,263752.27999999997]
[null,null,null,2517,104.83,263857.11]
[null,null,null,2518,104.83,263961.94]
[null,null,null,2519,104.83,264066.77]
[null,null,null,2520,104.83,264171.59999999998]
[null,null,null,2521,104.83,264276.43]
[null,null,null,2522,104.83,264381.26]
[null,null,null,2523,104.83,264486.08999999997]
[null,null,null,2524,104.83,264590.92]
[null,null,null,2525,104.83,264695.75]
[null,null,null,2526,104.83,264800.58]
[null,null,null,2527,104.83,264905.40999999997]
[null,null,null,2528,104.83,265010.24]
[null,null,null,2529,104.83,265115.07]
[null,null,null,2530,104.83,265219.90000000002]
[null,null,null,2531,104.83,265324.73]
[null,null,null,2532,104.83,{"$f":"E2549*D2549","v":265429.56}]
[null,null,null,2533,104.83,265534.39]
[null,null,null,2534,104.83,265639.21999999997]
[null,null,null,2535,104.83,265744.05]
[null,null,null,2536,104.83,265848.88]
[null,null,null,2537,104.83,265953.71000000002]
[null,null,null,2538,104.83,266058.53999999998]
[null,null,null,2539,104.83,266163.37]
[null,null,null,2540,104.83,266268.2]
[null,null,null,2541,104.83,266373.02999999997]
[null,null,null,2542,104.83,266477.86]
[null,null,null,2543,104.83,266582.69]
[null,null,null,2544,104.83,266687.52]
[null,null,null,2545,104.83,266792.34999999998]
[null,null,null,2546,104.83,266897.18]
[null,null,null,2547,104.83,267002.01]
[null,null,null,2548,104.83,267106.83999999997]
[null,null,null,2549,104.83,267211.67]
[null,null,null,2550,104.83,267316.5]
[null,null,null,2551,104.83,267421.33]
[null,null,null,2552,104.83,267526.15999999997]
[null,null,null,2553,104.83,267630.99]
[null,null,null,2554,104.83,267735.82]
[null,null,null,2555,104.83,267840.65000000002]
[null,null,null,2556,104.83,267945.48]
[null,null,null,2557,104.83,268050.31]
[null,null,null,2558,104.83,268155.14]
[null,null,null,2559,104.83,268259.96999999997]
[null,null,null,2560,104.83,268364.79999999999]
[null,null,null,2561,104.83,268469.63]
[null,null,null,2562,104.83,268574.46000000002]
[null,null,null,2563,104.83,268679.28999999998]
[null,null,null,2564,104.83,268784.12]
[null,null,null,2565,104.83,268888.95]
[null,null,null,2566,104.83,268993.77999999997]
[null,null,null,2567,104.83,269098.61]
[null,null,null,2568,104.83,269203.44]
[null,null,null,2569,104.83,269308.27]
[null,null,null,2570,104.83,269413.09999999998]
[null,null,null,2571,104.83,269517.93]
[null,null,null,2572,104.83,269622.76]
[null,null,null,2573,104.83,269727.58999999997]
[null,null,null,2574,104.83,269832.42]
[null,null,null,2575,104.83,269937.25]
[null,null,null,2576,104.83,270042.08]
[null,null,null,2577,{"$f":"$E$13","v":104.83},270146.90999999997]
[null,null,null,2578,104.83,270251.74]
[null,null,null,2579,104.83,270356.57]
[null,null,null,2580,104.83,270461.40000000002]
[null,null,null,2581,104.83,270566.23]
[null,null,null,2582,104.83,270671.06]
[null,null,null,2583,104.83,270775.89]
[null,null,null,2584,104.83,270880.71999999997]
[null,null,null,2585,104.83,270985.55]
[null,null,null,2586,104.83,271090.38]
[null,null,null,2587,104.83,271195.21000000002]
[null,null,null,2588,104.83,271300.03999999998]
[null,null,null,2589,104.83,271404.87]
[null,null,null,2590,104.83,271509.7]
[null,null,null,2591,104.83,271614.52999999997]
[null,null,null,2592,104.83,271719.36]
[null,null,null,2593,104.83,271824.19]
[null,null,null,2594,104.83,271929.02]
[null,null,null,2595,104.83,272033.84999999998]
[null,null,null,2596,104.83,{"$f":"E2613*D2613","v":272138.68}]
[null,null,null,2597,104.83,272243.51]
[null,null,null,2598,104.83,272348.33999999997]
[null,null,null,2599,104.83,272453.17]
[null,null,null,2600,104.83,272558]
[null,null,null,2601,104.83,272662.83]
[null,null,null,2602,104.83,272767.65999999997]
[null,null,null,2603,104.83,272872.49]
[null,null,null,2604,104.83,272977.32]
[null,null,null,2605,104.83,273082.15000000002]
[null,null,null,2606,104.83,273186.98]
[null,null,null,2607,104.83,273291.81]
[null,null,null,2608,104.83,273396.64]
[null,null,null,2609,104.83,273501.46999999997]
[null,null,null,2610,104.83,273606.3]
[null,null,null,2611,104.83,273711.13]
[null,null,null,2612,104.83,273815.96000000002]
[null,null,null,2613,104.83,273920.78999999998]
[null,null,null,2614,104.83,274025.62]
[null,null,null,2615,104.83,274130.45]
[null,null,null,2616,104.83,274235.27999999997]
[null,null,null,2617,104.83,274340.11]
[null,null,null,2618,104.83,274444.94]
[null,null,null,2619,104.83,274549.77]
[null,null,null,2620,104.83,274654.59999999998]
[null,null,null,2621,104.83,274759.43]
[null,null,null,2622,104.83,274864.26]
[null,null,null,2623,104.83,274969.08999999997]
[null,null,null,2624,104.83,275073.91999999998]
[null,null,null,2625,104.83,275178.75]
[null,null,null,2626,104.83,275283.58]
[null,null,null,2627,104.83,275388.40999999997]
[null,null,null,2628,104.83,275493.24]
[null,null,null,2629,104.83,275598.07]
[null,null,null,2630,104.83,275702.90000000002]
[null,null,null,2631,104.83,275807.73]
[null,null,null,2632,104.83,275912.56]
[null,null,null,2633,104.83,276017.39]
[null,null,null,2634,104.83,276122.21999999997]
[null,null,null,2635,104.83,276227.05]
[null,null,null,2636,104.83,276331.88]
[null,null,null,2637,104.83,276436.71000000002]
[null,null,null,2638,104.83,276541.53999999998]
[null,null,null,2639,104.83,276646.37]
[null,null,null,2640,104.83,276751.2]
[null,null,null,2641,{"$f":"$E$13","v":104.83},276856.02999999997]
[null,null,null,2642,104.83,276960.86]
[null,null,null,2643,104.83,277065.69]
[null,null,null,2644,104.83,277170.52]
[null,null,null,2645,104.83,277275.34999999998]
[null,null,null,2646,104.83,277380.18]
[null,null,null,2647,104.83,277485.01]
[null,null,null,2648,104.83,277589.83999999997]
[null,null,null,2649,104.83,277694.67]
[null,null,null,2650,104.83,277799.5]
[null,null,null,2651,104.83,277904.33]
[null,null,null,2652,104.83,278009.15999999997]
[null,null,null,2653,104.83,278113.99]
[null,null,null,2654,104.83,278218.82]
[null,null,null,2655,104.83,278323.65000000002]
[null,null,null,2656,104.83,278428.48]
[null,null,null,2657,104.83,278533.31]
[null,null,null,2658,104.83,278638.14]
[null,null,null,2659,104.83,278742.96999999997]
[null,null,null,2660,104.83,{"$f":"E2677*D2677","v":278847.8}]
[null,null,null,2661,104.83,278952.63]
[null,null,null,2662,104.83,279057.46000000002]
[null,null,null,2663,104.83,279162.28999999998]
[null,null,null,2664,104.83,279267.12]
[null,null,null,2665,104.83,279371.95]
[null,null,null,2666,104.83,279476.77999999997]
[null,null,null,2667,104.83,279581.61]
[null,null,null,2668,104.83,279686.44]
[null,null,null,2669,104.83,279791.27]
[null,null,null,2670,104.83,279896.09999999998]
[null,null,null,2671,104.83,280000.93]
[null,null,null,2672,104.83,280105.76]
[null,null,null,2673,104.83,280210.58999999997]
[null,null,null,2674,104.83,280315.42]
[null,null,null,2675,104.83,280420.25]
[null,null,null,2676,104.83,280525.08]
[null,null,null,2677,104.83,280629.90999999997]
[null,null,null,2678,104.83,280734.74]
[null,null,null,2679,104.83,280839.57]
[null,null,null,2680,104.83,280944.40000000002]
[null,null,null,2681,104.83,281049.23]
[null,null,null,2682,104.83,281154.06]
[null,null,null,2683,104.83,281258.89]
[null,null,null,2684,104.83,281363.71999999997]
[null,null,null,2685,104.83,281468.55]
[null,null,null,2686,104.83,281573.38]
[null,null,null,2687,104.83,281678.21000000002]
[null,null,null,2688,104.83,281783.03999999998]
[null,null,null,2689,104.83,281887.87]
[null,null,null,2690,104.83,281992.7]
[null,null,null,2691,104.83,282097.52999999997]
[null,null,null,2692,104.83,282202.36]
[null,null,null,2693,104.83,282307.19]
[null,null,null,2694,104.83,282412.02]
[null,null,null,2695,104.83,282516.84999999998]
[null,null,null,2696,104.83,282621.68]
[null,null,null,2697,104.83,282726.51]
[null,null,null,2698,104.83,282831.33999999997]
[null,null,null,2699,104.83,282936.17]
[null,null,null,2700,104.83,283041]
[null,null,null,2701,104.83,283145.83]
[null,null,null,2702,104.83,283250.65999999997]
[null,null,null,2703,104.83,283355.49]
[null,null,null,2704,104.83,283460.32]
[null,null,null,2705,{"$f":"$E$13","v":104.83},283565.15000000002]
[null,null,null,2706,104.83,283669.98]
[null,null,null,2707,104.83,283774.81]
[null,null,null,2708,104.83,283879.64]
[null,null,null,2709,104.83,283984.46999999997]
[null,null,null,2710,104.83,284089.3]
[null,null,null,2711,104.83,284194.13]
[null,null,null,2712,104.83,284298.96000000002]
[null,null,null,2713,104.83,284403.78999999998]
[null,null,null,2714,104.83,284508.62]
[null,null,null,2715,104.83,284613.45]
[null,null,null,2716,104.83,284718.27999999997]
[null,null,null,2717,104.83,284823.11]
[null,null,null,2718,104.83,284927.94]
[null,null,null,2719,104.83,285032.77]
[null,null,null,2720,104.83,285137.59999999998]
[null,null,null,2721,104.83,285242.43]
[null,null,null,2722,104.83,285347.26]
[null,null,null,2723,104.83,285452.08999999997]
[null,null,null,2724,104.83,{"$f":"E2741*D2741","v":285556.92}]
[null,null,null,2725,104.83,285661.75]
[null,null,null,2726,104.83,285766.58]
[null,null,null,2727,104.83,285871.40999999997]
[null,null,null,2728,104.83,285976.24]
[null,null,null,2729,104.83,286081.07]
[null,null,null,2730,104.83,286185.90000000002]
[null,null,null,2731,104.83,286290.73]
[null,null,null,2732,104.83,286395.56]
[null,null,null,2733,104.83,286500.39]
[null,null,null,2734,104.83,286605.21999999997]
[null,null,null,2735,104.83,286710.05]
[null,null,null,2736,104.83,286814.88]
[null,null,null,2737,104.83,286919.71000000002]
[null,null,null,2738,104.83,287024.53999999998]
[null,null,null,2739,104.83,287129.37]
[null,null,null,2740,104.83,287234.2]
[null,null,null,2741,104.83,287339.02999999997]
[null,null,null,2742,104.83,287443.86]
[null,null,null,2743,104.83,287548.69]
[null,null,null,2744,104.83,287653.52]
[null,null,null,2745,104.83,287758.34999999998]
[null,null,null,2746,104.83,287863.18]
[null,null,null,2747,104.83,287968.01]
[null,null,null,2748,104.83,288072.83999999997]
[null,null,null,2749,104.83,288177.67]
[null,null,null,2750,104.83,288282.5]
[null,null,null,2751,104.83,288387.33]
[null,null,null,2752,104.83,288492.15999999997]
[null,null,null,2753,104.83,288596.99]
[null,null,null,2754,104.83,288701.82]
[null,null,null,2755,104.83,288806.65000000002]
[null,null,null,2756,104.83,288911.48]
[null,null,null,2757,104.83,289016.31]
[null,null,null,2758,104.83,289121.14]
[null,null,null,2759,104.83,289225.96999999997]
[null,null,null,2760,104.83,289330.8]
[null,null,null,2761,104.83,289435.63]
[null,null,null,2762,104.83,289540.46000000002]
[null,null,null,2763,104.83,289645.28999999998]
[null,null,null,2764,104.83,289750.12]
[null,null,null,2765,104.83,289854.95]
[null,null,null,2766,104.83,289959.77999999997]
[null,null,null,2767,104.83,290064.61]
[null,null,null,2768,104.83,290169.44]
[null,null,null,2769,{"$f":"$E$13","v":104.83},290274.27]
[null,null,null,2770,104.83,290379.09999999998]
[null,null,null,2771,104.83,290483.93]
[null,null,null,2772,104.83,290588.76]
[null,null,null,2773,104.83,290693.58999999997]
[null,null,null,2774,104.83,290798.42]
[null,null,null,2775,104.83,290903.25]
[null,null,null,2776,104.83,291008.08]
[null,null,null,2777,104.83,291112.90999999997]
[null,null,null,2778,104.83,291217.74]
[null,null,null,2779,104.83,291322.57]
[null,null,null,2780,104.83,291427.40000000002]
[null,null,null,2781,104.83,291532.23]
[null,null,null,2782,104.83,291637.06]
[null,null,null,2783,104.83,291741.89]
[null,null,null,2784,104.83,291846.71999999997]
[null,null,null,2785,104.83,291951.55]
[null,null,null,2786,104.83,292056.38]
[null,null,null,2787,104.83,292161.21000000002]
[null,null,null,2788,104.83,{"$f":"E2805*D2805","v":292266.03999999998}]
[null,null,null,2789,104.83,292370.87]
[null,null,null,2790,104.83,292475.7]
[null,null,null,2791,104.83,292580.52999999997]
[null,null,null,2792,104.83,292685.36]
[null,null,null,2793,104.83,292790.19]
[null,null,null,2794,104.83,292895.02]
[null,null,null,2795,104.83,292999.84999999998]
[null,null,null,2796,104.83,293104.68]
[null,null,null,2797,104.83,293209.51]
[null,null,null,2798,104.83,293314.33999999997]
[null,null,null,2799,104.83,293419.17]
[null,null,null,2800,104.83,293524]
[null,null,null,2801,104.83,293628.83]
[null,null,null,2802,104.83,293733.65999999997]
[null,null,null,2803,104.83,293838.49]
[null,null,null,2804,104.83,293943.32]
[null,null,null,2805,104.83,294048.15000000002]
[null,null,null,2806,104.83,294152.98]
[null,null,null,2807,104.83,294257.81]
[null,null,null,2808,104.83,294362.64]
[null,null,null,2809,104.83,294467.46999999997]
[null,null,null,2810,104.83,294572.3]
[null,null,null,2811,104.83,294677.13]
[null,null,null,2812,104.83,294781.96000000002]
[null,null,null,2813,104.83,294886.78999999998]
[null,null,null,2814,104.83,294991.62]
[null,null,null,2815,104.83,295096.45]
[null,null,null,2816,104.83,295201.27999999997]
[null,null,null,2817,104.83,295306.11]
[null,null,null,2818,104.83,295410.94]
[null,null,null,2819,104.83,295515.77]
[null,null,null,2820,104.83,295620.59999999998]
[null,null,null,2821,104.83,295725.43]
[null,null,null,2822,104.83,295830.26]
[null,null,null,2823,104.83,295935.08999999997]
[null,null,null,2824,104.83,296039.92]
[null,null,null,2825,104.83,296144.75]
[null,null,null,2826,104.83,296249.58]
[null,null,null,2827,104.83,296354.40999999997]
[null,null,null,2828,104.83,296459.24]
[null,null,null,2829,104.83,296564.07]
[null,null,null,2830,104.83,296668.90000000002]
[null,null,null,2831,104.83,296773.73]
[null,null,null,2832,104.83,296878.56]
[null,null,null,2833,{"$f":"$E$13","v":104.83},296983.39]
[null,null,null,2834,104.83,297088.21999999997]
[null,null,null,2835,104.83,297193.05]
[null,null,null,2836,104.83,297297.88]
[null,null,null,2837,104.83,297402.71000000002]
[null,null,null,2838,104.83,297507.53999999998]
[null,null,null,2839,104.83,297612.37]
[null,null,null,2840,104.83,297717.2]
[null,null,null,2841,104.83,297822.02999999997]
[null,null,null,2842,104.83,297926.86]
[null,null,null,2843,104.83,298031.69]
[null,null,null,2844,104.83,298136.52]
[null,null,null,2845,104.83,298241.34999999998]
[null,null,null,2846,104.83,298346.18]
[null,null,null,2847,104.83,298451.01]
[null,null,null,2848,104.83,298555.83999999997]
[null,null,null,2849,104.83,298660.67]
[null,null,null,2850,104.83,298765.5]
[null,null,null,2851,104.83,298870.33]
[null,null,null,2852,104.83,{"$f":"E2869*D2869","v":298975.15999999997}]
[null,null,null,2853,104.83,299079.99]
[null,null,null,2854,104.83,299184.82]
[null,null,null,2855,104.83,299289.65000000002]
[null,null,null,2856,104.83,299394.48]
[null,null,null,2857,104.83,299499.31]
[null,null,null,2858,104.83,299604.14]
[null,null,null,2859,104.83,299708.96999999997]
[null,null,null,2860,104.83,299813.8]
[null,null,null,2861,104.83,299918.63]
[null,null,null,2862,104.83,300023.46000000002]
[null,null,null,2863,104.83,300128.28999999998]
[null,null,null,2864,104.83,300233.12]
[null,null,null,2865,104.83,300337.95]
[null,null,null,2866,104.83,300442.77999999997]
[null,null,null,2867,104.83,300547.61]
[null,null,null,2868,104.83,300652.44]
[null,null,null,2869,104.83,300757.27]
[null,null,null,2870,104.83,300862.09999999998]
[null,null,null,2871,104.83,300966.93]
[null,null,null,2872,104.83,301071.76]
[null,null,null,2873,104.83,301176.58999999997]
[null,null,null,2874,104.83,301281.42]
[null,null,null,2875,104.83,301386.25]
[null,null,null,2876,104.83,301491.08]
[null,null,null,2877,104.83,301595.90999999997]
[null,null,null,2878,104.83,301700.74]
[null,null,null,2879,104.83,301805.57]
[null,null,null,2880,104.83,301910.40000000002]
[null,null,null,2881,104.83,302015.23]
[null,null,null,2882,104.83,302120.06]
[null,null,null,2883,104.83,302224.89]
[null,null,null,2884,104.83,302329.71999999997]
[null,null,null,2885,104.83,302434.55]
[null,null,null,2886,104.83,302539.38]
[null,null,null,2887,104.83,302644.21000000002]
[null,null,null,2888,104.83,302749.03999999998]
[null,null,null,2889,104.83,302853.87]
[null,null,null,2890,104.83,302958.7]
[null,null,null,2891,104.83,303063.52999999997]
[null,null,null,2892,104.83,303168.36]
[null,null,null,2893,104.83,303273.19]
[null,null,null,2894,104.83,303378.02]
[null,null,null,2895,104.83,303482.84999999998]
[null,null,null,2896,104.83,303587.68]
[null,null,null,2897,{"$f":"$E$13","v":104.83},303692.51]
[null,null,null,2898,104.83,303797.33999999997]
[null,null,null,2899,104.83,303902.17]
[null,null,null,2900,104.83,304007]
[null,null,null,2901,104.83,304111.83]
[null,null,null,2902,104.83,304216.65999999997]
[null,null,null,2903,104.83,304321.49]
[null,null,null,2904,104.83,304426.32]
[null,null,null,2905,104.83,304531.15000000002]
[null,null,null,2906,104.83,304635.98]
[null,null,null,2907,104.83,304740.81]
[null,null,null,2908,104.83,304845.64]
[null,null,null,2909,104.83,304950.46999999997]
[null,null,null,2910,104.83,305055.3]
[null,null,null,2911,104.83,305160.13]
[null,null,null,2912,104.83,305264.96000000002]
[null,null,null,2913,104.83,305369.78999999998]
[null,null,null,2914,104.83,305474.62]
[null,null,null,2915,104.83,305579.45]
[null,null,null,2916,104.83,{"$f":"E2933*D2933","v":305684.27999999997}]
[null,null,null,2917,104.83,305789.11]
[null,null,null,2918,104.83,305893.94]
[null,null,null,2919,104.83,305998.77]
[null,null,null,2920,104.83,306103.59999999998]
[null,null,null,2921,104.83,306208.43]
[null,null,null,2922,104.83,306313.26]
[null,null,null,2923,104.83,306418.08999999997]
[null,null,null,2924,104.83,306522.92]
[null,null,null,2925,104.83,306627.75]
[null,null,null,2926,104.83,306732.58]
[null,null,null,2927,104.83,306837.40999999997]
[null,null,null,2928,104.83,306942.24]
[null,null,null,2929,104.83,307047.07]
[null,null,null,2930,104.83,307151.90000000002]
[null,null,null,2931,104.83,307256.73]
[null,null,null,2932,104.83,307361.56]
[null,null,null,2933,104.83,307466.39]
[null,null,null,2934,104.83,307571.21999999997]
[null,null,null,2935,104.83,307676.05]
[null,null,null,2936,104.83,307780.88]
[null,null,null,2937,104.83,307885.71000000002]
[null,null,null,2938,104.83,307990.53999999998]
[null,null,null,2939,104.83,308095.37]
[null,null,null,2940,104.83,308200.2]
[null,null,null,2941,104.83,308305.02999999997]
[null,null,null,2942,104.83,308409.86]
[null,null,null,2943,104.83,308514.69]
[null,null,null,2944,104.83,308619.52000000002]
[null,null,null,2945,104.83,308724.34999999998]
[null,null,null,2946,104.83,308829.18]
[null,null,null,2947,104.83,308934.01]
[null,null,null,2948,104.83,309038.83999999997]
[null,null,null,2949,104.83,309143.67]
[null,null,null,2950,104.83,309248.5]
[null,null,null,2951,104.83,309353.33]
[null,null,null,2952,104.83,309458.15999999997]
[null,null,null,2953,104.83,309562.99]
[null,null,null,2954,104.83,309667.82]
[null,null,null,2955,104.83,309772.65000000002]
[null,null,null,2956,104.83,309877.48]
[null,null,null,2957,104.83,309982.31]
[null,null,null,2958,104.83,310087.14]
[null,null,null,2959,104.83,310191.96999999997]
[null,null,null,2960,104.83,310296.8]
[null,null,null,2961,{"$f":"$E$13","v":104.83},310401.63]
[null,null,null,2962,104.83,310506.46000000002]
[null,null,null,2963,104.83,310611.28999999998]
[null,null,null,2964,104.83,310716.12]
[null,null,null,2965,104.83,310820.95]
[null,null,null,2966,104.83,310925.77999999997]
[null,null,null,2967,104.83,311030.61]
[null,null,null,2968,104.83,311135.44]
[null,null,null,2969,104.83,311240.27]
[null,null,null,2970,104.83,311345.09999999998]
[null,null,null,2971,104.83,311449.93]
[null,null,null,2972,104.83,311554.76]
[null,null,null,2973,104.83,311659.58999999997]
[null,null,null,2974,104.83,311764.42]
[null,null,null,2975,104.83,311869.25]
[null,null,null,2976,104.83,311974.08]
[null,null,null,2977,104.83,312078.90999999997]
[null,null,null,2978,104.83,312183.74]
[null,null,null,2979,104.83,312288.57]
[null,null,null,2980,104.83,{"$f":"E2997*D2997","v":312393.40000000002}]
[null,null,null,2981,104.83,312498.23]
[null,null,null,2982,104.83,312603.06]
[null,null,null,2983,104.83,312707.89]
[null,null,null,2984,104.83,312812.71999999997]
[null,null,null,2985,104.83,312917.55]
[null,null,null,2986,104.83,313022.38]
[null,null,null,2987,104.83,313127.21000000002]
[null,null,null,2988,104.83,313232.03999999998]
[null,null,null,2989,104.83,313336.87]
[null,null,null,2990,104.83,313441.7]
[null,null,null,2991,104.83,313546.52999999997]
[null,null,null,2992,104.83,313651.36]
[null,null,null,2993,104.83,313756.19]
[null,null,null,2994,104.83,313861.02]
[null,null,null,2995,104.83,313965.84999999998]
[null,null,null,2996,104.83,314070.68]
[null,null,null,2997,104.83,314175.51]
[null,null,null,2998,104.83,314280.33999999997]
[null,null,null,2999,104.83,314385.17]
[null,null,null,3000,104.83,314490]
[null,null,null,3001,104.83,314594.83]
[null,null,null,3002,104.83,314699.65999999997]
[null,null,null,3003,104.83,314804.49]
[null,null,null,3004,104.83,314909.32]
[null,null,null,3005,104.83,315014.15000000002]
[null,null,null,3006,104.83,315118.98]
[null,null,null,3007,104.83,315223.81]
[null,null,null,3008,104.83,315328.64000000001]
[null,null,null,3009,104.83,315433.46999999997]
[null,null,null,3010,104.83,315538.3]
[null,null,null,3011,104.83,315643.13]
[null,null,null,3012,104.83,315747.96000000002]
[null,null,null,3013,104.83,315852.78999999998]
[null,null,null,3014,104.83,315957.62]
[null,null,null,3015,104.83,316062.45]
[null,null,null,3016,104.83,316167.27999999997]
[null,null,null,3017,104.83,316272.11]
[null,null,null,3018,104.83,316376.94]
[null,null,null,3019,104.83,316481.77]
[null,null,null,3020,104.83,316586.59999999998]
[null,null,null,3021,104.83,316691.43]
[null,null,null,3022,104.83,316796.26]
[null,null,null,3023,104.83,316901.08999999997]
[null,null,null,3024,104.83,317005.92]
[null,null,null,3025,{"$f":"$E$13","v":104.83},317110.75]
[null,null,null,3026,104.83,317215.58]
[null,null,null,3027,104.83,317320.40999999997]
[null,null,null,3028,104.83,317425.24]
[null,null,null,3029,104.83,317530.07]
[null,null,null,3030,104.83,317634.90000000002]
[null,null,null,3031,104.83,317739.73]
[null,null,null,3032,104.83,317844.56]
[null,null,null,3033,104.83,317949.39]
[null,null,null,3034,104.83,318054.21999999997]
[null,null,null,3035,104.83,318159.05]
[null,null,null,3036,104.83,318263.88]
[null,null,null,3037,104.83,318368.71000000002]
[null,null,null,3038,104.83,318473.53999999998]
[null,null,null,3039,104.83,318578.37]
[null,null,null,3040,104.83,318683.2]
[null,null,null,3041,104.83,318788.02999999997]
[null,null,null,3042,104.83,318892.86]
[null,null,null,3043,104.83,318997.69]
[null,null,null,3044,104.83,{"$f":"E3061*D3061","v":319102.52}]
[null,null,null,3045,104.83,319207.34999999998]
[null,null,null,3046,104.83,319312.18]
[null,null,null,3047,104.83,319417.01]
[null,null,null,3048,104.83,319521.83999999997]
[null,null,null,3049,104.83,319626.67]
[null,null,null,3050,104.83,319731.5]
[null,null,null,3051,104.83,319836.33]
[null,null,null,3052,104.83,319941.15999999997]
[null,null,null,3053,104.83,320045.99]
[null,null,null,3054,104.83,320150.82]
[null,null,null,3055,104.83,320255.65000000002]
[null,null,null,3056,104.83,320360.48]
[null,null,null,3057,104.83,320465.31]
[null,null,null,3058,104.83,320570.14]
[null,null,null,3059,104.83,320674.96999999997]
[null,null,null,3060,104.83,320779.8]
[null,null,null,3061,104.83,320884.63]
[null,null,null,3062,104.83,320989.46000000002]
[null,null,null,3063,104.83,321094.28999999998]
[null,null,null,3064,104.83,321199.12]
[null,null,null,3065,104.83,321303.95]
[null,null,null,3066,104.83,321408.77999999997]
[null,null,null,3067,104.83,321513.61]
[null,null,null,3068,104.83,321618.44]
[null,null,null,3069,104.83,321723.27]
[null,null,null,3070,104.83,321828.09999999998]
[null,null,null,3071,104.83,321932.93]
[null,null,null,3072,104.83,322037.76000000001]
[null,null,null,3073,104.83,322142.58999999997]
[null,null,null,3074,104.83,322247.42]
[null,null,null,3075,104.83,322352.25]
[null,null,null,3076,104.83,322457.08]
[null,null,null,3077,104.83,322561.90999999997]
[null,null,null,3078,104.83,322666.74]
[null,null,null,3079,104.83,322771.57]
[null,null,null,3080,104.83,322876.40000000002]
[null,null,null,3081,104.83,322981.23]
[null,null,null,3082,104.83,323086.06]
[null,null,null,3083,104.83,323190.89]
[null,null,null,3084,104.83,323295.71999999997]
[null,null,null,3085,104.83,323400.55]
[null,null,null,3086,104.83,323505.38]
[null,null,null,3087,104.83,323610.21000000002]
[null,null,null,3088,104.83,323715.03999999998]
[null,null,null,3089,{"$f":"$E$13","v":104.83},323819.87]
[null,null,null,3090,104.83,323924.7]
[null,null,null,3091,104.83,324029.52999999997]
[null,null,null,3092,104.83,324134.36]
[null,null,null,3093,104.83,324239.19]
[null,null,null,3094,104.83,324344.02]
[null,null,null,3095,104.83,324448.84999999998]
[null,null,null,3096,104.83,324553.68]
[null,null,null,3097,104.83,324658.51]
[null,null,null,3098,104.83,324763.33999999997]
[null,null,null,3099,104.83,324868.17]
[null,null,null,3100,104.83,324973]
[null,null,null,3101,104.83,325077.83]
[null,null,null,3102,104.83,325182.65999999997]
[null,null,null,3103,104.83,325287.49]
[null,null,null,3104,104.83,325392.32]
[null,null,null,3105,104.83,325497.15000000002]
[null,null,null,3106,104.83,325601.98]
[null,null,null,3107,104.83,325706.81]
[null,null,null,3108,104.83,{"$f":"E3125*D3125","v":325811.64}]
[null,null,null,3109,104.83,325916.46999999997]
[null,null,null,3110,104.83,326021.3]
[null,null,null,3111,104.83,326126.13]
[null,null,null,3112,104.83,326230.96000000002]
[null,null,null,3113,104.83,326335.78999999998]
[null,null,null,3114,104.83,326440.62]
[null,null,null,3115,104.83,326545.45]
[null,null,null,3116,104.83,326650.27999999997]
[null,null,null,3117,104.83,326755.11]
[null,null,null,3118,104.83,326859.94]
[null,null,null,3119,104.83,326964.77]
[null,null,null,3120,104.83,327069.59999999998]
[null,null,null,3121,104.83,327174.43]
[null,null,null,3122,104.83,327279.26]
[null,null,null,3123,104.83,327384.08999999997]
[null,null,null,3124,104.83,327488.92]
[null,null,null,3125,104.83,327593.75]
[null,null,null,3126,104.83,327698.58]
[null,null,null,3127,104.83,327803.40999999997]
[null,null,null,3128,104.83,327908.24]
[null,null,null,3129,104.83,328013.07]
[null,null,null,3130,104.83,328117.90000000002]
[null,null,null,3131,104.83,328222.73]
[null,null,null,3132,104.83,328327.56]
[null,null,null,3133,104.83,328432.39]
[null,null,null,3134,104.83,328537.21999999997]
[null,null,null,3135,104.83,328642.05]
[null,null,null,3136,104.83,328746.88]
[null,null,null,3137,104.83,328851.71000000002]
[null,null,null,3138,104.83,328956.53999999998]
[null,null,null,3139,104.83,329061.37]
[null,null,null,3140,104.83,329166.2]
[null,null,null,3141,104.83,329271.02999999997]
[null,null,null,3142,104.83,329375.86]
[null,null,null,3143,104.83,329480.69]
[null,null,null,3144,104.83,329585.52]
[null,null,null,3145,104.83,329690.34999999998]
[null,null,null,3146,104.83,329795.18]
[null,null,null,3147,104.83,329900.01]
[null,null,null,3148,104.83,330004.83999999997]
[null,null,null,3149,104.83,330109.67]
[null,null,null,3150,104.83,330214.5]
[null,null,null,3151,104.83,330319.33]
[null,null,null,3152,104.83,330424.15999999997]
[null,null,null,3153,{"$f":"$E$13","v":104.83},330528.99]
[null,null,null,3154,104.83,330633.82]
[null,null,null,3155,104.83,330738.65000000002]
[null,null,null,3156,104.83,330843.48]
[null,null,null,3157,104.83,330948.31]
[null,null,null,3158,104.83,331053.14]
[null,null,null,3159,104.83,331157.96999999997]
[null,null,null,3160,104.83,331262.8]
[null,null,null,3161,104.83,331367.63]
[null,null,null,3162,104.83,331472.46000000002]
[null,null,null,3163,104.83,331577.28999999998]
[null,null,null,3164,104.83,331682.12]
[null,null,null,3165,104.83,331786.95]
[null,null,null,3166,104.83,331891.77999999997]
[null,null,null,3167,104.83,331996.61]
[null,null,null,3168,104.83,332101.44]
[null,null,null,3169,104.83,332206.27]
[null,null,null,3170,104.83,332311.09999999998]
[null,null,null,3171,104.83,332415.93]
[null,null,null,3172,104.83,{"$f":"E3189*D3189","v":332520.76}]
[null,null,null,3173,104.83,332625.58999999997]
[null,null,null,3174,104.83,332730.42]
[null,null,null,3175,104.83,332835.25]
[null,null,null,3176,104.83,332940.08]
[null,null,null,3177,104.83,333044.90999999997]
[null,null,null,3178,104.83,333149.74]
[null,null,null,3179,104.83,333254.57]
[null,null,null,3180,104.83,333359.40000000002]
[null,null,null,3181,104.83,333464.23]
[null,null,null,3182,104.83,333569.06]
[null,null,null,3183,104.83,333673.89]
[null,null,null,3184,104.83,333778.71999999997]
[null,null,null,3185,104.83,333883.55]
[null,null,null,3186,104.83,333988.38]
[null,null,null,3187,104.83,334093.21000000002]
[null,null,null,3188,104.83,334198.03999999998]
[null,null,null,3189,104.83,334302.87]
[null,null,null,3190,104.83,334407.7]
[null,null,null,3191,104.83,334512.52999999997]
[null,null,null,3192,104.83,334617.36]
[null,null,null,3193,104.83,334722.19]
[null,null,null,3194,104.83,334827.02]
[null,null,null,3195,104.83,334931.84999999998]
[null,null,null,3196,104.83,335036.68]
[null,null,null,3197,104.83,335141.51]
[null,null,null,3198,104.83,335246.33999999997]
[null,null,null,3199,104.83,335351.17]
[null,null,null,3200,104.83,335456]
[null,null,null,3201,104.83,335560.83]
[null,null,null,3202,104.83,335665.66]
[null,null,null,3203,104.83,335770.49]
[null,null,null,3204,104.83,335875.32]
[null,null,null,3205,104.83,335980.15]
[null,null,null,3206,104.83,336084.98]
[null,null,null,3207,104.83,336189.81]
[null,null,null,3208,104.83,336294.64]
[null,null,null,3209,104.83,336399.47]
[null,null,null,3210,104.83,336504.3]
[null,null,null,3211,104.83,336609.13]
[null,null,null,3212,104.83,336713.96]
[null,null,null,3213,104.83,336818.79]
[null,null,null,3214,104.83,336923.62]
[null,null,null,3215,104.83,337028.45]
[null,null,null,3216,104.83,337133.27999999997]
[null,null,null,3217,{"$f":"$E$13","v":104.83},337238.11]
[null,null,null,3218,104.83,337342.94]
[null,null,null,3219,104.83,337447.77]
[null,null,null,3220,104.83,337552.6]
[null,null,null,3221,104.83,337657.43]
[null,null,null,3222,104.83,337762.26]
[null,null,null,3223,104.83,337867.08999999997]
[null,null,null,3224,104.83,337971.92]
[null,null,null,3225,104.83,338076.75]
[null,null,null,3226,104.83,338181.58]
[null,null,null,3227,104.83,338286.41]
[null,null,null,3228,104.83,338391.24]
[null,null,null,3229,104.83,338496.07]
[null,null,null,3230,104.83,338600.9]
[null,null,null,3231,104.83,338705.73]
[null,null,null,3232,104.83,338810.56]
[null,null,null,3233,104.83,338915.39]
[null,null,null,3234,104.83,339020.22]
[null,null,null,3235,104.83,339125.05]
[null,null,null,3236,104.83,{"$f":"E3253*D3253","v":339229.88}]
[null,null,null,3237,104.83,339334.71]
[null,null,null,3238,104.83,339439.54]
[null,null,null,3239,104.83,339544.37]
[null,null,null,3240,104.83,339649.2]
[null,null,null,3241,104.83,339754.02999999997]
[null,null,null,3242,104.83,339858.86]
[null,null,null,3243,104.83,339963.69]
[null,null,null,3244,104.83,340068.52]
[null,null,null,3245,104.83,340173.35]
[null,null,null,3246,104.83,340278.18]
[null,null,null,3247,104.83,340383.01]
[null,null,null,3248,104.83,340487.83999999997]
[null,null,null,3249,104.83,340592.67]
[null,null,null,3250,104.83,340697.5]
[null,null,null,3251,104.83,340802.33]
[null,null,null,3252,104.83,340907.16]
[null,null,null,3253,104.83,341011.99]
[null,null,null,3254,104.83,341116.82]
[null,null,null,3255,104.83,341221.65]
[null,null,null,3256,104.83,341326.48]
[null,null,null,3257,104.83,341431.31]
[null,null,null,3258,104.83,341536.14]
[null,null,null,3259,104.83,341640.97]
[null,null,null,3260,104.83,341745.8]
[null,null,null,3261,104.83,341850.63]
[null,null,null,3262,104.83,341955.46]
[null,null,null,3263,104.83,342060.29]
[null,null,null,3264,104.83,342165.12]
[null,null,null,3265,104.83,342269.95]
[null,null,null,3266,104.83,342374.77999999997]
[null,null,null,3267,104.83,342479.61]
[null,null,null,3268,104.83,342584.44]
[null,null,null,3269,104.83,342689.27]
[null,null,null,3270,104.83,342794.1]
[null,null,null,3271,104.83,342898.93]
[null,null,null,3272,104.83,343003.76]
[null,null,null,3273,104.83,343108.58999999997]
[null,null,null,3274,104.83,343213.42]
[null,null,null,3275,104.83,343318.25]
[null,null,null,3276,104.83,343423.08]
[null,null,null,3277,104.83,343527.91]
[null,null,null,3278,104.83,343632.74]
[null,null,null,3279,104.83,343737.57]
[null,null,null,3280,104.83,343842.4]
[null,null,null,3281,{"$f":"$E$13","v":104.83},343947.23]
[null,null,null,3282,104.83,344052.06]
[null,null,null,3283,104.83,344156.89]
[null,null,null,3284,104.83,344261.72]
[null,null,null,3285,104.83,344366.55]
[null,null,null,3286,104.83,344471.38]
[null,null,null,3287,104.83,344576.21]
[null,null,null,3288,104.83,344681.04]
[null,null,null,3289,104.83,344785.87]
[null,null,null,3290,104.83,344890.7]
[null,null,null,3291,104.83,344995.52999999997]
[null,null,null,3292,104.83,345100.36]
[null,null,null,3293,104.83,345205.19]
[null,null,null,3294,104.83,345310.02]
[null,null,null,3295,104.83,345414.85]
[null,null,null,3296,104.83,345519.68]
[null,null,null,3297,104.83,345624.51]
[null,null,null,3298,104.83,345729.33999999997]
[null,null,null,3299,104.83,345834.17]
[null,null,null,3300,104.83,{"$f":"E3317*D3317","v":345939}]
[null,null,null,3301,104.83,346043.83]
[null,null,null,3302,104.83,346148.66]
[null,null,null,3303,104.83,346253.49]
[null,null,null,3304,104.83,346358.32]
[null,null,null,3305,104.83,346463.15]
[null,null,null,3306,104.83,346567.98]
[null,null,null,3307,104.83,346672.81]
[null,null,null,3308,104.83,346777.64]
[null,null,null,3309,104.83,346882.47]
[null,null,null,3310,104.83,346987.3]
[null,null,null,3311,104.83,347092.13]
[null,null,null,3312,104.83,347196.96]
[null,null,null,3313,104.83,347301.79]
[null,null,null,3314,104.83,347406.62]
[null,null,null,3315,104.83,347511.45]
[null,null,null,3316,104.83,347616.27999999997]
[null,null,null,3317,104.83,347721.11]
[null,null,null,3318,104.83,347825.94]
[null,null,null,3319,104.83,347930.77]
[null,null,null,3320,104.83,348035.6]
[null,null,null,3321,104.83,348140.43]
[null,null,null,3322,104.83,348245.26]
[null,null,null,3323,104.83,348350.08999999997]
[null,null,null,3324,104.83,348454.92]
[null,null,null,3325,104.83,348559.75]
[null,null,null,3326,104.83,348664.58]
[null,null,null,3327,104.83,348769.41]
[null,null,null,3328,104.83,348874.23999999999]
[null,null,null,3329,104.83,348979.07]
[null,null,null,3330,104.83,349083.9]
[null,null,null,3331,104.83,349188.73]
[null,null,null,3332,104.83,349293.56]
[null,null,null,3333,104.83,349398.39]
[null,null,null,3334,104.83,349503.22]
[null,null,null,3335,104.83,349608.05]
[null,null,null,3336,104.83,349712.88]
[null,null,null,3337,104.83,349817.71]
[null,null,null,3338,104.83,349922.54]
[null,null,null,3339,104.83,350027.37]
[null,null,null,3340,104.83,350132.2]
[null,null,null,3341,104.83,350237.02999999997]
[null,null,null,3342,104.83,350341.86]
[null,null,null,3343,104.83,350446.69]
[null,null,null,3344,104.83,350551.52]
[null,null,null,3345,{"$f":"$E$13","v":104.83},350656.35]
[null,null,null,3346,104.83,350761.18]
[null,null,null,3347,104.83,350866.01]
[null,null,null,3348,104.83,350970.83999999997]
[null,null,null,3349,104.83,351075.67]
[null,null,null,3350,104.83,351180.5]
[null,null,null,3351,104.83,351285.33]
[null,null,null,3352,104.83,351390.16]
[null,null,null,3353,104.83,351494.99]
[null,null,null,3354,104.83,351599.82]
[null,null,null,3355,104.83,351704.65]
[null,null,null,3356,104.83,351809.48]
[null,null,null,3357,104.83,351914.31]
[null,null,null,3358,104.83,352019.14]
[null,null,null,3359,104.83,352123.97]
[null,null,null,3360,104.83,352228.8]
[null,null,null,3361,104.83,352333.63]
[null,null,null,3362,104.83,352438.46]
[null,null,null,3363,104.83,352543.29]
[null,null,null,3364,104.83,{"$f":"E3381*D3381","v":352648.12}]
[null,null,null,3365,104.83,352752.95]
[null,null,null,3366,104.83,352857.77999999997]
[null,null,null,3367,104.83,352962.61]
[null,null,null,3368,104.83,353067.44]
[null,null,null,3369,104.83,353172.27]
[null,null,null,3370,104.83,353277.1]
[null,null,null,3371,104.83,353381.93]
[null,null,null,3372,104.83,353486.76]
[null,null,null,3373,104.83,353591.58999999997]
[null,null,null,3374,104.83,353696.42]
[null,null,null,3375,104.83,353801.25]
[null,null,null,3376,104.83,353906.08]
[null,null,null,3377,104.83,354010.91]
[null,null,null,3378,104.83,354115.74]
[null,null,null,3379,104.83,354220.57]
[null,null,null,3380,104.83,354325.4]
[null,null,null,3381,104.83,354430.23]
[null,null,null,3382,104.83,354535.06]
[null,null,null,3383,104.83,354639.89]
[null,null,null,3384,104.83,354744.72]
[null,null,null,3385,104.83,354849.55]
[null,null,null,3386,104.83,354954.38]
[null,null,null,3387,104.83,355059.21]
[null,null,null,3388,104.83,355164.04]
[null,null,null,3389,104.83,355268.87]
[null,null,null,3390,104.83,355373.7]
[null,null,null,3391,104.83,355478.52999999997]
[null,null,null,3392,104.83,355583.36]
[null,null,null,3393,104.83,355688.19]
[null,null,null,3394,104.83,355793.02]
[null,null,null,3395,104.83,355897.85]
[null,null,null,3396,104.83,356002.68]
[null,null,null,3397,104.83,356107.51]
[null,null,null,3398,104.83,356212.33999999997]
[null,null,null,3399,104.83,356317.17]
[null,null,null,3400,104.83,356422]
[null,null,null,3401,104.83,356526.83]
[null,null,null,3402,104.83,356631.66]
[null,null,null,3403,104.83,356736.49]
[null,null,null,3404,104.83,356841.32]
[null,null,null,3405,104.83,356946.15]
[null,null,null,3406,104.83,357050.98]
[null,null,null,3407,104.83,357155.81]
[null,null,null,3408,104.83,357260.64]
[null,null,null,3409,{"$f":"$E$13","v":104.83},357365.47]
[null,null,null,3410,104.83,357470.3]
[null,null,null,3411,104.83,357575.13]
[null,null,null,3412,104.83,357679.96]
[null,null,null,3413,104.83,357784.79]
[null,null,null,3414,104.83,357889.62]
[null,null,null,3415,104.83,357994.45]
[null,null,null,3416,104.83,358099.27999999997]
[null,null,null,3417,104.83,358204.11]
[null,null,null,3418,104.83,358308.94]
[null,null,null,3419,104.83,358413.77]
[null,null,null,3420,104.83,358518.6]
[null,null,null,3421,104.83,358623.43]
[null,null,null,3422,104.83,358728.26]
[null,null,null,3423,104.83,358833.08999999997]
[null,null,null,3424,104.83,358937.92]
[null,null,null,3425,104.83,359042.75]
[null,null,null,3426,104.83,359147.58]
[null,null,null,3427,104.83,359252.41]
[null,null,null,3428,104.83,{"$f":"E3445*D3445","v":359357.24}]
[null,null,null,3429,104.83,359462.07]
[null,null,null,3430,104.83,359566.89999999997]
[null,null,null,3431,104.83,359671.73]
[null,null,null,3432,104.83,359776.56]
[null,null,null,3433,104.83,359881.39]
[null,null,null,3434,104.83,359986.22]
[null,null,null,3435,104.83,360091.05]
[null,null,null,3436,104.83,360195.88]
[null,null,null,3437,104.83,360300.71]
[null,null,null,3438,104.83,360405.54]
[null,null,null,3439,104.83,360510.37]
[null,null,null,3440,104.83,360615.2]
[null,null,null,3441,104.83,360720.02999999997]
[null,null,null,3442,104.83,360824.86]
[null,null,null,3443,104.83,360929.69]
[null,null,null,3444,104.83,361034.52]
[null,null,null,3445,104.83,361139.35]
[null,null,null,3446,104.83,361244.18]
[null,null,null,3447,104.83,361349.01]
[null,null,null,3448,104.83,361453.83999999997]
[null,null,null,3449,104.83,361558.67]
[null,null,null,3450,104.83,361663.5]
[null,null,null,3451,104.83,361768.33]
[null,null,null,3452,104.83,361873.16]
[null,null,null,3453,104.83,361977.99]
[null,null,null,3454,104.83,362082.82]
[null,null,null,3455,104.83,362187.64999999997]
[null,null,null,3456,104.83,362292.47999999998]
[null,null,null,3457,104.83,362397.31]
[null,null,null,3458,104.83,362502.14]
[null,null,null,3459,104.83,362606.97]
[null,null,null,3460,104.83,362711.8]
[null,null,null,3461,104.83,362816.63]
[null,null,null,3462,104.83,362921.46]
[null,null,null,3463,104.83,363026.29]
[null,null,null,3464,104.83,363131.12]
[null,null,null,3465,104.83,363235.95]
[null,null,null,3466,104.83,363340.77999999997]
[null,null,null,3467,104.83,363445.61]
[null,null,null,3468,104.83,363550.44]
[null,null,null,3469,104.83,363655.27]
[null,null,null,3470,104.83,363760.1]
[null,null,null,3471,104.83,363864.93]
[null,null,null,3472,104.83,363969.76]
[null,null,null,3473,{"$f":"$E$13","v":104.83},364074.58999999997]
[null,null,null,3474,104.83,364179.42]
[null,null,null,3475,104.83,364284.25]
[null,null,null,3476,104.83,364389.08]
[null,null,null,3477,104.83,364493.91]
[null,null,null,3478,104.83,364598.74]
[null,null,null,3479,104.83,364703.57]
[null,null,null,3480,104.83,364808.39999999997]
[null,null,null,3481,104.83,364913.23]
[null,null,null,3482,104.83,365018.06]
[null,null,null,3483,104.83,365122.89]
[null,null,null,3484,104.83,365227.72]
[null,null,null,3485,104.83,365332.55]
[null,null,null,3486,104.83,365437.38]
[null,null,null,3487,104.83,365542.21]
[null,null,null,3488,104.83,365647.04]
[null,null,null,3489,104.83,365751.87]
[null,null,null,3490,104.83,365856.7]
[null,null,null,3491,104.83,365961.52999999997]
[null,null,null,3492,104.83,{"$f":"E3509*D3509","v":366066.36}]
[null,null,null,3493,104.83,366171.19]
[null,null,null,3494,104.83,366276.02]
[null,null,null,3495,104.83,366380.85]
[null,null,null,3496,104.83,366485.68]
[null,null,null,3497,104.83,366590.51]
[null,null,null,3498,104.83,366695.33999999997]
[null,null,null,3499,104.83,366800.17]
[null,null,null,3500,104.83,366905]
[null,null,null,3501,104.83,367009.83]
[null,null,null,3502,104.83,367114.66]
[null,null,null,3503,104.83,367219.49]
[null,null,null,3504,104.83,367324.32]
[null,null,null,3505,104.83,367429.14999999997]
[null,null,null,3506,104.83,367533.98]
[null,null,null,3507,104.83,367638.81]
[null,null,null,3508,104.83,367743.64]
[null,null,null,3509,104.83,367848.47]
[null,null,null,3510,104.83,367953.3]
[null,null,null,3511,104.83,368058.13]
[null,null,null,3512,104.83,368162.96]
[null,null,null,3513,104.83,368267.79]
[null,null,null,3514,104.83,368372.62]
[null,null,null,3515,104.83,368477.45]
[null,null,null,3516,104.83,368582.27999999997]
[null,null,null,3517,104.83,368687.11]
[null,null,null,3518,104.83,368791.94]
[null,null,null,3519,104.83,368896.77]
[null,null,null,3520,104.83,369001.6]
[null,null,null,3521,104.83,369106.43]
[null,null,null,3522,104.83,369211.26]
[null,null,null,3523,104.83,369316.08999999997]
[null,null,null,3524,104.83,369420.92]
[null,null,null,3525,104.83,369525.75]
[null,null,null,3526,104.83,369630.58]
[null,null,null,3527,104.83,369735.41]
[null,null,null,3528,104.83,369840.24]
[null,null,null,3529,104.83,369945.07]
[null,null,null,3530,104.83,370049.89999999997]
[null,null,null,3531,104.83,370154.73]
[null,null,null,3532,104.83,370259.56]
[null,null,null,3533,104.83,370364.39]
[null,null,null,3534,104.83,370469.22]
[null,null,null,3535,104.83,370574.05]
[null,null,null,3536,104.83,370678.88]
[null,null,null,3537,{"$f":"$E$13","v":104.83},370783.71]
[null,null,null,3538,104.83,370888.54]
[null,null,null,3539,104.83,370993.37]
[null,null,null,3540,104.83,371098.2]
[null,null,null,3541,104.83,371203.02999999997]
[null,null,null,3542,104.83,371307.86]
[null,null,null,3543,104.83,371412.69]
[null,null,null,3544,104.83,371517.52]
[null,null,null,3545,104.83,371622.35]
[null,null,null,3546,104.83,371727.18]
[null,null,null,3547,104.83,371832.01]
[null,null,null,3548,104.83,371936.83999999997]
[null,null,null,3549,104.83,372041.67]
[null,null,null,3550,104.83,372146.5]
[null,null,null,3551,104.83,372251.33]
[null,null,null,3552,104.83,372356.16]
[null,null,null,3553,104.83,372460.99]
[null,null,null,3554,104.83,372565.82]
[null,null,null,3555,104.83,372670.64999999997]
[null,null,null,3556,104.83,{"$f":"E3573*D3573","v":372775.48}]
[null,null,null,3557,104.83,372880.31]
[null,null,null,3558,104.83,372985.14]
[null,null,null,3559,104.83,373089.97]
[null,null,null,3560,104.83,373194.8]
[null,null,null,3561,104.83,373299.63]
[null,null,null,3562,104.83,373404.46]
[null,null,null,3563,104.83,373509.29]
[null,null,null,3564,104.83,373614.12]
[null,null,null,3565,104.83,373718.95]
[null,null,null,3566,104.83,373823.77999999997]
[null,null,null,3567,104.83,373928.61]
[null,null,null,3568,104.83,374033.44]
[null,null,null,3569,104.83,374138.27]
[null,null,null,3570,104.83,374243.1]
[null,null,null,3571,104.83,374347.93]
[null,null,null,3572,104.83,374452.76]
[null,null,null,3573,104.83,374557.58999999997]
[null,null,null,3574,104.83,374662.42]
[null,null,null,3575,104.83,374767.25]
[null,null,null,3576,104.83,374872.08]
[null,null,null,3577,104.83,374976.91]
[null,null,null,3578,104.83,375081.74]
[null,null,null,3579,104.83,375186.57]
[null,null,null,3580,104.83,375291.39999999997]
[null,null,null,3581,104.83,375396.23]
[null,null,null,3582,104.83,375501.06]
[null,null,null,3583,104.83,375605.89]
[null,null,null,3584,104.83,375710.71999999997]
[null,null,null,3585,104.83,375815.55]
[null,null,null,3586,104.83,375920.38]
[null,null,null,3587,104.83,376025.21]
[null,null,null,3588,104.83,376130.04]
[null,null,null,3589,104.83,376234.87]
[null,null,null,3590,104.83,376339.7]
[null,null,null,3591,104.83,376444.52999999997]
[null,null,null,3592,104.83,376549.36]
[null,null,null,3593,104.83,376654.19]
[null,null,null,3594,104.83,376759.02]
[null,null,null,3595,104.83,376863.85]
[null,null,null,3596,104.83,376968.68]
[null,null,null,3597,104.83,377073.51]
[null,null,null,3598,104.83,377178.33999999997]
[null,null,null,3599,104.83,377283.17]
[null,null,null,3600,104.83,377388]
[null,null,null,3601,{"$f":"$E$13","v":104.83},377492.83]
[null,null,null,3602,104.83,377597.66]
[null,null,null,3603,104.83,377702.49]
[null,null,null,3604,104.83,377807.32]
[null,null,null,3605,104.83,377912.14999999997]
[null,null,null,3606,104.83,378016.98]
[null,null,null,3607,104.83,378121.81]
[null,null,null,3608,104.83,378226.64]
[null,null,null,3609,104.83,378331.47]
[null,null,null,3610,104.83,378436.3]
[null,null,null,3611,104.83,378541.13]
[null,null,null,3612,104.83,378645.96]
[null,null,null,3613,104.83,378750.79]
[null,null,null,3614,104.83,378855.62]
[null,null,null,3615,104.83,378960.45]
[null,null,null,3616,104.83,379065.27999999997]
[null,null,null,3617,104.83,379170.11]
[null,null,null,3618,104.83,379274.94]
[null,null,null,3619,104.83,379379.77]
[null,null,null,3620,104.83,{"$f":"E3637*D3637","v":379484.6}]
[null,null,null,3621,104.83,379589.43]
[null,null,null,3622,104.83,379694.26]
[null,null,null,3623,104.83,379799.08999999997]
[null,null,null,3624,104.83,379903.92]
[null,null,null,3625,104.83,380008.75]
[null,null,null,3626,104.83,380113.58]
[null,null,null,3627,104.83,380218.41]
[null,null,null,3628,104.83,380323.24]
[null,null,null,3629,104.83,380428.07]
[null,null,null,3630,104.83,380532.89999999997]
[null,null,null,3631,104.83,380637.73]
[null,null,null,3632,104.83,380742.56]
[null,null,null,3633,104.83,380847.39]
[null,null,null,3634,104.83,380952.22]
[null,null,null,3635,104.83,381057.05]
[null,null,null,3636,104.83,381161.88]
[null,null,null,3637,104.83,381266.71]
[null,null,null,3638,104.83,381371.54]
[null,null,null,3639,104.83,381476.37]
[null,null,null,3640,104.83,381581.2]
[null,null,null,3641,104.83,381686.02999999997]
[null,null,null,3642,104.83,381790.86]
[null,null,null,3643,104.83,381895.69]
[null,null,null,3644,104.83,382000.52]
[null,null,null,3645,104.83,382105.35]
[null,null,null,3646,104.83,382210.18]
[null,null,null,3647,104.83,382315.01]
[null,null,null,3648,104.83,382419.83999999997]
[null,null,null,3649,104.83,382524.67]
[null,null,null,3650,104.83,382629.5]
[null,null,null,3651,104.83,382734.33]
[null,null,null,3652,104.83,382839.16]
[null,null,null,3653,104.83,382943.99]
[null,null,null,3654,104.83,383048.82]
[null,null,null,3655,104.83,383153.64999999997]
[null,null,null,3656,104.83,383258.48]
[null,null,null,3657,104.83,383363.31]
[null,null,null,3658,104.83,383468.14]
[null,null,null,3659,104.83,383572.97]
[null,null,null,3660,104.83,383677.8]
[null,null,null,3661,104.83,383782.63]
[null,null,null,3662,104.83,383887.46]
[null,null,null,3663,104.83,383992.29]
[null,null,null,3664,104.83,384097.12]
[null,null,null,3665,{"$f":"$E$13","v":104.83},384201.95]
[null,null,null,3666,104.83,384306.77999999997]
[null,null,null,3667,104.83,384411.61]
[null,null,null,3668,104.83,384516.44]
[null,null,null,3669,104.83,384621.27]
[null,null,null,3670,104.83,384726.1]
[null,null,null,3671,104.83,384830.93]
[null,null,null,3672,104.83,384935.76]
[null,null,null,3673,104.83,385040.58999999997]
[null,null,null,3674,104.83,385145.42]
[null,null,null,3675,104.83,385250.25]
[null,null,null,3676,104.83,385355.08]
[null,null,null,3677,104.83,385459.91]
[null,null,null,3678,104.83,385564.74]
[null,null,null,3679,104.83,385669.57]
[null,null,null,3680,104.83,385774.39999999997]
[null,null,null,3681,104.83,385879.23]
[null,null,null,3682,104.83,385984.06]
[null,null,null,3683,104.83,386088.89]
[null,null,null,3684,104.83,{"$f":"E3701*D3701","v":386193.72}]
[null,null,null,3685,104.83,386298.55]
[null,null,null,3686,104.83,386403.38]
[null,null,null,3687,104.83,386508.21]
[null,null,null,3688,104.83,386613.04]
[null,null,null,3689,104.83,386717.87]
[null,null,null,3690,104.83,386822.7]
[null,null,null,3691,104.83,386927.52999999997]
[null,null,null,3692,104.83,387032.36]
[null,null,null,3693,104.83,387137.19]
[null,null,null,3694,104.83,387242.02]
[null,null,null,3695,104.83,387346.85]
[null,null,null,3696,104.83,387451.68]
[null,null,null,3697,104.83,387556.51]
[null,null,null,3698,104.83,387661.33999999997]
[null,null,null,3699,104.83,387766.17]
[null,null,null,3700,104.83,387871]
[null,null,null,3701,104.83,387975.83]
[null,null,null,3702,104.83,388080.66]
[null,null,null,3703,104.83,388185.49]
[null,null,null,3704,104.83,388290.32]
[null,null,null,3705,104.83,388395.14999999997]
[null,null,null,3706,104.83,388499.98]
[null,null,null,3707,104.83,388604.81]
[null,null,null,3708,104.83,388709.64]
[null,null,null,3709,104.83,388814.47]
[null,null,null,3710,104.83,388919.3]
[null,null,null,3711,104.83,389024.13]
[null,null,null,3712,104.83,389128.96000000002]
[null,null,null,3713,104.83,389233.79]
[null,null,null,3714,104.83,389338.62]
[null,null,null,3715,104.83,389443.45]
[null,null,null,3716,104.83,389548.27999999997]
[null,null,null,3717,104.83,389653.11]
[null,null,null,3718,104.83,389757.94]
[null,null,null,3719,104.83,389862.77]
[null,null,null,3720,104.83,389967.6]
[null,null,null,3721,104.83,390072.43]
[null,null,null,3722,104.83,390177.26]
[null,null,null,3723,104.83,390282.08999999997]
[null,null,null,3724,104.83,390386.92]
[null,null,null,3725,104.83,390491.75]
[null,null,null,3726,104.83,390596.58]
[null,null,null,3727,104.83,390701.41]
[null,null,null,3728,104.83,390806.24]
[null,null,null,3729,{"$f":"$E$13","v":104.83},390911.07]
[null,null,null,3730,104.83,391015.89999999997]
[null,null,null,3731,104.83,391120.73]
[null,null,null,3732,104.83,391225.56]
[null,null,null,3733,104.83,391330.39]
[null,null,null,3734,104.83,391435.22]
[null,null,null,3735,104.83,391540.05]
[null,null,null,3736,104.83,391644.88]
[null,null,null,3737,104.83,391749.71]
[null,null,null,3738,104.83,391854.54]
[null,null,null,3739,104.83,391959.37]
[null,null,null,3740,104.83,392064.2]
[null,null,null,3741,104.83,392169.02999999997]
[null,null,null,3742,104.83,392273.86]
[null,null,null,3743,104.83,392378.69]
[null,null,null,3744,104.83,392483.52]
[null,null,null,3745,104.83,392588.35]
[null,null,null,3746,104.83,392693.18]
[null,null,null,3747,104.83,392798.01]
[null,null,null,3748,104.83,{"$f":"E3765*D3765","v":392902.83999999997}]
[null,null,null,3749,104.83,393007.67]
[null,null,null,3750,104.83,393112.5]
[null,null,null,3751,104.83,393217.33]
[null,null,null,3752,104.83,393322.16]
[null,null,null,3753,104.83,393426.99]
[null,null,null,3754,104.83,393531.82]
[null,null,null,3755,104.83,393636.64999999997]
[null,null,null,3756,104.83,393741.48]
[null,null,null,3757,104.83,393846.31]
[null,null,null,3758,104.83,393951.14]
[null,null,null,3759,104.83,394055.97]
[null,null,null,3760,104.83,394160.8]
[null,null,null,3761,104.83,394265.63]
[null,null,null,3762,104.83,394370.46]
[null,null,null,3763,104.83,394475.29]
[null,null,null,3764,104.83,394580.12]
[null,null,null,3765,104.83,394684.95]
[null,null,null,3766,104.83,394789.77999999997]
[null,null,null,3767,104.83,394894.61]
[null,null,null,3768,104.83,394999.44]
[null,null,null,3769,104.83,395104.27]
[null,null,null,3770,104.83,395209.1]
[null,null,null,3771,104.83,395313.93]
[null,null,null,3772,104.83,395418.76]
[null,null,null,3773,104.83,395523.58999999997]
[null,null,null,3774,104.83,395628.42]
[null,null,null,3775,104.83,395733.25]
[null,null,null,3776,104.83,395838.08]
[null,null,null,3777,104.83,395942.91]
[null,null,null,3778,104.83,396047.74]
[null,null,null,3779,104.83,396152.57]
[null,null,null,3780,104.83,396257.39999999997]
[null,null,null,3781,104.83,396362.23]
[null,null,null,3782,104.83,396467.06]
[null,null,null,3783,104.83,396571.89]
[null,null,null,3784,104.83,396676.72]
[null,null,null,3785,104.83,396781.55]
[null,null,null,3786,104.83,396886.38]
[null,null,null,3787,104.83,396991.21]
[null,null,null,3788,104.83,397096.04]
[null,null,null,3789,104.83,397200.87]
[null,null,null,3790,104.83,397305.7]
[null,null,null,3791,104.83,397410.52999999997]
[null,null,null,3792,104.83,397515.36]
[null,null,null,3793,{"$f":"$E$13","v":104.83},397620.19]
[null,null,null,3794,104.83,397725.02]
[null,null,null,3795,104.83,397829.85]
[null,null,null,3796,104.83,397934.68]
[null,null,null,3797,104.83,398039.51]
[null,null,null,3798,104.83,398144.33999999997]
[null,null,null,3799,104.83,398249.17]
[null,null,null,3800,104.83,398354]
[null,null,null,3801,104.83,398458.83]
[null,null,null,3802,104.83,398563.66]
[null,null,null,3803,104.83,398668.49]
[null,null,null,3804,104.83,398773.32]
[null,null,null,3805,104.83,398878.14999999997]
[null,null,null,3806,104.83,398982.98]
[null,null,null,3807,104.83,399087.81]
[null,null,null,3808,104.83,399192.64]
[null,null,null,3809,104.83,399297.47]
[null,null,null,3810,104.83,399402.3]
[null,null,null,3811,104.83,399507.13]
[null,null,null,3812,104.83,{"$f":"E3829*D3829","v":399611.96}]
[null,null,null,3813,104.83,399716.79]
[null,null,null,3814,104.83,399821.62]
[null,null,null,3815,104.83,399926.45]
[null,null,null,3816,104.83,400031.27999999997]
[null,null,null,3817,104.83,400136.11]
[null,null,null,3818,104.83,400240.94]
[null,null,null,3819,104.83,400345.77]
[null,null,null,3820,104.83,400450.6]
[null,null,null,3821,104.83,400555.43]
[null,null,null,3822,104.83,400660.26]
[null,null,null,3823,104.83,400765.08999999997]
[null,null,null,3824,104.83,400869.92]
[null,null,null,3825,104.83,400974.75]
[null,null,null,3826,104.83,401079.58]
[null,null,null,3827,104.83,401184.41]
[null,null,null,3828,104.83,401289.24]
[null,null,null,3829,104.83,401394.07]
[null,null,null,3830,104.83,401498.89999999997]
[null,null,null,3831,104.83,401603.73]
[null,null,null,3832,104.83,401708.56]
[null,null,null,3833,104.83,401813.39]
[null,null,null,3834,104.83,401918.22]
[null,null,null,3835,104.83,402023.05]
[null,null,null,3836,104.83,402127.88]
[null,null,null,3837,104.83,402232.71]
[null,null,null,3838,104.83,402337.54]
[null,null,null,3839,104.83,402442.37]
[null,null,null,3840,104.83,402547.20000000001]
[null,null,null,3841,104.83,402652.02999999997]
[null,null,null,3842,104.83,402756.86]
[null,null,null,3843,104.83,402861.69]
[null,null,null,3844,104.83,402966.52]
[null,null,null,3845,104.83,403071.35]
[null,null,null,3846,104.83,403176.18]
[null,null,null,3847,104.83,403281.01]
[null,null,null,3848,104.83,403385.83999999997]
[null,null,null,3849,104.83,403490.67]
[null,null,null,3850,104.83,403595.5]
[null,null,null,3851,104.83,403700.33]
[null,null,null,3852,104.83,403805.16]
[null,null,null,3853,104.83,403909.99]
[null,null,null,3854,104.83,404014.82]
[null,null,null,3855,104.83,404119.64999999997]
[null,null,null,3856,104.83,404224.48]
[null,null,null,3857,{"$f":"$E$13","v":104.83},404329.31]
[null,null,null,3858,104.83,404434.14]
[null,null,null,3859,104.83,404538.97]
[null,null,null,3860,104.83,404643.8]
[null,null,null,3861,104.83,404748.63]
[null,null,null,3862,104.83,404853.46]
[null,null,null,3863,104.83,404958.29]
[null,null,null,3864,104.83,405063.12]
[null,null,null,3865,104.83,405167.95]
[null,null,null,3866,104.83,405272.77999999997]
[null,null,null,3867,104.83,405377.61]
[null,null,null,3868,104.83,405482.44]
[null,null,null,3869,104.83,405587.27]
[null,null,null,3870,104.83,405692.1]
[null,null,null,3871,104.83,405796.93]
[null,null,null,3872,104.83,405901.76]
[null,null,null,3873,104.83,406006.58999999997]
[null,null,null,3874,104.83,406111.42]
[null,null,null,3875,104.83,406216.25]
[null,null,null,3876,104.83,{"$f":"E3893*D3893","v":406321.08}]
[null,null,null,3877,104.83,406425.91]
[null,null,null,3878,104.83,406530.74]
[null,null,null,3879,104.83,406635.57]
[null,null,null,3880,104.83,406740.39999999997]
[null,null,null,3881,104.83,406845.23]
[null,null,null,3882,104.83,406950.06]
[null,null,null,3883,104.83,407054.89]
[null,null,null,3884,104.83,407159.72]
[null,null,null,3885,104.83,407264.55]
[null,null,null,3886,104.83,407369.38]
[null,null,null,3887,104.83,407474.21]
[null,null,null,3888,104.83,407579.04]
[null,null,null,3889,104.83,407683.87]
[null,null,null,3890,104.83,407788.7]
[null,null,null,3891,104.83,407893.52999999997]
[null,null,null,3892,104.83,407998.36]
[null,null,null,3893,104.83,408103.19]
[null,null,null,3894,104.83,408208.02]
[null,null,null,3895,104.83,408312.85]
[null,null,null,3896,104.83,408417.68]
[null,null,null,3897,104.83,408522.51]
[null,null,null,3898,104.83,408627.33999999997]
[null,null,null,3899,104.83,408732.17]
[null,null,null,3900,104.83,408837]
[null,null,null,3901,104.83,408941.83]
[null,null,null,3902,104.83,409046.66]
[null,null,null,3903,104.83,409151.49]
[null,null,null,3904,104.83,409256.32]
[null,null,null,3905,104.83,409361.14999999997]
[null,null,null,3906,104.83,409465.98]
[null,null,null,3907,104.83,409570.81]
[null,null,null,3908,104.83,409675.64]
[null,null,null,3909,104.83,409780.47]
[null,null,null,3910,104.83,409885.3]
[null,null,null,3911,104.83,409990.13]
[null,null,null,3912,104.83,410094.96]
[null,null,null,3913,104.83,410199.79]
[null,null,null,3914,104.83,410304.62]
[null,null,null,3915,104.83,410409.45]
[null,null,null,3916,104.83,410514.27999999997]
[null,null,null,3917,104.83,410619.11]
[null,null,null,3918,104.83,410723.94]
[null,null,null,3919,104.83,410828.77]
[null,null,null,3920,104.83,410933.6]
[null,null,null,3921,{"$f":"$E$13","v":104.83},411038.43]
[null,null,null,3922,104.83,411143.26]
[null,null,null,3923,104.83,411248.08999999997]
[null,null,null,3924,104.83,411352.92]
[null,null,null,3925,104.83,411457.75]
[null,null,null,3926,104.83,411562.58]
[null,null,null,3927,104.83,411667.41]
[null,null,null,3928,104.83,411772.24]
[null,null,null,3929,104.83,411877.07]
[null,null,null,3930,104.83,411981.89999999997]
[null,null,null,3931,104.83,412086.73]
[null,null,null,3932,104.83,412191.56]
[null,null,null,3933,104.83,412296.39]
[null,null,null,3934,104.83,412401.22]
[null,null,null,3935,104.83,412506.05]
[null,null,null,3936,104.83,412610.88]
[null,null,null,3937,104.83,412715.71]
[null,null,null,3938,104.83,412820.54]
[null,null,null,3939,104.83,412925.37]
[null,null,null,3940,104.83,{"$f":"E3957*D3957","v":413030.2}]
[null,null,null,3941,104.83,413135.02999999997]
[null,null,null,3942,104.83,413239.86]
[null,null,null,3943,104.83,413344.69]
[null,null,null,3944,104.83,413449.52]
[null,null,null,3945,104.83,413554.35]
[null,null,null,3946,104.83,413659.18]
[null,null,null,3947,104.83,413764.01]
[null,null,null,3948,104.83,413868.83999999997]
[null,null,null,3949,104.83,413973.67]
[null,null,null,3950,104.83,414078.5]
[null,null,null,3951,104.83,414183.33]
[null,null,null,3952,104.83,414288.16]
[null,null,null,3953,104.83,414392.99]
[null,null,null,3954,104.83,414497.82]
[null,null,null,3955,104.83,414602.64999999997]
[null,null,null,3956,104.83,414707.48]
[null,null,null,3957,104.83,414812.31]
[null,null,null,3958,104.83,414917.14]
[null,null,null,3959,104.83,415021.97]
[null,null,null,3960,104.83,415126.8]
[null,null,null,3961,104.83,415231.63]
[null,null,null,3962,104.83,415336.46]
[null,null,null,3963,104.83,415441.29]
[null,null,null,3964,104.83,415546.12]
[null,null,null,3965,104.83,415650.95]
[null,null,null,3966,104.83,415755.77999999997]
[null,null,null,3967,104.83,415860.61]
[null,null,null,3968,104.83,415965.44]
[null,null,null,3969,104.83,416070.27]
[null,null,null,3970,104.83,416175.1]
[null,null,null,3971,104.83,416279.93]
[null,null,null,3972,104.83,416384.76]
[null,null,null,3973,104.83,416489.58999999997]
[null,null,null,3974,104.83,416594.42]
[null,null,null,3975,104.83,416699.25]
[null,null,null,3976,104.83,416804.08]
[null,null,null,3977,104.83,416908.91]
[null,null,null,3978,104.83,417013.74]
[null,null,null,3979,104.83,417118.57]
[null,null,null,3980,104.83,417223.39999999997]
[null,null,null,3981,104.83,417328.23]
[null,null,null,3982,104.83,417433.06]
[null,null,null,3983,104.83,417537.89]
[null,null,null,3984,104.83,417642.72]
[null,null,null,3985,{"$f":"$E$13","v":104.83},417747.55]
[null,null,null,3986,104.83,417852.38]
[null,null,null,3987,104.83,417957.21]
[null,null,null,3988,104.83,418062.04]
[null,null,null,3989,104.83,418166.87]
[null,null,null,3990,104.83,418271.7]
[null,null,null,3991,104.83,418376.52999999997]
[null,null,null,3992,104.83,418481.36]
[null,null,null,3993,104.83,418586.19]
[null,null,null,3994,104.83,418691.02]
[null,null,null,3995,104.83,418795.85]
[null,null,null,3996,104.83,418900.68]
[null,null,null,3997,104.83,419005.51]
[null,null,null,3998,104.83,419110.33999999997]
[null,null,null,3999,104.83,419215.17]
[null,null,null,4000,104.83,419320]
[null,null,null,4001,104.83,419424.83]
[null,null,null,4002,104.83,419529.66]
[null,null,null,4003,104.83,419634.49]
[null,null,null,4004,104.83,{"$f":"E4021*D4021","v":419739.32}]
[null,null,null,4005,104.83,419844.14999999997]
[null,null,null,4006,104.83,419948.98]
[null,null,null,4007,104.83,420053.81]
[null,null,null,4008,104.83,420158.64]
[null,null,null,4009,104.83,420263.47]
[null,null,null,4010,104.83,420368.3]
[null,null,null,4011,104.83,420473.13]
[null,null,null,4012,104.83,420577.96]
[null,null,null,4013,104.83,420682.79]
[null,null,null,4014,104.83,420787.62]
[null,null,null,4015,104.83,420892.45]
[null,null,null,4016,104.83,420997.27999999997]
[null,null,null,4017,104.83,421102.11]
[null,null,null,4018,104.83,421206.94]
[null,null,null,4019,104.83,421311.77]
[null,null,null,4020,104.83,421416.6]
[null,null,null,4021,104.83,421521.43]
[null,null,null,4022,104.83,421626.26]
[null,null,null,4023,104.83,421731.08999999997]
[null,null,null,4024,104.83,421835.92]
[null,null,null,4025,104.83,421940.75]
[null,null,null,4026,104.83,422045.58]
[null,null,null,4027,104.83,422150.41]
[null,null,null,4028,104.83,422255.24]
[null,null,null,4029,104.83,422360.07]
[null,null,null,4030,104.83,422464.89999999997]
[null,null,null,4031,104.83,422569.73]
[null,null,null,4032,104.83,422674.56]
[null,null,null,4033,104.83,422779.39]
[null,null,null,4034,104.83,422884.22]
[null,null,null,4035,104.83,422989.05]
[null,null,null,4036,104.83,423093.88]
[null,null,null,4037,104.83,423198.71]
[null,null,null,4038,104.83,423303.54]
[null,null,null,4039,104.83,423408.37]
[null,null,null,4040,104.83,423513.2]
[null,null,null,4041,104.83,423618.02999999997]
[null,null,null,4042,104.83,423722.86]
[null,null,null,4043,104.83,423827.69]
[null,null,null,4044,104.83,423932.52]
[null,null,null,4045,104.83,424037.35]
[null,null,null,4046,104.83,424142.18]
[null,null,null,4047,104.83,424247.01]
[null,null,null,4048,104.83,424351.83999999997]
[null,null,null,4049,{"$f":"$E$13","v":104.83},424456.67]
[null,null,null,4050,104.83,424561.5]
[null,null,null,4051,104.83,424666.33]
[null,null,null,4052,104.83,424771.16]
[null,null,null,4053,104.83,424875.99]
[null,null,null,4054,104.83,424980.82]
[null,null,null,4055,104.83,425085.64999999997]
[null,null,null,4056,104.83,425190.48]
[null,null,null,4057,104.83,425295.31]
[null,null,null,4058,104.83,425400.14]
[null,null,null,4059,104.83,425504.97]
[null,null,null,4060,104.83,425609.8]
[null,null,null,4061,104.83,425714.63]
[null,null,null,4062,104.83,425819.46]
[null,null,null,4063,104.83,425924.29]
[null,null,null,4064,104.83,426029.12]
[null,null,null,4065,104.83,426133.95]
[null,null,null,4066,104.83,426238.77999999997]
[null,null,null,4067,104.83,426343.61]
[null,null,null,4068,104.83,{"$f":"E4085*D4085","v":426448.44}]
[null,null,null,4069,104.83,426553.27]
[null,null,null,4070,104.83,426658.1]
[null,null,null,4071,104.83,426762.93]
[null,null,null,4072,104.83,426867.76]
[null,null,null,4073,104.83,426972.58999999997]
[null,null,null,4074,104.83,427077.42]
[null,null,null,4075,104.83,427182.25]
[null,null,null,4076,104.83,427287.08]
[null,null,null,4077,104.83,427391.91]
[null,null,null,4078,104.83,427496.74]
[null,null,null,4079,104.83,427601.57]
[null,null,null,4080,104.83,427706.39999999997]
[null,null,null,4081,104.83,427811.23]
[null,null,null,4082,104.83,427916.06]
[null,null,null,4083,104.83,428020.89]
[null,null,null,4084,104.83,428125.72]
[null,null,null,4085,104.83,428230.55]
[null,null,null,4086,104.83,428335.38]
[null,null,null,4087,104.83,428440.21]
[null,null,null,4088,104.83,428545.04]
[null,null,null,4089,104.83,428649.87]
[null,null,null,4090,104.83,428754.7]
[null,null,null,4091,104.83,428859.52999999997]
[null,null,null,4092,104.83,428964.36]
[null,null,null,4093,104.83,429069.19]
[null,null,null,4094,104.83,429174.02]
[null,null,null,4095,104.83,429278.85]
[null,null,null,4096,104.83,429383.67999999999]
[null,null,null,4097,104.83,429488.51]
[null,null,null,4098,104.83,429593.33999999997]
[null,null,null,4099,104.83,429698.17]
[null,null,null,4100,104.83,429803]
[null,null,null,4101,104.83,429907.83]
[null,null,null,4102,104.83,430012.66]
[null,null,null,4103,104.83,430117.49]
[null,null,null,4104,104.83,430222.32]
[null,null,null,4105,104.83,430327.14999999997]
[null,null,null,4106,104.83,430431.98]
[null,null,null,4107,104.83,430536.81]
[null,null,null,4108,104.83,430641.64]
[null,null,null,4109,104.83,430746.47]
[null,null,null,4110,104.83,430851.3]
[null,null,null,4111,104.83,430956.13]
[null,null,null,4112,104.83,431060.96]
[null,null,null,4113,{"$f":"$E$13","v":104.83},431165.79]
[null,null,null,4114,104.83,431270.62]
[null,null,null,4115,104.83,431375.45]
[null,null,null,4116,104.83,431480.27999999997]
[null,null,null,4117,104.83,431585.11]
[null,null,null,4118,104.83,431689.94]
[null,null,null,4119,104.83,431794.77]
[null,null,null,4120,104.83,431899.6]
[null,null,null,4121,104.83,432004.43]
[null,null,null,4122,104.83,432109.26]
[null,null,null,4123,104.83,432214.08999999997]
[null,null,null,4124,104.83,432318.92]
[null,null,null,4125,104.83,432423.75]
[null,null,null,4126,104.83,432528.58]
[null,null,null,4127,104.83,432633.41]
[null,null,null,4128,104.83,432738.24]
[null,null,null,4129,104.83,432843.07]
[null,null,null,4130,104.83,432947.89999999997]
[null,null,null,4131,104.83,433052.73]
[null,null,null,4132,104.83,{"$f":"E4149*D4149","v":433157.56}]
[null,null,null,4133,104.83,433262.39]
[null,null,null,4134,104.83,433367.22]
[null,null,null,4135,104.83,433472.05]
[null,null,null,4136,104.83,433576.88]
[null,null,null,4137,104.83,433681.71]
[null,null,null,4138,104.83,433786.54]
[null,null,null,4139,104.83,433891.37]
[null,null,null,4140,104.83,433996.2]
[null,null,null,4141,104.83,434101.02999999997]
[null,null,null,4142,104.83,434205.86]
[null,null,null,4143,104.83,434310.69]
[null,null,null,4144,104.83,434415.52]
[null,null,null,4145,104.83,434520.35]
[null,null,null,4146,104.83,434625.18]
[null,null,null,4147,104.83,434730.01]
[null,null,null,4148,104.83,434834.83999999997]
[null,null,null,4149,104.83,434939.67]
[null,null,null,4150,104.83,435044.5]
[null,null,null,4151,104.83,435149.33]
[null,null,null,4152,104.83,435254.16]
[null,null,null,4153,104.83,435358.99]
[null,null,null,4154,104.83,435463.82]
[null,null,null,4155,104.83,435568.64999999997]
[null,null,null,4156,104.83,435673.48]
[null,null,null,4157,104.83,435778.31]
[null,null,null,4158,104.83,435883.14]
[null,null,null,4159,104.83,435987.97]
[null,null,null,4160,104.83,436092.8]
[null,null,null,4161,104.83,436197.63]
[null,null,null,4162,104.83,436302.46]
[null,null,null,4163,104.83,436407.29]
[null,null,null,4164,104.83,436512.12]
[null,null,null,4165,104.83,436616.95]
[null,null,null,4166,104.83,436721.77999999997]
[null,null,null,4167,104.83,436826.61]
[null,null,null,4168,104.83,436931.44]
[null,null,null,4169,104.83,437036.27]
[null,null,null,4170,104.83,437141.1]
[null,null,null,4171,104.83,437245.93]
[null,null,null,4172,104.83,437350.76]
[null,null,null,4173,104.83,437455.58999999997]
[null,null,null,4174,104.83,437560.42]
[null,null,null,4175,104.83,437665.25]
[null,null,null,4176,104.83,437770.08]
[null,null,null,4177,{"$f":"$E$13","v":104.83},437874.91]
[null,null,null,4178,104.83,437979.74]
[null,null,null,4179,104.83,438084.57]
[null,null,null,4180,104.83,438189.39999999997]
[null,null,null,4181,104.83,438294.23]
[null,null,null,4182,104.83,438399.06]
[null,null,null,4183,104.83,438503.89]
[null,null,null,4184,104.83,438608.72]
[null,null,null,4185,104.83,438713.55]
[null,null,null,4186,104.83,438818.38]
[null,null,null,4187,104.83,438923.21]
[null,null,null,4188,104.83,439028.04]
[null,null,null,4189,104.83,439132.87]
[null,null,null,4190,104.83,439237.7]
[null,null,null,4191,104.83,439342.52999999997]
[null,null,null,4192,104.83,439447.36]
[null,null,null,4193,104.83,439552.19]
[null,null,null,4194,104.83,439657.02]
[null,null,null,4195,104.83,439761.85]
[null,null,null,4196,104.83,{"$f":"E4213*D4213","v":439866.68}]
[null,null,null,4197,104.83,439971.51]
[null,null,null,4198,104.83,440076.33999999997]
[null,null,null,4199,104.83,440181.17]
[null,null,null,4200,104.83,440286]
[null,null,null,4201,104.83,440390.83]
[null,null,null,4202,104.83,440495.66]
[null,null,null,4203,104.83,440600.49]
[null,null,null,4204,104.83,440705.32]
[null,null,null,4205,104.83,440810.14999999997]
[null,null,null,4206,104.83,440914.98]
[null,null,null,4207,104.83,441019.81]
[null,null,null,4208,104.83,441124.64]
[null,null,null,4209,104.83,441229.47]
[null,null,null,4210,104.83,441334.3]
[null,null,null,4211,104.83,441439.13]
[null,null,null,4212,104.83,441543.96]
[null,null,null,4213,104.83,441648.79]
[null,null,null,4214,104.83,441753.62]
[null,null,null,4215,104.83,441858.45]
[null,null,null,4216,104.83,441963.27999999997]
[null,null,null,4217,104.83,442068.11]
[null,null,null,4218,104.83,442172.94]
[null,null,null,4219,104.83,442277.77]
[null,null,null,4220,104.83,442382.6]
[null,null,null,4221,104.83,442487.43]
[null,null,null,4222,104.83,442592.26]
[null,null,null,4223,104.83,442697.08999999997]
[null,null,null,4224,104.83,442801.91999999998]
[null,null,null,4225,104.83,442906.75]
[null,null,null,4226,104.83,443011.58]
[null,null,null,4227,104.83,443116.41]
[null,null,null,4228,104.83,443221.24]
[null,null,null,4229,104.83,443326.07]
[null,null,null,4230,104.83,443430.89999999997]
[null,null,null,4231,104.83,443535.73]
[null,null,null,4232,104.83,443640.56]
[null,null,null,4233,104.83,443745.39]
[null,null,null,4234,104.83,443850.22]
[null,null,null,4235,104.83,443955.05]
[null,null,null,4236,104.83,444059.88]
[null,null,null,4237,104.83,444164.71]
[null,null,null,4238,104.83,444269.54]
[null,null,null,4239,104.83,444374.37]
[null,null,null,4240,104.83,444479.2]
[null,null,null,4241,{"$f":"$E$13","v":104.83},444584.02999999997]
[null,null,null,4242,104.83,444688.86]
[null,null,null,4243,104.83,444793.69]
[null,null,null,4244,104.83,444898.52]
[null,null,null,4245,104.83,445003.35]
[null,null,null,4246,104.83,445108.18]
[null,null,null,4247,104.83,445213.01]
[null,null,null,4248,104.83,445317.83999999997]
[null,null,null,4249,104.83,445422.67]
[null,null,null,4250,104.83,445527.5]
[null,null,null,4251,104.83,445632.33]
[null,null,null,4252,104.83,445737.16]
[null,null,null,4253,104.83,445841.99]
[null,null,null,4254,104.83,445946.82]
[null,null,null,4255,104.83,446051.64999999997]
[null,null,null,4256,104.83,446156.48]
[null,null,null,4257,104.83,446261.31]
[null,null,null,4258,104.83,446366.14]
[null,null,null,4259,104.83,446470.97]
[null,null,null,4260,104.83,{"$f":"E4277*D4277","v":446575.8}]
[null,null,null,4261,104.83,446680.63]
[null,null,null,4262,104.83,446785.46]
[null,null,null,4263,104.83,446890.29]
[null,null,null,4264,104.83,446995.12]
[null,null,null,4265,104.83,447099.95]
[null,null,null,4266,104.83,447204.77999999997]
[null,null,null,4267,104.83,447309.61]
[null,null,null,4268,104.83,447414.44]
[null,null,null,4269,104.83,447519.27]
[null,null,null,4270,104.83,447624.1]
[null,null,null,4271,104.83,447728.93]
[null,null,null,4272,104.83,447833.76]
[null,null,null,4273,104.83,447938.58999999997]
[null,null,null,4274,104.83,448043.42]
[null,null,null,4275,104.83,448148.25]
[null,null,null,4276,104.83,448253.08]
[null,null,null,4277,104.83,448357.91]
[null,null,null,4278,104.83,448462.74]
[null,null,null,4279,104.83,448567.57]
[null,null,null,4280,104.83,448672.39999999997]
[null,null,null,4281,104.83,448777.23]
[null,null,null,4282,104.83,448882.06]
[null,null,null,4283,104.83,448986.89]
[null,null,null,4284,104.83,449091.72]
[null,null,null,4285,104.83,449196.55]
[null,null,null,4286,104.83,449301.38]
[null,null,null,4287,104.83,449406.21]
[null,null,null,4288,104.83,449511.04]
[null,null,null,4289,104.83,449615.87]
[null,null,null,4290,104.83,449720.7]
[null,null,null,4291,104.83,449825.52999999997]
[null,null,null,4292,104.83,449930.36]
[null,null,null,4293,104.83,450035.19]
[null,null,null,4294,104.83,450140.02]
[null,null,null,4295,104.83,450244.85]
[null,null,null,4296,104.83,450349.68]
[null,null,null,4297,104.83,450454.51]
[null,null,null,4298,104.83,450559.33999999997]
[null,null,null,4299,104.83,450664.17]
[null,null,null,4300,104.83,450769]
[null,null,null,4301,104.83,450873.83]
[null,null,null,4302,104.83,450978.66]
[null,null,null,4303,104.83,451083.49]
[null,null,null,4304,104.83,451188.32]
[null,null,null,4305,{"$f":"$E$13","v":104.83},451293.14999999997]
[null,null,null,4306,104.83,451397.98]
[null,null,null,4307,104.83,451502.81]
[null,null,null,4308,104.83,451607.64]
[null,null,null,4309,104.83,451712.47]
[null,null,null,4310,104.83,451817.3]
[null,null,null,4311,104.83,451922.13]
[null,null,null,4312,104.83,452026.96]
[null,null,null,4313,104.83,452131.79]
[null,null,null,4314,104.83,452236.62]
[null,null,null,4315,104.83,452341.45]
[null,null,null,4316,104.83,452446.27999999997]
[null,null,null,4317,104.83,452551.11]
[null,null,null,4318,104.83,452655.94]
[null,null,null,4319,104.83,452760.77]
[null,null,null,4320,104.83,452865.6]
[null,null,null,4321,104.83,452970.43]
[null,null,null,4322,104.83,453075.26]
[null,null,null,4323,104.83,453180.08999999997]
[null,null,null,4324,104.83,{"$f":"E4341*D4341","v":453284.92}]
[null,null,null,4325,104.83,453389.75]
[null,null,null,4326,104.83,453494.58]
[null,null,null,4327,104.83,453599.41]
[null,null,null,4328,104.83,453704.24]
[null,null,null,4329,104.83,453809.07]
[null,null,null,4330,104.83,453913.89999999997]
[null,null,null,4331,104.83,454018.73]
[null,null,null,4332,104.83,454123.56]
[null,null,null,4333,104.83,454228.39]
[null,null,null,4334,104.83,454333.22]
[null,null,null,4335,104.83,454438.05]
[null,null,null,4336,104.83,454542.88]
[null,null,null,4337,104.83,454647.71]
[null,null,null,4338,104.83,454752.54]
[null,null,null,4339,104.83,454857.37]
[null,null,null,4340,104.83,454962.2]
[null,null,null,4341,104.83,455067.02999999997]
[null,null,null,4342,104.83,455171.86]
[null,null,null,4343,104.83,455276.69]
[null,null,null,4344,104.83,455381.52]
[null,null,null,4345,104.83,455486.35]
[null,null,null,4346,104.83,455591.18]
[null,null,null,4347,104.83,455696.01]
[null,null,null,4348,104.83,455800.83999999997]
[null,null,null,4349,104.83,455905.67]
[null,null,null,4350,104.83,456010.5]
[null,null,null,4351,104.83,456115.33]
[null,null,null,4352,104.83,456220.15999999997]
[null,null,null,4353,104.83,456324.99]
[null,null,null,4354,104.83,456429.82]
[null,null,null,4355,104.83,456534.64999999997]
[null,null,null,4356,104.83,456639.48]
[null,null,null,4357,104.83,456744.31]
[null,null,null,4358,104.83,456849.14]
[null,null,null,4359,104.83,456953.97]
[null,null,null,4360,104.83,457058.8]
[null,null,null,4361,104.83,457163.63]
[null,null,null,4362,104.83,457268.46]
[null,null,null,4363,104.83,457373.29]
[null,null,null,4364,104.83,457478.12]
[null,null,null,4365,104.83,457582.95]
[null,null,null,4366,104.83,457687.77999999997]
[null,null,null,4367,104.83,457792.61]
[null,null,null,4368,104.83,457897.44]
[null,null,null,4369,{"$f":"$E$13","v":104.83},458002.27]
[null,null,null,4370,104.83,458107.1]
[null,null,null,4371,104.83,458211.93]
[null,null,null,4372,104.83,458316.76]
[null,null,null,4373,104.83,458421.58999999997]
[null,null,null,4374,104.83,458526.42]
[null,null,null,4375,104.83,458631.25]
[null,null,null,4376,104.83,458736.08]
[null,null,null,4377,104.83,458840.91]
[null,null,null,4378,104.83,458945.74]
[null,null,null,4379,104.83,459050.57]
[null,null,null,4380,104.83,459155.39999999997]
[null,null,null,4381,104.83,459260.23]
[null,null,null,4382,104.83,459365.06]
[null,null,null,4383,104.83,459469.89]
[null,null,null,4384,104.83,459574.72]
[null,null,null,4385,104.83,459679.55]
[null,null,null,4386,104.83,459784.38]
[null,null,null,4387,104.83,459889.21]
[null,null,null,4388,104.83,{"$f":"E4405*D4405","v":459994.04}]
[null,null,null,4389,104.83,460098.87]
[null,null,null,4390,104.83,460203.7]
[null,null,null,4391,104.83,460308.52999999997]
[null,null,null,4392,104.83,460413.36]
[null,null,null,4393,104.83,460518.19]
[null,null,null,4394,104.83,460623.02]
[null,null,null,4395,104.83,460727.85]
[null,null,null,4396,104.83,460832.68]
[null,null,null,4397,104.83,460937.51]
[null,null,null,4398,104.83,461042.33999999997]
[null,null,null,4399,104.83,461147.17]
[null,null,null,4400,104.83,461252]
[null,null,null,4401,104.83,461356.83]
[null,null,null,4402,104.83,461461.66]
[null,null,null,4403,104.83,461566.49]
[null,null,null,4404,104.83,461671.32]
[null,null,null,4405,104.83,461776.14999999997]
[null,null,null,4406,104.83,461880.98]
[null,null,null,4407,104.83,461985.81]
[null,null,null,4408,104.83,462090.64]
[null,null,null,4409,104.83,462195.47]
[null,null,null,4410,104.83,462300.3]
[null,null,null,4411,104.83,462405.13]
[null,null,null,4412,104.83,462509.96]
[null,null,null,4413,104.83,462614.79]
[null,null,null,4414,104.83,462719.62]
[null,null,null,4415,104.83,462824.45]
[null,null,null,4416,104.83,462929.27999999997]
[null,null,null,4417,104.83,463034.11]
[null,null,null,4418,104.83,463138.94]
[null,null,null,4419,104.83,463243.77]
[null,null,null,4420,104.83,463348.6]
[null,null,null,4421,104.83,463453.43]
[null,null,null,4422,104.83,463558.26]
[null,null,null,4423,104.83,463663.08999999997]
[null,null,null,4424,104.83,463767.92]
[null,null,null,4425,104.83,463872.75]
[null,null,null,4426,104.83,463977.58]
[null,null,null,4427,104.83,464082.41]
[null,null,null,4428,104.83,464187.24]
[null,null,null,4429,104.83,464292.07]
[null,null,null,4430,104.83,464396.89999999997]
[null,null,null,4431,104.83,464501.73]
[null,null,null,4432,104.83,464606.56]
[null,null,null,4433,{"$f":"$E$13","v":104.83},464711.39]
[null,null,null,4434,104.83,464816.22]
[null,null,null,4435,104.83,464921.05]
[null,null,null,4436,104.83,465025.88]
[null,null,null,4437,104.83,465130.71]
[null,null,null,4438,104.83,465235.54]
[null,null,null,4439,104.83,465340.37]
[null,null,null,4440,104.83,465445.2]
[null,null,null,4441,104.83,465550.02999999997]
[null,null,null,4442,104.83,465654.86]
[null,null,null,4443,104.83,465759.69]
[null,null,null,4444,104.83,465864.52]
[null,null,null,4445,104.83,465969.35]
[null,null,null,4446,104.83,466074.18]
[null,null,null,4447,104.83,466179.01]
[null,null,null,4448,104.83,466283.83999999997]
[null,null,null,4449,104.83,466388.67]
[null,null,null,4450,104.83,466493.5]
[null,null,null,4451,104.83,466598.33]
[null,null,null,4452,104.83,{"$f":"E4469*D4469","v":466703.16}]
[null,null,null,4453,104.83,466807.99]
[null,null,null,4454,104.83,466912.82]
[null,null,null,4455,104.83,467017.64999999997]
[null,null,null,4456,104.83,467122.48]
[null,null,null,4457,104.83,467227.31]
[null,null,null,4458,104.83,467332.14]
[null,null,null,4459,104.83,467436.97]
[null,null,null,4460,104.83,467541.8]
[null,null,null,4461,104.83,467646.63]
[null,null,null,4462,104.83,467751.46]
[null,null,null,4463,104.83,467856.29]
[null,null,null,4464,104.83,467961.12]
[null,null,null,4465,104.83,468065.95]
[null,null,null,4466,104.83,468170.77999999997]
[null,null,null,4467,104.83,468275.61]
[null,null,null,4468,104.83,468380.44]
[null,null,null,4469,104.83,468485.27]
[null,null,null,4470,104.83,468590.1]
[null,null,null,4471,104.83,468694.93]
[null,null,null,4472,104.83,468799.76]
[null,null,null,4473,104.83,468904.58999999997]
[null,null,null,4474,104.83,469009.42]
[null,null,null,4475,104.83,469114.25]
[null,null,null,4476,104.83,469219.08]
[null,null,null,4477,104.83,469323.91]
[null,null,null,4478,104.83,469428.74]
[null,null,null,4479,104.83,469533.57]
[null,null,null,4480,104.83,469638.39999999997]
[null,null,null,4481,104.83,469743.23]
[null,null,null,4482,104.83,469848.06]
[null,null,null,4483,104.83,469952.89]
[null,null,null,4484,104.83,470057.72]
[null,null,null,4485,104.83,470162.55]
[null,null,null,4486,104.83,470267.38]
[null,null,null,4487,104.83,470372.21]
[null,null,null,4488,104.83,470477.04]
[null,null,null,4489,104.83,470581.87]
[null,null,null,4490,104.83,470686.7]
[null,null,null,4491,104.83,470791.52999999997]
[null,null,null,4492,104.83,470896.36]
[null,null,null,4493,104.83,471001.19]
[null,null,null,4494,104.83,471106.02]
[null,null,null,4495,104.83,471210.85]
[null,null,null,4496,104.83,471315.68]
[null,null,null,4497,{"$f":"$E$13","v":104.83},471420.51]
[null,null,null,4498,104.83,471525.33999999997]
[null,null,null,4499,104.83,471630.17]
[null,null,null,4500,104.83,471735]
[null,null,null,4501,104.83,471839.83]
[null,null,null,4502,104.83,471944.66]
[null,null,null,4503,104.83,472049.49]
[null,null,null,4504,104.83,472154.32]
[null,null,null,4505,104.83,472259.14999999997]
[null,null,null,4506,104.83,472363.98]
[null,null,null,4507,104.83,472468.81]
[null,null,null,4508,104.83,472573.64]
[null,null,null,4509,104.83,472678.47]
[null,null,null,4510,104.83,472783.3]
[null,null,null,4511,104.83,472888.13]
[null,null,null,4512,104.83,472992.96]
[null,null,null,4513,104.83,473097.79]
[null,null,null,4514,104.83,473202.62]
[null,null,null,4515,104.83,473307.45]
[null,null,null,4516,104.83,{"$f":"E4533*D4533","v":473412.27999999997}]
[null,null,null,4517,104.83,473517.11]
[null,null,null,4518,104.83,473621.94]
[null,null,null,4519,104.83,473726.77]
[null,null,null,4520,104.83,473831.6]
[null,null,null,4521,104.83,473936.43]
[null,null,null,4522,104.83,474041.26]
[null,null,null,4523,104.83,474146.08999999997]
[null,null,null,4524,104.83,474250.92]
[null,null,null,4525,104.83,474355.75]
[null,null,null,4526,104.83,474460.58]
[null,null,null,4527,104.83,474565.41]
[null,null,null,4528,104.83,474670.24]
[null,null,null,4529,104.83,474775.07]
[null,null,null,4530,104.83,474879.89999999997]
[null,null,null,4531,104.83,474984.73]
[null,null,null,4532,104.83,475089.56]
[null,null,null,4533,104.83,475194.39]
[null,null,null,4534,104.83,475299.22]
[null,null,null,4535,104.83,475404.05]
[null,null,null,4536,104.83,475508.88]
[null,null,null,4537,104.83,475613.71]
[null,null,null,4538,104.83,475718.54]
[null,null,null,4539,104.83,475823.37]
[null,null,null,4540,104.83,475928.2]
[null,null,null,4541,104.83,476033.02999999997]
[null,null,null,4542,104.83,476137.86]
[null,null,null,4543,104.83,476242.69]
[null,null,null,4544,104.83,476347.52]
[null,null,null,4545,104.83,476452.35]
[null,null,null,4546,104.83,476557.18]
[null,null,null,4547,104.83,476662.01]
[null,null,null,4548,104.83,476766.83999999997]
[null,null,null,4549,104.83,476871.67]
[null,null,null,4550,104.83,476976.5]
[null,null,null,4551,104.83,477081.33]
[null,null,null,4552,104.83,477186.16]
[null,null,null,4553,104.83,477290.99]
[null,null,null,4554,104.83,477395.82]
[null,null,null,4555,104.83,477500.64999999997]
[null,null,null,4556,104.83,477605.48]
[null,null,null,4557,104.83,477710.31]
[null,null,null,4558,104.83,477815.14]
[null,null,null,4559,104.83,477919.97]
[null,null,null,4560,104.83,478024.8]
[null,null,null,4561,{"$f":"$E$13","v":104.83},478129.63]
[null,null,null,4562,104.83,478234.46]
[null,null,null,4563,104.83,478339.29]
[null,null,null,4564,104.83,478444.12]
[null,null,null,4565,104.83,478548.95]
[null,null,null,4566,104.83,478653.77999999997]
[null,null,null,4567,104.83,478758.61]
[null,null,null,4568,104.83,478863.44]
[null,null,null,4569,104.83,478968.27]
[null,null,null,4570,104.83,479073.1]
[null,null,null,4571,104.83,479177.93]
[null,null,null,4572,104.83,479282.76]
[null,null,null,4573,104.83,479387.58999999997]
[null,null,null,4574,104.83,479492.42]
[null,null,null,4575,104.83,479597.25]
[null,null,null,4576,104.83,479702.08]
[null,null,null,4577,104.83,479806.91]
[null,null,null,4578,104.83,479911.74]
[null,null,null,4579,104.83,480016.57]
[null,null,null,4580,104.83,{"$f":"E4597*D4597","v":480121.39999999997}]
[null,null,null,4581,104.83,480226.23]
[null,null,null,4582,104.83,480331.06]
[null,null,null,4583,104.83,480435.89]
[null,null,null,4584,104.83,480540.72]
[null,null,null,4585,104.83,480645.55]
[null,null,null,4586,104.83,480750.38]
[null,null,null,4587,104.83,480855.21]
[null,null,null,4588,104.83,480960.04]
[null,null,null,4589,104.83,481064.87]
[null,null,null,4590,104.83,481169.7]
[null,null,null,4591,104.83,481274.52999999997]
[null,null,null,4592,104.83,481379.36]
[null,null,null,4593,104.83,481484.19]
[null,null,null,4594,104.83,481589.02]
[null,null,null,4595,104.83,481693.85]
[null,null,null,4596,104.83,481798.68]
[null,null,null,4597,104.83,481903.51]
[null,null,null,4598,104.83,482008.33999999997]
[null,null,null,4599,104.83,482113.17]
[null,null,null,4600,104.83,482218]
[null,null,null,4601,104.83,482322.83]
[null,null,null,4602,104.83,482427.66]
[null,null,null,4603,104.83,482532.49]
[null,null,null,4604,104.83,482637.32]
[null,null,null,4605,104.83,482742.14999999997]
[null,null,null,4606,104.83,482846.98]
[null,null,null,4607,104.83,482951.81]
[null,null,null,4608,104.83,483056.64000000001]
[null,null,null,4609,104.83,483161.47]
[null,null,null,4610,104.83,483266.3]
[null,null,null,4611,104.83,483371.13]
[null,null,null,4612,104.83,483475.96]
[null,null,null,4613,104.83,483580.79]
[null,null,null,4614,104.83,483685.62]
[null,null,null,4615,104.83,483790.45]
[null,null,null,4616,104.83,483895.27999999997]
[null,null,null,4617,104.83,484000.11]
[null,null,null,4618,104.83,484104.94]
[null,null,null,4619,104.83,484209.77]
[null,null,null,4620,104.83,484314.6]
[null,null,null,4621,104.83,484419.43]
[null,null,null,4622,104.83,484524.26]
[null,null,null,4623,104.83,484629.08999999997]
[null,null,null,4624,104.83,484733.92]
[null,null,null,4625,{"$f":"$E$13","v":104.83},484838.75]
[null,null,null,4626,104.83,484943.58]
[null,null,null,4627,104.83,485048.41]
[null,null,null,4628,104.83,485153.24]
[null,null,null,4629,104.83,485258.07]
[null,null,null,4630,104.83,485362.89999999997]
[null,null,null,4631,104.83,485467.73]
[null,null,null,4632,104.83,485572.56]
[null,null,null,4633,104.83,485677.39]
[null,null,null,4634,104.83,485782.22]
[null,null,null,4635,104.83,485887.05]
[null,null,null,4636,104.83,485991.88]
[null,null,null,4637,104.83,486096.71]
[null,null,null,4638,104.83,486201.54]
[null,null,null,4639,104.83,486306.37]
[null,null,null,4640,104.83,486411.2]
[null,null,null,4641,104.83,486516.02999999997]
[null,null,null,4642,104.83,486620.86]
[null,null,null,4643,104.83,486725.69]
[null,null,null,4644,104.83,{"$f":"E4661*D4661","v":486830.52}]
[null,null,null,4645,104.83,486935.35]
[null,null,null,4646,104.83,487040.18]
[null,null,null,4647,104.83,487145.01]
[null,null,null,4648,104.83,487249.83999999997]
[null,null,null,4649,104.83,487354.67]
[null,null,null,4650,104.83,487459.5]
[null,null,null,4651,104.83,487564.33]
[null,null,null,4652,104.83,487669.16]
[null,null,null,4653,104.83,487773.99]
[null,null,null,4654,104.83,487878.82]
[null,null,null,4655,104.83,487983.64999999997]
[null,null,null,4656,104.83,488088.48]
[null,null,null,4657,104.83,488193.31]
[null,null,null,4658,104.83,488298.14]
[null,null,null,4659,104.83,488402.97]
[null,null,null,4660,104.83,488507.8]
[null,null,null,4661,104.83,488612.63]
[null,null,null,4662,104.83,488717.46]
[null,null,null,4663,104.83,488822.29]
[null,null,null,4664,104.83,488927.12]
[null,null,null,4665,104.83,489031.95]
[null,null,null,4666,104.83,489136.77999999997]
[null,null,null,4667,104.83,489241.61]
[null,null,null,4668,104.83,489346.44]
[null,null,null,4669,104.83,489451.27]
[null,null,null,4670,104.83,489556.1]
[null,null,null,4671,104.83,489660.93]
[null,null,null,4672,104.83,489765.76]
[null,null,null,4673,104.83,489870.58999999997]
[null,null,null,4674,104.83,489975.42]
[null,null,null,4675,104.83,490080.25]
[null,null,null,4676,104.83,490185.08]
[null,null,null,4677,104.83,490289.91]
[null,null,null,4678,104.83,490394.74]
[null,null,null,4679,104.83,490499.57]
[null,null,null,4680,104.83,490604.39999999997]
[null,null,null,4681,104.83,490709.23]
[null,null,null,4682,104.83,490814.06]
[null,null,null,4683,104.83,490918.89]
[null,null,null,4684,104.83,491023.72]
[null,null,null,4685,104.83,491128.55]
[null,null,null,4686,104.83,491233.38]
[null,null,null,4687,104.83,491338.21]
[null,null,null,4688,104.83,491443.04]
[null,null,null,4689,{"$f":"$E$13","v":104.83},491547.87]
[null,null,null,4690,104.83,491652.7]
[null,null,null,4691,104.83,491757.52999999997]
[null,null,null,4692,104.83,491862.36]
[null,null,null,4693,104.83,491967.19]
[null,null,null,4694,104.83,492072.02]
[null,null,null,4695,104.83,492176.85]
[null,null,null,4696,104.83,492281.68]
[null,null,null,4697,104.83,492386.51]
[null,null,null,4698,104.83,492491.33999999997]
[null,null,null,4699,104.83,492596.17]
[null,null,null,4700,104.83,492701]
[null,null,null,4701,104.83,492805.83]
[null,null,null,4702,104.83,492910.66]
[null,null,null,4703,104.83,493015.49]
[null,null,null,4704,104.83,493120.32]
[null,null,null,4705,104.83,493225.14999999997]
[null,null,null,4706,104.83,493329.98]
[null,null,null,4707,104.83,493434.81]
[null,null,null,4708,104.83,{"$f":"E4725*D4725","v":493539.64}]
[null,null,null,4709,104.83,493644.47]
[null,null,null,4710,104.83,493749.3]
[null,null,null,4711,104.83,493854.13]
[null,null,null,4712,104.83,493958.96]
[null,null,null,4713,104.83,494063.79]
[null,null,null,4714,104.83,494168.62]
[null,null,null,4715,104.83,494273.45]
[null,null,null,4716,104.83,494378.27999999997]
[null,null,null,4717,104.83,494483.11]
[null,null,null,4718,104.83,494587.94]
[null,null,null,4719,104.83,494692.77]
[null,null,null,4720,104.83,494797.6]
[null,null,null,4721,104.83,494902.43]
[null,null,null,4722,104.83,495007.26]
[null,null,null,4723,104.83,495112.08999999997]
[null,null,null,4724,104.83,495216.92]
[null,null,null,4725,104.83,495321.75]
[null,null,null,4726,104.83,495426.58]
[null,null,null,4727,104.83,495531.41]
[null,null,null,4728,104.83,495636.24]
[null,null,null,4729,104.83,495741.07]
[null,null,null,4730,104.83,495845.89999999997]
[null,null,null,4731,104.83,495950.73]
[null,null,null,4732,104.83,496055.56]
[null,null,null,4733,104.83,496160.39]
[null,null,null,4734,104.83,496265.22]
[null,null,null,4735,104.83,496370.05]
[null,null,null,4736,104.83,496474.88]
[null,null,null,4737,104.83,496579.71]
[null,null,null,4738,104.83,496684.54]
[null,null,null,4739,104.83,496789.37]
[null,null,null,4740,104.83,496894.2]
[null,null,null,4741,104.83,496999.02999999997]
[null,null,null,4742,104.83,497103.86]
[null,null,null,4743,104.83,497208.69]
[null,null,null,4744,104.83,497313.52]
[null,null,null,4745,104.83,497418.35]
[null,null,null,4746,104.83,497523.18]
[null,null,null,4747,104.83,497628.01]
[null,null,null,4748,104.83,497732.83999999997]
[null,null,null,4749,104.83,497837.67]
[null,null,null,4750,104.83,497942.5]
[null,null,null,4751,104.83,498047.33]
[null,null,null,4752,104.83,498152.16]
[null,null,null,4753,{"$f":"$E$13","v":104.83},498256.99]
[null,null,null,4754,104.83,498361.82]
[null,null,null,4755,104.83,498466.64999999997]
[null,null,null,4756,104.83,498571.48]
[null,null,null,4757,104.83,498676.31]
[null,null,null,4758,104.83,498781.14]
[null,null,null,4759,104.83,498885.97]
[null,null,null,4760,104.83,498990.8]
[null,null,null,4761,104.83,499095.63]
[null,null,null,4762,104.83,499200.46]
[null,null,null,4763,104.83,499305.29]
[null,null,null,4764,104.83,499410.12]
[null,null,null,4765,104.83,499514.95]
[null,null,null,4766,104.83,499619.77999999997]
[null,null,null,4767,104.83,499724.61]
[null,null,null,4768,104.83,499829.44]
[null,null,null,4769,104.83,499934.27]
[null,null,null,4770,104.83,500039.1]
[null,null,null,4771,104.83,500143.93]
[null,null,null,4772,104.83,{"$f":"E4789*D4789","v":500248.76}]
[null,null,null,4773,104.83,500353.58999999997]
[null,null,null,4774,104.83,500458.42]
[null,null,null,4775,104.83,500563.25]
[null,null,null,4776,104.83,500668.08]
[null,null,null,4777,104.83,500772.91]
[null,null,null,4778,104.83,500877.74]
[null,null,null,4779,104.83,500982.57]
[null,null,null,4780,104.83,501087.39999999997]
[null,null,null,4781,104.83,501192.23]
[null,null,null,4782,104.83,501297.06]
[null,null,null,4783,104.83,501401.89]
[null,null,null,4784,104.83,501506.72]
[null,null,null,4785,104.83,501611.55]
[null,null,null,4786,104.83,501716.38]
[null,null,null,4787,104.83,501821.20999999996]
[null,null,null,4788,104.83,501926.04]
[null,null,null,4789,104.83,502030.87]
[null,null,null,4790,104.83,502135.7]
[null,null,null,4791,104.83,502240.52999999997]
[null,null,null,4792,104.83,502345.36]
[null,null,null,4793,104.83,502450.19]
[null,null,null,4794,104.83,502555.02]
[null,null,null,4795,104.83,502659.85]
[null,null,null,4796,104.83,502764.68]
[null,null,null,4797,104.83,502869.51]
[null,null,null,4798,104.83,502974.33999999997]
[null,null,null,4799,104.83,503079.17]
[null,null,null,4800,104.83,503184]
[null,null,null,4801,104.83,503288.83]
[null,null,null,4802,104.83,503393.66]
[null,null,null,4803,104.83,503498.49]
[null,null,null,4804,104.83,503603.32]
[null,null,null,4805,104.83,503708.14999999997]
[null,null,null,4806,104.83,503812.98]
[null,null,null,4807,104.83,503917.81]
[null,null,null,4808,104.83,504022.64]
[null,null,null,4809,104.83,504127.47]
[null,null,null,4810,104.83,504232.3]
[null,null,null,4811,104.83,504337.13]
[null,null,null,4812,104.83,504441.95999999996]
[null,null,null,4813,104.83,504546.79]
[null,null,null,4814,104.83,504651.62]
[null,null,null,4815,104.83,504756.45]
[null,null,null,4816,104.83,504861.27999999997]
[null,null,null,4817,{"$f":"$E$13","v":104.83},504966.11]
[null,null,null,4818,104.83,505070.94]
[null,null,null,4819,104.83,505175.77]
[null,null,null,4820,104.83,505280.6]
[null,null,null,4821,104.83,505385.43]
[null,null,null,4822,104.83,505490.26]
[null,null,null,4823,104.83,505595.08999999997]
[null,null,null,4824,104.83,505699.92]
[null,null,null,4825,104.83,505804.75]
[null,null,null,4826,104.83,505909.58]
[null,null,null,4827,104.83,506014.41]
[null,null,null,4828,104.83,506119.24]
[null,null,null,4829,104.83,506224.07]
[null,null,null,4830,104.83,506328.89999999997]
[null,null,null,4831,104.83,506433.73]
[null,null,null,4832,104.83,506538.56]
[null,null,null,4833,104.83,506643.39]
[null,null,null,4834,104.83,506748.22]
[null,null,null,4835,104.83,506853.05]
[null,null,null,4836,104.83,{"$f":"E4853*D4853","v":506957.88}]
[null,null,null,4837,104.83,507062.70999999996]
[null,null,null,4838,104.83,507167.54]
[null,null,null,4839,104.83,507272.37]
[null,null,null,4840,104.83,507377.2]
[null,null,null,4841,104.83,507482.02999999997]
[null,null,null,4842,104.83,507586.86]
[null,null,null,4843,104.83,507691.69]
[null,null,null,4844,104.83,507796.52]
[null,null,null,4845,104.83,507901.35]
[null,null,null,4846,104.83,508006.18]
[null,null,null,4847,104.83,508111.01]
[null,null,null,4848,104.83,508215.83999999997]
[null,null,null,4849,104.83,508320.67]
[null,null,null,4850,104.83,508425.5]
[null,null,null,4851,104.83,508530.33]
[null,null,null,4852,104.83,508635.16]
[null,null,null,4853,104.83,508739.99]
[null,null,null,4854,104.83,508844.82]
[null,null,null,4855,104.83,508949.64999999997]
[null,null,null,4856,104.83,509054.48]
[null,null,null,4857,104.83,509159.31]
[null,null,null,4858,104.83,509264.14]
[null,null,null,4859,104.83,509368.97]
[null,null,null,4860,104.83,509473.8]
[null,null,null,4861,104.83,509578.63]
[null,null,null,4862,104.83,509683.45999999996]
[null,null,null,4863,104.83,509788.29]
[null,null,null,4864,104.83,509893.12]
[null,null,null,4865,104.83,509997.95]
[null,null,null,4866,104.83,510102.77999999997]
[null,null,null,4867,104.83,510207.61]
[null,null,null,4868,104.83,510312.44]
[null,null,null,4869,104.83,510417.27]
[null,null,null,4870,104.83,510522.1]
[null,null,null,4871,104.83,510626.93]
[null,null,null,4872,104.83,510731.76]
[null,null,null,4873,104.83,510836.58999999997]
[null,null,null,4874,104.83,510941.42]
[null,null,null,4875,104.83,511046.25]
[null,null,null,4876,104.83,511151.08]
[null,null,null,4877,104.83,511255.91]
[null,null,null,4878,104.83,511360.74]
[null,null,null,4879,104.83,511465.57]
[null,null,null,4880,104.83,511570.39999999997]
[null,null,null,4881,{"$f":"$E$13","v":104.83},511675.23]
[null,null,null,4882,104.83,511780.06]
[null,null,null,4883,104.83,511884.89]
[null,null,null,4884,104.83,511989.72]
[null,null,null,4885,104.83,512094.55]
[null,null,null,4886,104.83,512199.38]
[null,null,null,4887,104.83,512304.20999999996]
[null,null,null,4888,104.83,512409.04]
[null,null,null,4889,104.83,512513.87]
[null,null,null,4890,104.83,512618.7]
[null,null,null,4891,104.83,512723.52999999997]
[null,null,null,4892,104.83,512828.36]
[null,null,null,4893,104.83,512933.19]
[null,null,null,4894,104.83,513038.02]
[null,null,null,4895,104.83,513142.85]
[null,null,null,4896,104.83,513247.68]
[null,null,null,4897,104.83,513352.51]
[null,null,null,4898,104.83,513457.33999999997]
[null,null,null,4899,104.83,513562.17]
[null,null,null,4900,104.83,{"$f":"E4917*D4917","v":513667}]
[null,null,null,4901,104.83,513771.83]
[null,null,null,4902,104.83,513876.66]
[null,null,null,4903,104.83,513981.49]
[null,null,null,4904,104.83,514086.32]
[null,null,null,4905,104.83,514191.14999999997]
[null,null,null,4906,104.83,514295.98]
[null,null,null,4907,104.83,514400.81]
[null,null,null,4908,104.83,514505.64]
[null,null,null,4909,104.83,514610.47]
[null,null,null,4910,104.83,514715.3]
[null,null,null,4911,104.83,514820.13]
[null,null,null,4912,104.83,514924.95999999996]
[null,null,null,4913,104.83,515029.79]
[null,null,null,4914,104.83,515134.62]
[null,null,null,4915,104.83,515239.45]
[null,null,null,4916,104.83,515344.27999999997]
[null,null,null,4917,104.83,515449.11]
[null,null,null,4918,104.83,515553.94]
[null,null,null,4919,104.83,515658.77]
[null,null,null,4920,104.83,515763.6]
[null,null,null,4921,104.83,515868.43]
[null,null,null,4922,104.83,515973.26]
[null,null,null,4923,104.83,516078.08999999997]
[null,null,null,4924,104.83,516182.92]
[null,null,null,4925,104.83,516287.75]
[null,null,null,4926,104.83,516392.58]
[null,null,null,4927,104.83,516497.41]
[null,null,null,4928,104.83,516602.24]
[null,null,null,4929,104.83,516707.07]
[null,null,null,4930,104.83,516811.89999999997]
[null,null,null,4931,104.83,516916.73]
[null,null,null,4932,104.83,517021.56]
[null,null,null,4933,104.83,517126.39]
[null,null,null,4934,104.83,517231.22]
[null,null,null,4935,104.83,517336.05]
[null,null,null,4936,104.83,517440.88]
[null,null,null,4937,104.83,517545.70999999996]
[null,null,null,4938,104.83,517650.54]
[null,null,null,4939,104.83,517755.37]
[null,null,null,4940,104.83,517860.2]
[null,null,null,4941,104.83,517965.02999999997]
[null,null,null,4942,104.83,518069.86]
[null,null,null,4943,104.83,518174.69]
[null,null,null,4944,104.83,518279.52]
[null,null,null,4945,{"$f":"$E$13","v":104.83},518384.35]
[null,null,null,4946,104.83,518489.18]
[null,null,null,4947,104.83,518594.01]
[null,null,null,4948,104.83,518698.83999999997]
[null,null,null,4949,104.83,518803.67]
[null,null,null,4950,104.83,518908.5]
[null,null,null,4951,104.83,519013.33]
[null,null,null,4952,104.83,519118.16]
[null,null,null,4953,104.83,519222.99]
[null,null,null,4954,104.83,519327.82]
[null,null,null,4955,104.83,519432.64999999997]
[null,null,null,4956,104.83,519537.48]
[null,null,null,4957,104.83,519642.31]
[null,null,null,4958,104.83,519747.14]
[null,null,null,4959,104.83,519851.97]
[null,null,null,4960,104.83,519956.8]
[null,null,null,4961,104.83,520061.63]
[null,null,null,4962,104.83,520166.45999999996]
[null,null,null,4963,104.83,520271.29]
[null,null,null,4964,104.83,{"$f":"E4981*D4981","v":520376.12}]
[null,null,null,4965,104.83,520480.95]
[null,null,null,4966,104.83,520585.77999999997]
[null,null,null,4967,104.83,520690.61]
[null,null,null,4968,104.83,520795.44]
[null,null,null,4969,104.83,520900.27]
[null,null,null,4970,104.83,521005.1]
[null,null,null,4971,104.83,521109.93]
[null,null,null,4972,104.83,521214.76]
[null,null,null,4973,104.83,521319.58999999997]
[null,null,null,4974,104.83,521424.42]
[null,null,null,4975,104.83,521529.25]
[null,null,null,4976,104.83,521634.08]
[null,null,null,4977,104.83,521738.91]
[null,null,null,4978,104.83,521843.74]
[null,null,null,4979,104.83,521948.57]
[null,null,null,4980,104.83,522053.39999999997]
[null,null,null,4981,104.83,522158.23]
[null,null,null,4982,104.83,522263.06]
[null,null,null,4983,104.83,522367.89]
[null,null,null,4984,104.83,522472.72]
[null,null,null,4985,104.83,522577.55]
[null,null,null,4986,104.83,522682.38]
[null,null,null,4987,104.83,522787.20999999996]
[null,null,null,4988,104.83,522892.04]
[null,null,null,4989,104.83,522996.87]
[null,null,null,4990,104.83,523101.7]
[null,null,null,4991,104.83,523206.52999999997]
[null,null,null,4992,104.83,523311.35999999999]
[null,null,null,4993,104.83,523416.19]
[null,null,null,4994,104.83,523521.02]
[null,null,null,4995,104.83,523625.85]
[null,null,null,4996,104.83,523730.68]
[null,null,null,4997,104.83,523835.51]
[null,null,null,4998,104.83,523940.33999999997]
[null,null,null,4999,104.83,524045.17]
[null,null,null,5000,104.83,524150]
[]
[null,null,null,null,{"$f":"AVERAGE(E117:E5017)","v":113.92698632932576}]

{"sheet":"Print Sheets","index":23,"n_rows":10,"n_cols":7,"rows_kept":10,"cut":false,"hidden":false,"merged":[[9,6,12,12]]}
["Print Multiple Worksheets"]
[]
[]
[]
[]
[]
[]
[]
[]
[null,null,null,null,null,null,"Step 2 -Select the worksheets needing to be printed from the \n             ListBox on the left. You can select multiple worksheets \n             by holding down the CTRL key and left clicking on \n             the required worksheets."]

{"sheet":"Actions to correct","index":24,"n_rows":0,"n_cols":0,"rows_kept":0,"cut":false,"hidden":true,"merged":[]}